Hospital Service Area,Hospital County,Operating Certificate Number,Permanent Facility Id,Facility Name,Age Group,Zip Code - 3 digits,Gender,Race,Ethnicity,Length of Stay,Type of Admission,Patient Disposition,Discharge Year,CCS Diagnosis Code,CCS Diagnosis Description,CCS Procedure Code,CCS Procedure Description,APR DRG Code,APR DRG Description,APR MDC Code,APR MDC Description,APR Severity of Illness Code,APR Severity of Illness Description,APR Risk of Mortality,APR Medical Surgical Description,Payment Typology 1,Payment Typology 2,Payment Typology 3,Birth Weight,Abortion Edit Indicator,Emergency Department Indicator,Total Charges,Total Costs
Long Island,Nassau,2908000,000511,NYU Langone Hospital-Long Island,70 or Older,115,F,White,Not Span/Hispanic,2,Elective,Home or Self Care,2020,CIR003,NONRHEUMATIC AND UNSPECIFIED VALVE DISORDERS,CAR023,HEART VALVE REPLACEMENT AND OTHER VALVE PROCEDURES (ENDOVASCULAR),183,PERCUTANEOUS STRUCTURAL CARDIAC PROCEDURES,05,DISEASES AND DISORDERS OF THE CIRCULATORY SYSTEM,3,Major,Major,Surgical,Medicaid,,,,,N,421984.83,64335.8
Long Island,Nassau,2908000,000511,NYU Langone Hospital-Long Island,70 or Older,119,F,White,Not Span/Hispanic,7,Urgent,Home or Self Care,2020,CIR003,NONRHEUMATIC AND UNSPECIFIED VALVE DISORDERS,CAR023,HEART VALVE REPLACEMENT AND OTHER VALVE PROCEDURES (ENDOVASCULAR),183,PERCUTANEOUS STRUCTURAL CARDIAC PROCEDURES,05,DISEASES AND DISORDERS OF THE CIRCULATORY SYSTEM,2,Moderate,Moderate,Surgical,Medicare,Medicare,,,,N,578369.84,95264.83
Long Island,Nassau,2908000,000511,NYU Langone Hospital-Long Island,50 to 69,115,M,White,Not Span/Hispanic,1,Elective,Home or Self Care,2020,MAL001,CARDIAC AND CIRCULATORY CONGENITAL ANOMALIES,CAR023,HEART VALVE REPLACEMENT AND OTHER VALVE PROCEDURES (ENDOVASCULAR),183,PERCUTANEOUS STRUCTURAL CARDIAC PROCEDURES,05,DISEASES AND DISORDERS OF THE CIRCULATORY SYSTEM,2,Moderate,Moderate,Surgical,Private Health Insurance,Medicare,,,,N,434312.66,64938.24
Long Island,Nassau,2908000,000511,NYU Langone Hospital-Long Island,70 or Older,115,M,White,Not Span/Hispanic,5,Elective,Home w/ Home Health Services,2020,CIR003,NONRHEUMATIC AND UNSPECIFIED VALVE DISORDERS,CAR023,HEART VALVE REPLACEMENT AND OTHER VALVE PROCEDURES (ENDOVASCULAR),183,PERCUTANEOUS STRUCTURAL CARDIAC PROCEDURES,05,DISEASES AND DISORDERS OF THE CIRCULATORY SYSTEM,3,Major,Major,Surgical,Medicare,Blue Cross/Blue Shield,,,,N,594672.7,98292.71
Long Island,Nassau,2908000,000511,NYU Langone Hospital-Long Island,70 or Older,115,M,White,Not Span/Hispanic,6,Elective,Home or Self Care,2020,CIR003,NONRHEUMATIC AND UNSPECIFIED VALVE DISORDERS,CAR023,HEART VALVE REPLACEMENT AND OTHER VALVE PROCEDURES (ENDOVASCULAR),183,PERCUTANEOUS STRUCTURAL CARDIAC PROCEDURES,05,DISEASES AND DISORDERS OF THE CIRCULATORY SYSTEM,3,Major,Major,Surgical,Medicare,Blue Cross/Blue Shield,,,,N,642604.65,112576.42
Long Island,Nassau,2908000,000511,NYU Langone Hospital-Long Island,70 or Older,115,F,White,Not Span/Hispanic,1,Elective,Home or Self Care,2020,CIR003,NONRHEUMATIC AND UNSPECIFIED VALVE DISORDERS,CAR023,HEART VALVE REPLACEMENT AND OTHER VALVE PROCEDURES (ENDOVASCULAR),183,PERCUTANEOUS STRUCTURAL CARDIAC PROCEDURES,05,DISEASES AND DISORDERS OF THE CIRCULATORY SYSTEM,3,Major,Moderate,Surgical,Medicaid,,,,,N,489119.28,72293.71
Long Island,Nassau,2908000,000511,NYU Langone Hospital-Long Island,50 to 69,114,F,White,Not Span/Hispanic,1,Elective,Home w/ Home Health Services,2020,CIR003,NONRHEUMATIC AND UNSPECIFIED VALVE DISORDERS,CAR023,HEART VALVE REPLACEMENT AND OTHER VALVE PROCEDURES (ENDOVASCULAR),183,PERCUTANEOUS STRUCTURAL CARDIAC PROCEDURES,05,DISEASES AND DISORDERS OF THE CIRCULATORY SYSTEM,3,Major,Major,Surgical,Medicare,Medicare,,,,N,411959.83,58934.66
Long Island,Nassau,2908000,000511,NYU Langone Hospital-Long Island,70 or Older,115,F,White,Not Span/Hispanic,5,Elective,Skilled Nursing Home,2020,CIR003,NONRHEUMATIC AND UNSPECIFIED VALVE DISORDERS,CAR023,HEART VALVE REPLACEMENT AND OTHER VALVE PROCEDURES (ENDOVASCULAR),183,PERCUTANEOUS STRUCTURAL CARDIAC PROCEDURES,05,DISEASES AND DISORDERS OF THE CIRCULATORY SYSTEM,4,Extreme,Extreme,Surgical,Blue Cross/Blue Shield,,,,,N,495004.95,91397.52
Long Island,Nassau,2908000,000511,NYU Langone Hospital-Long Island,70 or Older,115,M,White,Spanish/Hispanic,4,Emergency,Home or Self Care,2020,INJ033,"COMPLICATION OF CARDIOVASCULAR DEVICE, IMPLANT OR GRAFT, INITIAL ENCOUNTER",CAR023,HEART VALVE REPLACEMENT AND OTHER VALVE PROCEDURES (ENDOVASCULAR),183,PERCUTANEOUS STRUCTURAL CARDIAC PROCEDURES,05,DISEASES AND DISORDERS OF THE CIRCULATORY SYSTEM,3,Major,Major,Surgical,Medicare,Medicaid,,,,Y,432302.49,70901.16
Long Island,Nassau,2908000,000511,NYU Langone Hospital-Long Island,70 or Older,117,F,White,Not Span/Hispanic,3,Elective,Home or Self Care,2020,CIR003,NONRHEUMATIC AND UNSPECIFIED VALVE DISORDERS,CAR023,HEART VALVE REPLACEMENT AND OTHER VALVE PROCEDURES (ENDOVASCULAR),183,PERCUTANEOUS STRUCTURAL CARDIAC PROCEDURES,05,DISEASES AND DISORDERS OF THE CIRCULATORY SYSTEM,3,Major,Major,Surgical,Medicare,Private Health Insurance,,,,N,546069.19,88162.67
Long Island,Nassau,2908000,000511,NYU Langone Hospital-Long Island,70 or Older,115,F,White,Not Span/Hispanic,6,Elective,Inpatient Rehabilitation Facility,2020,CIR003,NONRHEUMATIC AND UNSPECIFIED VALVE DISORDERS,CAR023,HEART VALVE REPLACEMENT AND OTHER VALVE PROCEDURES (ENDOVASCULAR),183,PERCUTANEOUS STRUCTURAL CARDIAC PROCEDURES,05,DISEASES AND DISORDERS OF THE CIRCULATORY SYSTEM,3,Major,Major,Surgical,Medicare,Blue Cross/Blue Shield,,,,N,508767.8,91484.32
Long Island,Nassau,2908000,000511,NYU Langone Hospital-Long Island,70 or Older,115,F,White,Not Span/Hispanic,4,Elective,Home or Self Care,2020,CIR003,NONRHEUMATIC AND UNSPECIFIED VALVE DISORDERS,CAR023,HEART VALVE REPLACEMENT AND OTHER VALVE PROCEDURES (ENDOVASCULAR),183,PERCUTANEOUS STRUCTURAL CARDIAC PROCEDURES,05,DISEASES AND DISORDERS OF THE CIRCULATORY SYSTEM,3,Major,Major,Surgical,Medicaid,,,,,N,483315.13,77867.59
Long Island,Nassau,2908000,000511,NYU Langone Hospital-Long Island,70 or Older,115,F,White,Not Span/Hispanic,5,Elective,Home or Self Care,2020,CIR003,NONRHEUMATIC AND UNSPECIFIED VALVE DISORDERS,CAR023,HEART VALVE REPLACEMENT AND OTHER VALVE PROCEDURES (ENDOVASCULAR),183,PERCUTANEOUS STRUCTURAL CARDIAC PROCEDURES,05,DISEASES AND DISORDERS OF THE CIRCULATORY SYSTEM,4,Extreme,Extreme,Surgical,Medicaid,,,,,N,521294.94,93690.51
Long Island,Nassau,2908000,000511,NYU Langone Hospital-Long Island,70 or Older,117,M,White,Not Span/Hispanic,1,Elective,Home or Self Care,2020,CIR003,NONRHEUMATIC AND UNSPECIFIED VALVE DISORDERS,CAR023,HEART VALVE REPLACEMENT AND OTHER VALVE PROCEDURES (ENDOVASCULAR),183,PERCUTANEOUS STRUCTURAL CARDIAC PROCEDURES,05,DISEASES AND DISORDERS OF THE CIRCULATORY SYSTEM,1,Minor,Minor,Surgical,Medicare,,,,,N,401897.94,60339.97
Long Island,Nassau,2908000,000511,NYU Langone Hospital-Long Island,70 or Older,115,F,White,Not Span/Hispanic,2,Elective,Home or Self Care,2020,CIR003,NONRHEUMATIC AND UNSPECIFIED VALVE DISORDERS,CAR023,HEART VALVE REPLACEMENT AND OTHER VALVE PROCEDURES (ENDOVASCULAR),183,PERCUTANEOUS STRUCTURAL CARDIAC PROCEDURES,05,DISEASES AND DISORDERS OF THE CIRCULATORY SYSTEM,3,Major,Major,Surgical,Medicare,Medicare,,,,N,441457.77,70888.2
Long Island,Nassau,2908000,000511,NYU Langone Hospital-Long Island,70 or Older,118,F,White,Not Span/Hispanic,1,Elective,Home or Self Care,2020,CIR003,NONRHEUMATIC AND UNSPECIFIED VALVE DISORDERS,CAR023,HEART VALVE REPLACEMENT AND OTHER VALVE PROCEDURES (ENDOVASCULAR),183,PERCUTANEOUS STRUCTURAL CARDIAC PROCEDURES,05,DISEASES AND DISORDERS OF THE CIRCULATORY SYSTEM,2,Moderate,Moderate,Surgical,Medicare,Blue Cross/Blue Shield,,,,N,383459.02,57935.61
Long Island,Nassau,2908000,000511,NYU Langone Hospital-Long Island,70 or Older,115,M,White,Not Span/Hispanic,1,Elective,Home or Self Care,2020,CIR003,NONRHEUMATIC AND UNSPECIFIED VALVE DISORDERS,CAR023,HEART VALVE REPLACEMENT AND OTHER VALVE PROCEDURES (ENDOVASCULAR),183,PERCUTANEOUS STRUCTURAL CARDIAC PROCEDURES,05,DISEASES AND DISORDERS OF THE CIRCULATORY SYSTEM,3,Major,Major,Surgical,Medicare,Medicare,,,,N,481305.3,71487.57
Long Island,Nassau,2908000,000511,NYU Langone Hospital-Long Island,70 or Older,115,M,White,Not Span/Hispanic,1,Elective,Home or Self Care,2020,CIR003,NONRHEUMATIC AND UNSPECIFIED VALVE DISORDERS,CAR023,HEART VALVE REPLACEMENT AND OTHER VALVE PROCEDURES (ENDOVASCULAR),183,PERCUTANEOUS STRUCTURAL CARDIAC PROCEDURES,05,DISEASES AND DISORDERS OF THE CIRCULATORY SYSTEM,2,Moderate,Moderate,Surgical,Medicare,Private Health Insurance,,,,N,410837.77,61074.49
Long Island,Nassau,2908000,000511,NYU Langone Hospital-Long Island,70 or Older,119,M,White,Not Span/Hispanic,3,Elective,Home or Self Care,2020,CIR003,NONRHEUMATIC AND UNSPECIFIED VALVE DISORDERS,CAR023,HEART VALVE REPLACEMENT AND OTHER VALVE PROCEDURES (ENDOVASCULAR),183,PERCUTANEOUS STRUCTURAL CARDIAC PROCEDURES,05,DISEASES AND DISORDERS OF THE CIRCULATORY SYSTEM,3,Major,Major,Surgical,Medicare,Blue Cross/Blue Shield,,,,N,511902.53,80140.25
Long Island,Nassau,2908000,000511,NYU Langone Hospital-Long Island,70 or Older,115,M,White,Not Span/Hispanic,1,Elective,Home or Self Care,2020,CIR003,NONRHEUMATIC AND UNSPECIFIED VALVE DISORDERS,CAR023,HEART VALVE REPLACEMENT AND OTHER VALVE PROCEDURES (ENDOVASCULAR),183,PERCUTANEOUS STRUCTURAL CARDIAC PROCEDURES,05,DISEASES AND DISORDERS OF THE CIRCULATORY SYSTEM,1,Minor,Moderate,Surgical,Medicare,Blue Cross/Blue Shield,,,,N,401595.56,60259.85
Long Island,Nassau,2908000,000511,NYU Langone Hospital-Long Island,70 or Older,118,M,White,Not Span/Hispanic,1,Elective,Home or Self Care,2020,INJ033,"COMPLICATION OF CARDIOVASCULAR DEVICE, IMPLANT OR GRAFT, INITIAL ENCOUNTER",CAR023,HEART VALVE REPLACEMENT AND OTHER VALVE PROCEDURES (ENDOVASCULAR),183,PERCUTANEOUS STRUCTURAL CARDIAC PROCEDURES,05,DISEASES AND DISORDERS OF THE CIRCULATORY SYSTEM,3,Major,Major,Surgical,Medicare,Blue Cross/Blue Shield,,,,N,412903.52,61762.76
Long Island,Nassau,2908000,000511,NYU Langone Hospital-Long Island,70 or Older,119,M,White,Not Span/Hispanic,1,Elective,Home or Self Care,2020,CIR003,NONRHEUMATIC AND UNSPECIFIED VALVE DISORDERS,CAR023,HEART VALVE REPLACEMENT AND OTHER VALVE PROCEDURES (ENDOVASCULAR),183,PERCUTANEOUS STRUCTURAL CARDIAC PROCEDURES,05,DISEASES AND DISORDERS OF THE CIRCULATORY SYSTEM,3,Major,Major,Surgical,Medicare,Blue Cross/Blue Shield,,,,N,492473.72,72919.79
Long Island,Nassau,2908000,000511,NYU Langone Hospital-Long Island,70 or Older,117,M,White,Not Span/Hispanic,1,Elective,Home or Self Care,2020,CIR003,NONRHEUMATIC AND UNSPECIFIED VALVE DISORDERS,CAR023,HEART VALVE REPLACEMENT AND OTHER VALVE PROCEDURES (ENDOVASCULAR),183,PERCUTANEOUS STRUCTURAL CARDIAC PROCEDURES,05,DISEASES AND DISORDERS OF THE CIRCULATORY SYSTEM,2,Moderate,Moderate,Surgical,Medicare,Blue Cross/Blue Shield,,,,N,383408.46,58063.36
Long Island,Nassau,2908000,000511,NYU Langone Hospital-Long Island,70 or Older,117,M,White,Not Span/Hispanic,1,Elective,Home w/ Home Health Services,2020,INJ033,"COMPLICATION OF CARDIOVASCULAR DEVICE, IMPLANT OR GRAFT, INITIAL ENCOUNTER",CAR023,HEART VALVE REPLACEMENT AND OTHER VALVE PROCEDURES (ENDOVASCULAR),183,PERCUTANEOUS STRUCTURAL CARDIAC PROCEDURES,05,DISEASES AND DISORDERS OF THE CIRCULATORY SYSTEM,3,Major,Major,Surgical,Medicare,,,,,N,434727.43,65179.94
Long Island,Nassau,2908000,000511,NYU Langone Hospital-Long Island,70 or Older,115,M,White,Not Span/Hispanic,1,Elective,Home or Self Care,2020,CIR003,NONRHEUMATIC AND UNSPECIFIED VALVE DISORDERS,CAR023,HEART VALVE REPLACEMENT AND OTHER VALVE PROCEDURES (ENDOVASCULAR),183,PERCUTANEOUS STRUCTURAL CARDIAC PROCEDURES,05,DISEASES AND DISORDERS OF THE CIRCULATORY SYSTEM,2,Moderate,Major,Surgical,Medicare,,,,,N,395919.34,59365.53
Long Island,Nassau,2908000,000511,NYU Langone Hospital-Long Island,50 to 69,117,M,White,Not Span/Hispanic,1,Elective,Home or Self Care,2020,INJ033,"COMPLICATION OF CARDIOVASCULAR DEVICE, IMPLANT OR GRAFT, INITIAL ENCOUNTER",CAR023,HEART VALVE REPLACEMENT AND OTHER VALVE PROCEDURES (ENDOVASCULAR),183,PERCUTANEOUS STRUCTURAL CARDIAC PROCEDURES,05,DISEASES AND DISORDERS OF THE CIRCULATORY SYSTEM,3,Major,Major,Surgical,Private Health Insurance,,,,,N,490409.31,72287.02
Long Island,Nassau,2908000,000511,NYU Langone Hospital-Long Island,50 to 69,117,M,White,Not Span/Hispanic,1,Elective,Home or Self Care,2020,CIR003,NONRHEUMATIC AND UNSPECIFIED VALVE DISORDERS,CAR023,HEART VALVE REPLACEMENT AND OTHER VALVE PROCEDURES (ENDOVASCULAR),183,PERCUTANEOUS STRUCTURAL CARDIAC PROCEDURES,05,DISEASES AND DISORDERS OF THE CIRCULATORY SYSTEM,2,Moderate,Moderate,Surgical,Blue Cross/Blue Shield,,,,,N,1376025.46,195636.49
Long Island,Nassau,2908000,000511,NYU Langone Hospital-Long Island,70 or Older,115,F,White,Not Span/Hispanic,3,Elective,Home or Self Care,2020,CIR003,NONRHEUMATIC AND UNSPECIFIED VALVE DISORDERS,CAR023,HEART VALVE REPLACEMENT AND OTHER VALVE PROCEDURES (ENDOVASCULAR),183,PERCUTANEOUS STRUCTURAL CARDIAC PROCEDURES,05,DISEASES AND DISORDERS OF THE CIRCULATORY SYSTEM,3,Major,Major,Surgical,Medicare,,,,,N,500685.99,77367.76
Long Island,Nassau,2908000,000511,NYU Langone Hospital-Long Island,70 or Older,119,F,White,Not Span/Hispanic,1,Elective,Home or Self Care,2020,CIR003,NONRHEUMATIC AND UNSPECIFIED VALVE DISORDERS,CAR023,HEART VALVE REPLACEMENT AND OTHER VALVE PROCEDURES (ENDOVASCULAR),183,PERCUTANEOUS STRUCTURAL CARDIAC PROCEDURES,05,DISEASES AND DISORDERS OF THE CIRCULATORY SYSTEM,2,Moderate,Moderate,Surgical,Medicare,Blue Cross/Blue Shield,,,,N,442813.94,66113.4
Long Island,Nassau,2908000,000511,NYU Langone Hospital-Long Island,70 or Older,119,M,White,Not Span/Hispanic,1,Elective,Home w/ Home Health Services,2020,CIR003,NONRHEUMATIC AND UNSPECIFIED VALVE DISORDERS,CAR023,HEART VALVE REPLACEMENT AND OTHER VALVE PROCEDURES (ENDOVASCULAR),183,PERCUTANEOUS STRUCTURAL CARDIAC PROCEDURES,05,DISEASES AND DISORDERS OF THE CIRCULATORY SYSTEM,3,Major,Major,Surgical,Medicare,Blue Cross/Blue Shield,,,,N,553596.2,81034.39
Long Island,Nassau,2908000,000511,NYU Langone Hospital-Long Island,50 to 69,119,M,Other Race,Not Span/Hispanic,1,Elective,Home or Self Care,2020,INJ033,"COMPLICATION OF CARDIOVASCULAR DEVICE, IMPLANT OR GRAFT, INITIAL ENCOUNTER",CAR023,HEART VALVE REPLACEMENT AND OTHER VALVE PROCEDURES (ENDOVASCULAR),183,PERCUTANEOUS STRUCTURAL CARDIAC PROCEDURES,05,DISEASES AND DISORDERS OF THE CIRCULATORY SYSTEM,3,Major,Major,Surgical,Blue Cross/Blue Shield,,,,,N,400275.7,60118.9
Long Island,Nassau,2908000,000511,NYU Langone Hospital-Long Island,70 or Older,115,F,White,Not Span/Hispanic,4,Elective,Skilled Nursing Home,2020,CIR003,NONRHEUMATIC AND UNSPECIFIED VALVE DISORDERS,CAR023,HEART VALVE REPLACEMENT AND OTHER VALVE PROCEDURES (ENDOVASCULAR),183,PERCUTANEOUS STRUCTURAL CARDIAC PROCEDURES,05,DISEASES AND DISORDERS OF THE CIRCULATORY SYSTEM,4,Extreme,Extreme,Surgical,Medicare,,,,,N,499360.62,79430.67
Long Island,Nassau,2908000,000511,NYU Langone Hospital-Long Island,70 or Older,119,M,White,Not Span/Hispanic,3,Elective,Home or Self Care,2020,CIR003,NONRHEUMATIC AND UNSPECIFIED VALVE DISORDERS,CAR023,HEART VALVE REPLACEMENT AND OTHER VALVE PROCEDURES (ENDOVASCULAR),183,PERCUTANEOUS STRUCTURAL CARDIAC PROCEDURES,05,DISEASES AND DISORDERS OF THE CIRCULATORY SYSTEM,2,Moderate,Moderate,Surgical,Medicare,Medicare,,,,N,522337.95,83929.69
Long Island,Nassau,2908000,000511,NYU Langone Hospital-Long Island,70 or Older,115,F,White,Not Span/Hispanic,1,Elective,Home or Self Care,2020,CIR003,NONRHEUMATIC AND UNSPECIFIED VALVE DISORDERS,CAR023,HEART VALVE REPLACEMENT AND OTHER VALVE PROCEDURES (ENDOVASCULAR),183,PERCUTANEOUS STRUCTURAL CARDIAC PROCEDURES,05,DISEASES AND DISORDERS OF THE CIRCULATORY SYSTEM,2,Moderate,Moderate,Surgical,Medicare,Medicare,,,,N,409948.67,61889.63
Long Island,Nassau,2908000,000511,NYU Langone Hospital-Long Island,70 or Older,117,F,White,Not Span/Hispanic,2,Elective,Home w/ Home Health Services,2020,CIR003,NONRHEUMATIC AND UNSPECIFIED VALVE DISORDERS,CAR023,HEART VALVE REPLACEMENT AND OTHER VALVE PROCEDURES (ENDOVASCULAR),183,PERCUTANEOUS STRUCTURAL CARDIAC PROCEDURES,05,DISEASES AND DISORDERS OF THE CIRCULATORY SYSTEM,3,Major,Major,Surgical,Medicare,Medicare,,,,N,538595.67,81433.44
Long Island,Nassau,2908000,000511,NYU Langone Hospital-Long Island,70 or Older,119,M,White,Not Span/Hispanic,1,Elective,Home or Self Care,2020,CIR003,NONRHEUMATIC AND UNSPECIFIED VALVE DISORDERS,CAR023,HEART VALVE REPLACEMENT AND OTHER VALVE PROCEDURES (ENDOVASCULAR),183,PERCUTANEOUS STRUCTURAL CARDIAC PROCEDURES,05,DISEASES AND DISORDERS OF THE CIRCULATORY SYSTEM,3,Major,Major,Surgical,Medicare,Blue Cross/Blue Shield,,,,N,407847.75,60581.07
Long Island,Nassau,2908000,000511,NYU Langone Hospital-Long Island,70 or Older,117,M,White,Not Span/Hispanic,5,Emergency,Home or Self Care,2020,CIR003,NONRHEUMATIC AND UNSPECIFIED VALVE DISORDERS,CAR023,HEART VALVE REPLACEMENT AND OTHER VALVE PROCEDURES (ENDOVASCULAR),183,PERCUTANEOUS STRUCTURAL CARDIAC PROCEDURES,05,DISEASES AND DISORDERS OF THE CIRCULATORY SYSTEM,2,Moderate,Moderate,Surgical,Medicare,Blue Cross/Blue Shield,,,,Y,422491.6,73547.78
Long Island,Nassau,2908000,000511,NYU Langone Hospital-Long Island,70 or Older,115,F,White,Not Span/Hispanic,1,Elective,Home or Self Care,2020,CIR003,NONRHEUMATIC AND UNSPECIFIED VALVE DISORDERS,CAR023,HEART VALVE REPLACEMENT AND OTHER VALVE PROCEDURES (ENDOVASCULAR),183,PERCUTANEOUS STRUCTURAL CARDIAC PROCEDURES,05,DISEASES AND DISORDERS OF THE CIRCULATORY SYSTEM,2,Moderate,Moderate,Surgical,Medicare,Medicare,,,,N,352676.97,53828.39
Long Island,Nassau,2908000,000511,NYU Langone Hospital-Long Island,50 to 69,110,M,White,Not Span/Hispanic,1,Elective,Home or Self Care,2020,CIR003,NONRHEUMATIC AND UNSPECIFIED VALVE DISORDERS,CAR023,HEART VALVE REPLACEMENT AND OTHER VALVE PROCEDURES (ENDOVASCULAR),183,PERCUTANEOUS STRUCTURAL CARDIAC PROCEDURES,05,DISEASES AND DISORDERS OF THE CIRCULATORY SYSTEM,3,Major,Extreme,Surgical,Medicare,Medicaid,,,,N,452862.22,67373.58
Long Island,Nassau,2908000,000511,NYU Langone Hospital-Long Island,70 or Older,110,M,White,Not Span/Hispanic,1,Elective,Home or Self Care,2020,CIR003,NONRHEUMATIC AND UNSPECIFIED VALVE DISORDERS,CAR023,HEART VALVE REPLACEMENT AND OTHER VALVE PROCEDURES (ENDOVASCULAR),183,PERCUTANEOUS STRUCTURAL CARDIAC PROCEDURES,05,DISEASES AND DISORDERS OF THE CIRCULATORY SYSTEM,2,Moderate,Moderate,Surgical,Medicare,,,,,N,364468,55584.2
Long Island,Nassau,2908000,000511,NYU Langone Hospital-Long Island,70 or Older,119,F,White,Not Span/Hispanic,5,Elective,Skilled Nursing Home,2020,CIR003,NONRHEUMATIC AND UNSPECIFIED VALVE DISORDERS,CAR023,HEART VALVE REPLACEMENT AND OTHER VALVE PROCEDURES (ENDOVASCULAR),183,PERCUTANEOUS STRUCTURAL CARDIAC PROCEDURES,05,DISEASES AND DISORDERS OF THE CIRCULATORY SYSTEM,4,Extreme,Extreme,Surgical,Medicare,Medicare,,,,N,552950.16,88791.53
Long Island,Nassau,2908000,000511,NYU Langone Hospital-Long Island,70 or Older,115,F,White,Not Span/Hispanic,10,Emergency,Home or Self Care,2020,CIR003,NONRHEUMATIC AND UNSPECIFIED VALVE DISORDERS,CAR023,HEART VALVE REPLACEMENT AND OTHER VALVE PROCEDURES (ENDOVASCULAR),183,PERCUTANEOUS STRUCTURAL CARDIAC PROCEDURES,05,DISEASES AND DISORDERS OF THE CIRCULATORY SYSTEM,3,Major,Extreme,Surgical,Medicare,Medicare,,,,Y,614731.8,115648.28
Long Island,Nassau,2908000,000511,NYU Langone Hospital-Long Island,70 or Older,113,F,White,Not Span/Hispanic,2,Elective,Home or Self Care,2020,CIR003,NONRHEUMATIC AND UNSPECIFIED VALVE DISORDERS,CAR023,HEART VALVE REPLACEMENT AND OTHER VALVE PROCEDURES (ENDOVASCULAR),183,PERCUTANEOUS STRUCTURAL CARDIAC PROCEDURES,05,DISEASES AND DISORDERS OF THE CIRCULATORY SYSTEM,3,Major,Major,Surgical,Medicare,Blue Cross/Blue Shield,,,,N,794712.07,119681.28
Long Island,Nassau,2908000,000511,NYU Langone Hospital-Long Island,70 or Older,115,F,White,Not Span/Hispanic,5,Emergency,Home or Self Care,2020,CIR003,NONRHEUMATIC AND UNSPECIFIED VALVE DISORDERS,CAR023,HEART VALVE REPLACEMENT AND OTHER VALVE PROCEDURES (ENDOVASCULAR),183,PERCUTANEOUS STRUCTURAL CARDIAC PROCEDURES,05,DISEASES AND DISORDERS OF THE CIRCULATORY SYSTEM,4,Extreme,Extreme,Surgical,Medicare,Blue Cross/Blue Shield,,,,Y,516062.78,83169.87
Long Island,Nassau,2908000,000511,NYU Langone Hospital-Long Island,70 or Older,117,M,White,Not Span/Hispanic,1,Elective,Home or Self Care,2020,CIR003,NONRHEUMATIC AND UNSPECIFIED VALVE DISORDERS,CAR023,HEART VALVE REPLACEMENT AND OTHER VALVE PROCEDURES (ENDOVASCULAR),183,PERCUTANEOUS STRUCTURAL CARDIAC PROCEDURES,05,DISEASES AND DISORDERS OF THE CIRCULATORY SYSTEM,3,Major,Moderate,Surgical,Medicare,,,,,N,454196.35,64740.79
Long Island,Nassau,2908000,000511,NYU Langone Hospital-Long Island,70 or Older,119,F,White,Not Span/Hispanic,4,Elective,Home or Self Care,2020,CIR003,NONRHEUMATIC AND UNSPECIFIED VALVE DISORDERS,CAR023,HEART VALVE REPLACEMENT AND OTHER VALVE PROCEDURES (ENDOVASCULAR),183,PERCUTANEOUS STRUCTURAL CARDIAC PROCEDURES,05,DISEASES AND DISORDERS OF THE CIRCULATORY SYSTEM,2,Moderate,Major,Surgical,Medicare,Blue Cross/Blue Shield,,,,N,639579.03,99189.55
Long Island,Nassau,2908000,000511,NYU Langone Hospital-Long Island,70 or Older,115,M,White,Not Span/Hispanic,1,Elective,Home or Self Care,2020,CIR003,NONRHEUMATIC AND UNSPECIFIED VALVE DISORDERS,CAR023,HEART VALVE REPLACEMENT AND OTHER VALVE PROCEDURES (ENDOVASCULAR),183,PERCUTANEOUS STRUCTURAL CARDIAC PROCEDURES,05,DISEASES AND DISORDERS OF THE CIRCULATORY SYSTEM,2,Moderate,Moderate,Surgical,Medicare,Medicare,,,,N,468685.7,66976.54
Long Island,Nassau,2908000,000511,NYU Langone Hospital-Long Island,70 or Older,119,M,White,Not Span/Hispanic,2,Elective,Expired,2020,MAL001,CARDIAC AND CIRCULATORY CONGENITAL ANOMALIES,CAR023,HEART VALVE REPLACEMENT AND OTHER VALVE PROCEDURES (ENDOVASCULAR),183,PERCUTANEOUS STRUCTURAL CARDIAC PROCEDURES,05,DISEASES AND DISORDERS OF THE CIRCULATORY SYSTEM,4,Extreme,Extreme,Surgical,Medicare,Private Health Insurance,,,,N,415519.76,63770.79
Long Island,Nassau,2908000,000511,NYU Langone Hospital-Long Island,70 or Older,119,F,White,Not Span/Hispanic,1,Elective,Home or Self Care,2020,CIR003,NONRHEUMATIC AND UNSPECIFIED VALVE DISORDERS,CAR023,HEART VALVE REPLACEMENT AND OTHER VALVE PROCEDURES (ENDOVASCULAR),183,PERCUTANEOUS STRUCTURAL CARDIAC PROCEDURES,05,DISEASES AND DISORDERS OF THE CIRCULATORY SYSTEM,2,Moderate,Moderate,Surgical,Medicare,Blue Cross/Blue Shield,,,,N,437326.36,62616.38
Long Island,Nassau,2908000,000511,NYU Langone Hospital-Long Island,70 or Older,115,M,White,Not Span/Hispanic,1,Elective,Home or Self Care,2020,CIR003,NONRHEUMATIC AND UNSPECIFIED VALVE DISORDERS,CAR023,HEART VALVE REPLACEMENT AND OTHER VALVE PROCEDURES (ENDOVASCULAR),183,PERCUTANEOUS STRUCTURAL CARDIAC PROCEDURES,05,DISEASES AND DISORDERS OF THE CIRCULATORY SYSTEM,3,Major,Moderate,Surgical,Medicare,Blue Cross/Blue Shield,,,,N,441550.88,63183.5
Long Island,Nassau,2908000,000511,NYU Langone Hospital-Long Island,70 or Older,110,F,White,Not Span/Hispanic,2,Elective,Home or Self Care,2020,CIR003,NONRHEUMATIC AND UNSPECIFIED VALVE DISORDERS,CAR023,HEART VALVE REPLACEMENT AND OTHER VALVE PROCEDURES (ENDOVASCULAR),183,PERCUTANEOUS STRUCTURAL CARDIAC PROCEDURES,05,DISEASES AND DISORDERS OF THE CIRCULATORY SYSTEM,2,Moderate,Major,Surgical,Medicare,Blue Cross/Blue Shield,,,,N,405015.89,62932.92
Long Island,Nassau,2908000,000511,NYU Langone Hospital-Long Island,70 or Older,117,F,White,Not Span/Hispanic,1,Elective,Home or Self Care,2020,CIR003,NONRHEUMATIC AND UNSPECIFIED VALVE DISORDERS,CAR023,HEART VALVE REPLACEMENT AND OTHER VALVE PROCEDURES (ENDOVASCULAR),183,PERCUTANEOUS STRUCTURAL CARDIAC PROCEDURES,05,DISEASES AND DISORDERS OF THE CIRCULATORY SYSTEM,2,Moderate,Moderate,Surgical,Medicare,Medicare,,,,N,399726.9,60036.79