Hospital Service Area,Hospital County,Operating Certificate Number,Permanent Facility Id,Facility Name,Age Group,Zip Code - 3 digits,Gender,Race,Ethnicity,Length of Stay,Type of Admission,Patient Disposition,Discharge Year,CCS Diagnosis Code,CCS Diagnosis Description,CCS Procedure Code,CCS Procedure Description,APR DRG Code,APR DRG Description,APR MDC Code,APR MDC Description,APR Severity of Illness Code,APR Severity of Illness Description,APR Risk of Mortality,APR Medical Surgical Description,Payment Typology 1,Payment Typology 2,Payment Typology 3,Birth Weight,Abortion Edit Indicator,Emergency Department Indicator,Total Charges,Total Costs
Long Island,Nassau,2908000,000511,NYU Langone Hospital-Long Island,50 to 69,114,F,Black/African American,Not Span/Hispanic,1,Emergency,Home or Self Care,2020,CIR009,ACUTE MYOCARDIAL INFARCTION,MAM005,MEASUREMENT DURING CARDIAC CATHETERIZATION,190,ACUTE MYOCARDIAL INFARCTION,05,DISEASES AND DISORDERS OF THE CIRCULATORY SYSTEM,2,Moderate,Minor,Medical,Private Health Insurance,,,,,Y,54021.13,9469.4
Long Island,Nassau,2908000,000511,NYU Langone Hospital-Long Island,70 or Older,117,M,White,Not Span/Hispanic,11,Emergency,Skilled Nursing Home,2020,CIR009,ACUTE MYOCARDIAL INFARCTION,MAM005,MEASUREMENT DURING CARDIAC CATHETERIZATION,190,ACUTE MYOCARDIAL INFARCTION,05,DISEASES AND DISORDERS OF THE CIRCULATORY SYSTEM,3,Major,Major,Medical,Medicare,Medicaid,,,,Y,256418.76,66262.96
Long Island,Nassau,2908000,000511,NYU Langone Hospital-Long Island,70 or Older,119,F,White,Not Span/Hispanic,3,Elective,Home or Self Care,2020,CIR009,ACUTE MYOCARDIAL INFARCTION,MAM005,MEASUREMENT DURING CARDIAC CATHETERIZATION,190,ACUTE MYOCARDIAL INFARCTION,05,DISEASES AND DISORDERS OF THE CIRCULATORY SYSTEM,2,Moderate,Major,Medical,Medicare,Medicare,,,,N,57763.23,14177.55
Long Island,Nassau,2908000,000511,NYU Langone Hospital-Long Island,70 or Older,110,M,White,Not Span/Hispanic,3,Emergency,Home w/ Home Health Services,2020,CIR009,ACUTE MYOCARDIAL INFARCTION,IMG001,CARDIAC AND CORONARY FLUOROSCOPY,190,ACUTE MYOCARDIAL INFARCTION,05,DISEASES AND DISORDERS OF THE CIRCULATORY SYSTEM,3,Major,Major,Medical,Medicare,Medicare,,,,Y,101301.29,25924.34
Long Island,Nassau,2908000,000511,NYU Langone Hospital-Long Island,50 to 69,117,F,White,Not Span/Hispanic,5,Emergency,Home or Self Care,2020,CIR009,ACUTE MYOCARDIAL INFARCTION,MAM005,MEASUREMENT DURING CARDIAC CATHETERIZATION,190,ACUTE MYOCARDIAL INFARCTION,05,DISEASES AND DISORDERS OF THE CIRCULATORY SYSTEM,2,Moderate,Moderate,Medical,Blue Cross/Blue Shield,,,,,Y,171415.03,36088.45
Long Island,Nassau,2908000,000511,NYU Langone Hospital-Long Island,70 or Older,117,M,White,Not Span/Hispanic,1,Emergency,Home or Self Care,2020,CIR009,ACUTE MYOCARDIAL INFARCTION,,,190,ACUTE MYOCARDIAL INFARCTION,05,DISEASES AND DISORDERS OF THE CIRCULATORY SYSTEM,2,Moderate,Major,Medical,Medicare,Blue Cross/Blue Shield,,,,Y,23064.76,5171.11
Long Island,Nassau,2908000,000511,NYU Langone Hospital-Long Island,30 to 49,112,M,Black/African American,Not Span/Hispanic,3,Emergency,Home or Self Care,2020,CIR009,ACUTE MYOCARDIAL INFARCTION,MAM005,MEASUREMENT DURING CARDIAC CATHETERIZATION,190,ACUTE MYOCARDIAL INFARCTION,05,DISEASES AND DISORDERS OF THE CIRCULATORY SYSTEM,2,Moderate,Minor,Medical,Medicaid,,,,,Y,80917.28,17180.59
Long Island,Nassau,2908000,000511,NYU Langone Hospital-Long Island,70 or Older,118,M,White,Not Span/Hispanic,4,Emergency,Expired,2020,CIR009,ACUTE MYOCARDIAL INFARCTION,,,190,ACUTE MYOCARDIAL INFARCTION,05,DISEASES AND DISORDERS OF THE CIRCULATORY SYSTEM,4,Extreme,Major,Medical,Medicare,Medicaid,Blue Cross/Blue Shield,,,Y,69558.36,16334.39
Long Island,Nassau,2908000,000511,NYU Langone Hospital-Long Island,50 to 69,117,F,White,Not Span/Hispanic,1,Emergency,Home or Self Care,2020,CIR009,ACUTE MYOCARDIAL INFARCTION,,,190,ACUTE MYOCARDIAL INFARCTION,05,DISEASES AND DISORDERS OF THE CIRCULATORY SYSTEM,2,Moderate,Moderate,Medical,Blue Cross/Blue Shield,,,,,Y,20560.77,4870.71
Long Island,Nassau,2908000,000511,NYU Langone Hospital-Long Island,70 or Older,110,F,White,Not Span/Hispanic,7,Emergency,Hospice - Home,2020,CIR009,ACUTE MYOCARDIAL INFARCTION,MAM005,MEASUREMENT DURING CARDIAC CATHETERIZATION,190,ACUTE MYOCARDIAL INFARCTION,05,DISEASES AND DISORDERS OF THE CIRCULATORY SYSTEM,4,Extreme,Extreme,Medical,Medicare,Medicare,,,,Y,110686.17,32981.74
Long Island,Nassau,2908000,000511,NYU Langone Hospital-Long Island,70 or Older,117,M,Other Race,Not Span/Hispanic,5,Emergency,Home w/ Home Health Services,2020,CIR009,ACUTE MYOCARDIAL INFARCTION,MAM005,MEASUREMENT DURING CARDIAC CATHETERIZATION,190,ACUTE MYOCARDIAL INFARCTION,05,DISEASES AND DISORDERS OF THE CIRCULATORY SYSTEM,2,Moderate,Moderate,Medical,Medicaid,,,,,Y,98874.41,24079.54
Long Island,Nassau,2908000,000511,NYU Langone Hospital-Long Island,50 to 69,114,M,Black/African American,Not Span/Hispanic,5,Emergency,Home or Self Care,2020,CIR009,ACUTE MYOCARDIAL INFARCTION,MAM005,MEASUREMENT DURING CARDIAC CATHETERIZATION,190,ACUTE MYOCARDIAL INFARCTION,05,DISEASES AND DISORDERS OF THE CIRCULATORY SYSTEM,3,Major,Major,Medical,Private Health Insurance,,,,,Y,141483.14,26152.91
Long Island,Nassau,2908000,000511,NYU Langone Hospital-Long Island,70 or Older,118,M,White,Not Span/Hispanic,5,Urgent,Home w/ Home Health Services,2020,CIR009,ACUTE MYOCARDIAL INFARCTION,MAM004,CARDIAC STRESS TESTS,190,ACUTE MYOCARDIAL INFARCTION,05,DISEASES AND DISORDERS OF THE CIRCULATORY SYSTEM,3,Major,Major,Medical,Blue Cross/Blue Shield,,,,,N,86491.12,21481.88
Long Island,Nassau,2908000,000511,NYU Langone Hospital-Long Island,70 or Older,117,M,White,Not Span/Hispanic,4,Urgent,Home w/ Home Health Services,2020,CIR009,ACUTE MYOCARDIAL INFARCTION,ADM001,TRANSFUSION OF BLOOD AND BLOOD PRODUCTS,190,ACUTE MYOCARDIAL INFARCTION,05,DISEASES AND DISORDERS OF THE CIRCULATORY SYSTEM,3,Major,Major,Medical,Private Health Insurance,,,,,N,77588.93,24586.74
Long Island,Nassau,2908000,000511,NYU Langone Hospital-Long Island,70 or Older,115,F,Black/African American,Not Span/Hispanic,3,Emergency,Home w/ Home Health Services,2020,CIR009,ACUTE MYOCARDIAL INFARCTION,,,190,ACUTE MYOCARDIAL INFARCTION,05,DISEASES AND DISORDERS OF THE CIRCULATORY SYSTEM,1,Minor,Moderate,Medical,Blue Cross/Blue Shield,Medicaid,,,,Y,53378.63,12775.27
Long Island,Nassau,2908000,000511,NYU Langone Hospital-Long Island,70 or Older,115,F,White,Not Span/Hispanic,6,Emergency,Home or Self Care,2020,CIR009,ACUTE MYOCARDIAL INFARCTION,MAM005,MEASUREMENT DURING CARDIAC CATHETERIZATION,190,ACUTE MYOCARDIAL INFARCTION,05,DISEASES AND DISORDERS OF THE CIRCULATORY SYSTEM,2,Moderate,Major,Medical,Medicare,Blue Cross/Blue Shield,,,,Y,132359.47,41155.48
Long Island,Nassau,2908000,000511,NYU Langone Hospital-Long Island,50 to 69,115,M,White,Not Span/Hispanic,2,Emergency,Home or Self Care,2020,CIR009,ACUTE MYOCARDIAL INFARCTION,MAM005,MEASUREMENT DURING CARDIAC CATHETERIZATION,190,ACUTE MYOCARDIAL INFARCTION,05,DISEASES AND DISORDERS OF THE CIRCULATORY SYSTEM,2,Moderate,Moderate,Medical,Blue Cross/Blue Shield,,,,,Y,52162.83,11507.2
Long Island,Nassau,2908000,000511,NYU Langone Hospital-Long Island,30 to 49,115,M,White,Not Span/Hispanic,1,Emergency,Home or Self Care,2020,CIR009,ACUTE MYOCARDIAL INFARCTION,MAM005,MEASUREMENT DURING CARDIAC CATHETERIZATION,190,ACUTE MYOCARDIAL INFARCTION,05,DISEASES AND DISORDERS OF THE CIRCULATORY SYSTEM,2,Moderate,Moderate,Medical,Medicaid,,,,,Y,55474.11,9184.42
Long Island,Nassau,2908000,000511,NYU Langone Hospital-Long Island,50 to 69,115,F,White,Unknown,2,Emergency,Home or Self Care,2020,CIR009,ACUTE MYOCARDIAL INFARCTION,,,190,ACUTE MYOCARDIAL INFARCTION,05,DISEASES AND DISORDERS OF THE CIRCULATORY SYSTEM,2,Moderate,Moderate,Medical,Private Health Insurance,,,,,Y,33318.43,8456.08
Long Island,Nassau,2908000,000511,NYU Langone Hospital-Long Island,50 to 69,115,M,White,Not Span/Hispanic,6,Emergency,Home or Self Care,2020,CIR009,ACUTE MYOCARDIAL INFARCTION,MAM005,MEASUREMENT DURING CARDIAC CATHETERIZATION,190,ACUTE MYOCARDIAL INFARCTION,05,DISEASES AND DISORDERS OF THE CIRCULATORY SYSTEM,1,Minor,Minor,Medical,Blue Cross/Blue Shield,,,,,Y,127205.36,29082.86
Long Island,Nassau,2908000,000511,NYU Langone Hospital-Long Island,50 to 69,115,F,White,Not Span/Hispanic,4,Emergency,Home or Self Care,2020,CIR009,ACUTE MYOCARDIAL INFARCTION,MAM005,MEASUREMENT DURING CARDIAC CATHETERIZATION,190,ACUTE MYOCARDIAL INFARCTION,05,DISEASES AND DISORDERS OF THE CIRCULATORY SYSTEM,3,Major,Major,Medical,Blue Cross/Blue Shield,Blue Cross/Blue Shield,Medicare,,,Y,83251.08,21883.89
Long Island,Nassau,2908000,000511,NYU Langone Hospital-Long Island,70 or Older,115,F,White,Not Span/Hispanic,6,Emergency,Skilled Nursing Home,2020,CIR009,ACUTE MYOCARDIAL INFARCTION,MAM005,MEASUREMENT DURING CARDIAC CATHETERIZATION,190,ACUTE MYOCARDIAL INFARCTION,05,DISEASES AND DISORDERS OF THE CIRCULATORY SYSTEM,2,Moderate,Major,Medical,Private Health Insurance,,,,,Y,124901.68,31568.41
Long Island,Nassau,2908000,000511,NYU Langone Hospital-Long Island,30 to 49,115,M,White,Not Span/Hispanic,3,Emergency,Home or Self Care,2020,CIR009,ACUTE MYOCARDIAL INFARCTION,MAM005,MEASUREMENT DURING CARDIAC CATHETERIZATION,190,ACUTE MYOCARDIAL INFARCTION,05,DISEASES AND DISORDERS OF THE CIRCULATORY SYSTEM,2,Moderate,Moderate,Medical,Medicaid,,,,,Y,83807.27,16502.86
Long Island,Nassau,2908000,000511,NYU Langone Hospital-Long Island,50 to 69,115,M,White,Not Span/Hispanic,5,Emergency,Home or Self Care,2020,CIR009,ACUTE MYOCARDIAL INFARCTION,MAM005,MEASUREMENT DURING CARDIAC CATHETERIZATION,190,ACUTE MYOCARDIAL INFARCTION,05,DISEASES AND DISORDERS OF THE CIRCULATORY SYSTEM,2,Moderate,Moderate,Medical,Medicaid,,,,,Y,98287.41,30008.5
Long Island,Nassau,2908000,000511,NYU Langone Hospital-Long Island,50 to 69,117,M,White,Not Span/Hispanic,5,Emergency,Home w/ Home Health Services,2020,CIR009,ACUTE MYOCARDIAL INFARCTION,MAM005,MEASUREMENT DURING CARDIAC CATHETERIZATION,190,ACUTE MYOCARDIAL INFARCTION,05,DISEASES AND DISORDERS OF THE CIRCULATORY SYSTEM,2,Moderate,Minor,Medical,Private Health Insurance,,,,,Y,94872.07,23030.49
Long Island,Nassau,2908000,000511,NYU Langone Hospital-Long Island,50 to 69,117,M,White,Not Span/Hispanic,2,Emergency,Home or Self Care,2020,CIR009,ACUTE MYOCARDIAL INFARCTION,MAM005,MEASUREMENT DURING CARDIAC CATHETERIZATION,190,ACUTE MYOCARDIAL INFARCTION,05,DISEASES AND DISORDERS OF THE CIRCULATORY SYSTEM,2,Moderate,Minor,Medical,Private Health Insurance,,,,,Y,72673.01,19918.68
Long Island,Nassau,2908000,000511,NYU Langone Hospital-Long Island,70 or Older,115,F,Black/African American,Unknown,7,Emergency,Skilled Nursing Home,2020,CIR009,ACUTE MYOCARDIAL INFARCTION,,,190,ACUTE MYOCARDIAL INFARCTION,05,DISEASES AND DISORDERS OF THE CIRCULATORY SYSTEM,3,Major,Major,Medical,Medicaid,,,,,Y,74393.7,28171.29
Long Island,Nassau,2908000,000511,NYU Langone Hospital-Long Island,70 or Older,110,F,White,Not Span/Hispanic,5,Emergency,Expired,2020,CIR009,ACUTE MYOCARDIAL INFARCTION,RES007,AIRWAY INTUBATION,190,ACUTE MYOCARDIAL INFARCTION,05,DISEASES AND DISORDERS OF THE CIRCULATORY SYSTEM,4,Extreme,Extreme,Medical,Medicare,,,,,Y,128959.33,32391.03
Long Island,Nassau,2908000,000511,NYU Langone Hospital-Long Island,50 to 69,117,F,White,Unknown,1,Emergency,Expired,2020,CIR009,ACUTE MYOCARDIAL INFARCTION,ESA009,CARDIAC ASSISTANCE WITH BALLOON PUMP,190,ACUTE MYOCARDIAL INFARCTION,05,DISEASES AND DISORDERS OF THE CIRCULATORY SYSTEM,4,Extreme,Extreme,Medical,Medicare,Medicaid,,,,Y,58333.92,10281.9
Long Island,Nassau,2908000,000511,NYU Langone Hospital-Long Island,70 or Older,115,M,White,Not Span/Hispanic,7,Emergency,Home or Self Care,2020,CIR009,ACUTE MYOCARDIAL INFARCTION,MAM005,MEASUREMENT DURING CARDIAC CATHETERIZATION,190,ACUTE MYOCARDIAL INFARCTION,05,DISEASES AND DISORDERS OF THE CIRCULATORY SYSTEM,4,Extreme,Extreme,Medical,Private Health Insurance,,,,,Y,187281.78,57687.14
Long Island,Nassau,2908000,000511,NYU Langone Hospital-Long Island,50 to 69,115,M,White,Spanish/Hispanic,1,Emergency,Home or Self Care,2020,CIR009,ACUTE MYOCARDIAL INFARCTION,,,190,ACUTE MYOCARDIAL INFARCTION,05,DISEASES AND DISORDERS OF THE CIRCULATORY SYSTEM,1,Minor,Minor,Medical,Blue Cross/Blue Shield,,,,,Y,33692.44,9734.39
Long Island,Nassau,2908000,000511,NYU Langone Hospital-Long Island,70 or Older,110,F,White,Not Span/Hispanic,6,Emergency,Home w/ Home Health Services,2020,CIR009,ACUTE MYOCARDIAL INFARCTION,OTR004,ISOLATION PROCEDURES,190,ACUTE MYOCARDIAL INFARCTION,05,DISEASES AND DISORDERS OF THE CIRCULATORY SYSTEM,2,Moderate,Major,Medical,Medicare,Blue Cross/Blue Shield,,,,Y,64948.74,21511.53
Long Island,Nassau,2908000,000511,NYU Langone Hospital-Long Island,70 or Older,110,M,Other Race,Not Span/Hispanic,1,Emergency,Short-term Hospital,2020,CIR009,ACUTE MYOCARDIAL INFARCTION,MAM005,MEASUREMENT DURING CARDIAC CATHETERIZATION,190,ACUTE MYOCARDIAL INFARCTION,05,DISEASES AND DISORDERS OF THE CIRCULATORY SYSTEM,2,Moderate,Moderate,Medical,Medicare,,,,,Y,59279.9,9931.71
Long Island,Nassau,2908000,000511,NYU Langone Hospital-Long Island,70 or Older,117,F,White,Not Span/Hispanic,2,Emergency,Home or Self Care,2020,CIR009,ACUTE MYOCARDIAL INFARCTION,MAM005,MEASUREMENT DURING CARDIAC CATHETERIZATION,190,ACUTE MYOCARDIAL INFARCTION,05,DISEASES AND DISORDERS OF THE CIRCULATORY SYSTEM,2,Moderate,Moderate,Medical,Medicare,Medicare,,,,Y,63867.21,12883.5
Long Island,Nassau,2908000,000511,NYU Langone Hospital-Long Island,70 or Older,115,M,White,Not Span/Hispanic,9,Emergency,Home w/ Home Health Services,2020,CIR009,ACUTE MYOCARDIAL INFARCTION,ESA001,HEMODIALYSIS,190,ACUTE MYOCARDIAL INFARCTION,05,DISEASES AND DISORDERS OF THE CIRCULATORY SYSTEM,3,Major,Major,Medical,Medicare,Medicare,,,,Y,124655.34,44383.7
Long Island,Nassau,2908000,000511,NYU Langone Hospital-Long Island,50 to 69,115,M,White,Not Span/Hispanic,8,Emergency,Home w/ Home Health Services,2020,CIR009,ACUTE MYOCARDIAL INFARCTION,MAM005,MEASUREMENT DURING CARDIAC CATHETERIZATION,190,ACUTE MYOCARDIAL INFARCTION,05,DISEASES AND DISORDERS OF THE CIRCULATORY SYSTEM,3,Major,Major,Medical,Private Health Insurance,,,,,Y,129826.5,33086.77
Long Island,Nassau,2908000,000511,NYU Langone Hospital-Long Island,70 or Older,115,F,White,Not Span/Hispanic,3,Emergency,Home or Self Care,2020,CIR009,ACUTE MYOCARDIAL INFARCTION,MAM005,MEASUREMENT DURING CARDIAC CATHETERIZATION,190,ACUTE MYOCARDIAL INFARCTION,05,DISEASES AND DISORDERS OF THE CIRCULATORY SYSTEM,2,Moderate,Moderate,Medical,Medicare,Blue Cross/Blue Shield,,,,Y,89473.18,17748.03
Long Island,Nassau,2908000,000511,NYU Langone Hospital-Long Island,70 or Older,117,M,White,Not Span/Hispanic,1,Emergency,Another Type Not Listed,2020,CIR009,ACUTE MYOCARDIAL INFARCTION,,,190,ACUTE MYOCARDIAL INFARCTION,05,DISEASES AND DISORDERS OF THE CIRCULATORY SYSTEM,2,Moderate,Moderate,Medical,Medicare,,,,,Y,20681.87,4989.73
Long Island,Nassau,2908000,000511,NYU Langone Hospital-Long Island,70 or Older,117,M,Other Race,Not Span/Hispanic,3,Emergency,Home w/ Home Health Services,2020,CIR009,ACUTE MYOCARDIAL INFARCTION,MAM005,MEASUREMENT DURING CARDIAC CATHETERIZATION,190,ACUTE MYOCARDIAL INFARCTION,05,DISEASES AND DISORDERS OF THE CIRCULATORY SYSTEM,2,Moderate,Major,Medical,Medicaid,,,,,Y,97471.29,21195.91
Long Island,Nassau,2908000,000511,NYU Langone Hospital-Long Island,50 to 69,115,F,Black/African American,Not Span/Hispanic,2,Emergency,Home w/ Home Health Services,2020,CIR009,ACUTE MYOCARDIAL INFARCTION,MAM005,MEASUREMENT DURING CARDIAC CATHETERIZATION,190,ACUTE MYOCARDIAL INFARCTION,05,DISEASES AND DISORDERS OF THE CIRCULATORY SYSTEM,2,Moderate,Moderate,Medical,Medicaid,,,,,Y,74331.16,16126.07
Long Island,Nassau,2908000,000511,NYU Langone Hospital-Long Island,70 or Older,115,M,White,Not Span/Hispanic,2,Emergency,Home or Self Care,2020,CIR009,ACUTE MYOCARDIAL INFARCTION,IMG001,CARDIAC AND CORONARY FLUOROSCOPY,190,ACUTE MYOCARDIAL INFARCTION,05,DISEASES AND DISORDERS OF THE CIRCULATORY SYSTEM,2,Moderate,Major,Medical,Medicare,Medicare,,,,Y,80258.63,20045.31
Long Island,Nassau,2908000,000511,NYU Langone Hospital-Long Island,70 or Older,119,M,White,Not Span/Hispanic,6,Emergency,Inpatient Rehabilitation Facility,2020,CIR009,ACUTE MYOCARDIAL INFARCTION,MAM005,MEASUREMENT DURING CARDIAC CATHETERIZATION,190,ACUTE MYOCARDIAL INFARCTION,05,DISEASES AND DISORDERS OF THE CIRCULATORY SYSTEM,4,Extreme,Extreme,Medical,Medicare,Medicare,,,,N,151108.63,38450.75
Long Island,Nassau,2908000,000511,NYU Langone Hospital-Long Island,50 to 69,115,M,Black/African American,Not Span/Hispanic,1,Emergency,Home or Self Care,2020,CIR009,ACUTE MYOCARDIAL INFARCTION,,,190,ACUTE MYOCARDIAL INFARCTION,05,DISEASES AND DISORDERS OF THE CIRCULATORY SYSTEM,2,Moderate,Moderate,Medical,Self-Pay,,,,,Y,26648.51,5363.1
Long Island,Nassau,2908000,000511,NYU Langone Hospital-Long Island,50 to 69,111,M,White,Not Span/Hispanic,7,Urgent,Home or Self Care,2020,CIR009,ACUTE MYOCARDIAL INFARCTION,MAM005,MEASUREMENT DURING CARDIAC CATHETERIZATION,190,ACUTE MYOCARDIAL INFARCTION,05,DISEASES AND DISORDERS OF THE CIRCULATORY SYSTEM,2,Moderate,Moderate,Medical,Medicare,Medicare,,,,N,146627.38,39962.53
Long Island,Nassau,2908000,000511,NYU Langone Hospital-Long Island,30 to 49,113,F,Other Race,Not Span/Hispanic,1,Emergency,Left Against Medical Advice,2020,CIR009,ACUTE MYOCARDIAL INFARCTION,,,190,ACUTE MYOCARDIAL INFARCTION,05,DISEASES AND DISORDERS OF THE CIRCULATORY SYSTEM,2,Moderate,Moderate,Medical,Medicaid,,,,,Y,17682.3,5642.84
Long Island,Nassau,2908000,000511,NYU Langone Hospital-Long Island,70 or Older,118,M,White,Spanish/Hispanic,2,Emergency,Home w/ Home Health Services,2020,CIR009,ACUTE MYOCARDIAL INFARCTION,MAM005,MEASUREMENT DURING CARDIAC CATHETERIZATION,190,ACUTE MYOCARDIAL INFARCTION,05,DISEASES AND DISORDERS OF THE CIRCULATORY SYSTEM,2,Moderate,Major,Medical,Medicare,,,,,N,82532.19,15070.36
Long Island,Nassau,2908000,000511,NYU Langone Hospital-Long Island,50 to 69,117,M,White,Not Span/Hispanic,5,Emergency,Home or Self Care,2020,CIR009,ACUTE MYOCARDIAL INFARCTION,ESA009,CARDIAC ASSISTANCE WITH BALLOON PUMP,190,ACUTE MYOCARDIAL INFARCTION,05,DISEASES AND DISORDERS OF THE CIRCULATORY SYSTEM,4,Extreme,Extreme,Medical,Medicare,,,,,N,80128.96,30632.84
Long Island,Nassau,2908000,000511,NYU Langone Hospital-Long Island,70 or Older,110,F,White,Not Span/Hispanic,1,Emergency,Home or Self Care,2020,CIR009,ACUTE MYOCARDIAL INFARCTION,MAM005,MEASUREMENT DURING CARDIAC CATHETERIZATION,190,ACUTE MYOCARDIAL INFARCTION,05,DISEASES AND DISORDERS OF THE CIRCULATORY SYSTEM,2,Moderate,Moderate,Medical,Medicare,Private Health Insurance,,,,Y,68048.86,11665.91
Long Island,Nassau,2908000,000511,NYU Langone Hospital-Long Island,70 or Older,115,M,White,Not Span/Hispanic,3,Emergency,Home or Self Care,2020,CIR009,ACUTE MYOCARDIAL INFARCTION,MAM004,CARDIAC STRESS TESTS,190,ACUTE MYOCARDIAL INFARCTION,05,DISEASES AND DISORDERS OF THE CIRCULATORY SYSTEM,2,Moderate,Major,Medical,Medicare,Medicare,,,,Y,84101.76,27367.1
Long Island,Nassau,2908000,000511,NYU Langone Hospital-Long Island,70 or Older,115,F,White,Not Span/Hispanic,2,Emergency,Home w/ Home Health Services,2020,CIR011,CORONARY ATHEROSCLEROSIS AND OTHER HEART DISEASE,MAM005,MEASUREMENT DURING CARDIAC CATHETERIZATION,190,ACUTE MYOCARDIAL INFARCTION,05,DISEASES AND DISORDERS OF THE CIRCULATORY SYSTEM,2,Moderate,Moderate,Medical,Medicare,Blue Cross/Blue Shield,,,,Y,72806.45,16023.76
Long Island,Nassau,2908000,000511,NYU Langone Hospital-Long Island,50 to 69,OOS,M,Other Race,Spanish/Hispanic,2,Emergency,Home or Self Care,2020,CIR011,CORONARY ATHEROSCLEROSIS AND OTHER HEART DISEASE,MAM005,MEASUREMENT DURING CARDIAC CATHETERIZATION,190,ACUTE MYOCARDIAL INFARCTION,05,DISEASES AND DISORDERS OF THE CIRCULATORY SYSTEM,2,Moderate,Major,Medical,Blue Cross/Blue Shield,,,,,Y,98342.45,20644.62
Long Island,Nassau,2908000,000511,NYU Langone Hospital-Long Island,70 or Older,115,M,White,Not Span/Hispanic,2,Emergency,Home or Self Care,2020,CIR011,CORONARY ATHEROSCLEROSIS AND OTHER HEART DISEASE,MAM005,MEASUREMENT DURING CARDIAC CATHETERIZATION,190,ACUTE MYOCARDIAL INFARCTION,05,DISEASES AND DISORDERS OF THE CIRCULATORY SYSTEM,2,Moderate,Moderate,Medical,Medicare,Medicare,,,,Y,87676.42,20269.66
Long Island,Nassau,2908000,000511,NYU Langone Hospital-Long Island,70 or Older,114,M,Black/African American,Not Span/Hispanic,7,Emergency,Inpatient Rehabilitation Facility,2020,CIR009,ACUTE MYOCARDIAL INFARCTION,MAM005,MEASUREMENT DURING CARDIAC CATHETERIZATION,190,ACUTE MYOCARDIAL INFARCTION,05,DISEASES AND DISORDERS OF THE CIRCULATORY SYSTEM,3,Major,Major,Medical,Miscellaneous/Other,Medicare,Blue Cross/Blue Shield,,,Y,135231.4,40055.1
Long Island,Nassau,2908000,000511,NYU Langone Hospital-Long Island,70 or Older,119,F,White,Not Span/Hispanic,5,Emergency,Home w/ Home Health Services,2020,CIR009,ACUTE MYOCARDIAL INFARCTION,IMG001,CARDIAC AND CORONARY FLUOROSCOPY,190,ACUTE MYOCARDIAL INFARCTION,05,DISEASES AND DISORDERS OF THE CIRCULATORY SYSTEM,3,Major,Major,Medical,Medicare,Blue Cross/Blue Shield,,,,N,81166.52,25673.04
Long Island,Nassau,2908000,000511,NYU Langone Hospital-Long Island,50 to 69,117,M,White,Not Span/Hispanic,2,Emergency,Home or Self Care,2020,CIR009,ACUTE MYOCARDIAL INFARCTION,MAM005,MEASUREMENT DURING CARDIAC CATHETERIZATION,190,ACUTE MYOCARDIAL INFARCTION,05,DISEASES AND DISORDERS OF THE CIRCULATORY SYSTEM,2,Moderate,Moderate,Medical,Blue Cross/Blue Shield,,,,,Y,97222.69,19197.44
Long Island,Nassau,2908000,000511,NYU Langone Hospital-Long Island,70 or Older,115,M,White,Not Span/Hispanic,2,Emergency,Home w/ Home Health Services,2020,CIR009,ACUTE MYOCARDIAL INFARCTION,OTR004,ISOLATION PROCEDURES,190,ACUTE MYOCARDIAL INFARCTION,05,DISEASES AND DISORDERS OF THE CIRCULATORY SYSTEM,2,Moderate,Moderate,Medical,Medicare,Medicare,,,,Y,53299.82,12803.89
Long Island,Nassau,2908000,000511,NYU Langone Hospital-Long Island,50 to 69,118,M,White,Not Span/Hispanic,1,Emergency,Home or Self Care,2020,CIR011,CORONARY ATHEROSCLEROSIS AND OTHER HEART DISEASE,MAM005,MEASUREMENT DURING CARDIAC CATHETERIZATION,190,ACUTE MYOCARDIAL INFARCTION,05,DISEASES AND DISORDERS OF THE CIRCULATORY SYSTEM,1,Minor,Minor,Medical,Private Health Insurance,,,,,N,40159.47,8645.15
Long Island,Nassau,2908000,000511,NYU Langone Hospital-Long Island,70 or Older,110,F,White,Not Span/Hispanic,5,Emergency,Home or Self Care,2020,CIR009,ACUTE MYOCARDIAL INFARCTION,MAM005,MEASUREMENT DURING CARDIAC CATHETERIZATION,190,ACUTE MYOCARDIAL INFARCTION,05,DISEASES AND DISORDERS OF THE CIRCULATORY SYSTEM,1,Minor,Minor,Medical,Medicare,Blue Cross/Blue Shield,,,,Y,93657.58,28673.91
Long Island,Nassau,2908000,000511,NYU Langone Hospital-Long Island,50 to 69,117,M,White,Unknown,2,Emergency,Home or Self Care,2020,CIR009,ACUTE MYOCARDIAL INFARCTION,MAM005,MEASUREMENT DURING CARDIAC CATHETERIZATION,190,ACUTE MYOCARDIAL INFARCTION,05,DISEASES AND DISORDERS OF THE CIRCULATORY SYSTEM,2,Moderate,Moderate,Medical,Blue Cross/Blue Shield,,,,,Y,92675.19,19885.96
Long Island,Nassau,2908000,000511,NYU Langone Hospital-Long Island,70 or Older,115,F,White,Not Span/Hispanic,1,Emergency,Home or Self Care,2020,CIR009,ACUTE MYOCARDIAL INFARCTION,MAM005,MEASUREMENT DURING CARDIAC CATHETERIZATION,190,ACUTE MYOCARDIAL INFARCTION,05,DISEASES AND DISORDERS OF THE CIRCULATORY SYSTEM,3,Major,Major,Medical,Medicare,Blue Cross/Blue Shield,,,,Y,60755,11234.48
Long Island,Nassau,2908000,000511,NYU Langone Hospital-Long Island,50 to 69,117,F,Black/African American,Not Span/Hispanic,1,Emergency,Home or Self Care,2020,CIR011,CORONARY ATHEROSCLEROSIS AND OTHER HEART DISEASE,MAM005,MEASUREMENT DURING CARDIAC CATHETERIZATION,190,ACUTE MYOCARDIAL INFARCTION,05,DISEASES AND DISORDERS OF THE CIRCULATORY SYSTEM,2,Moderate,Moderate,Medical,Medicare,Medicare,,,,N,43091.5,9039.03