Hospital Service Area,Hospital County,Operating Certificate Number,Permanent Facility Id,Facility Name,Age Group,Zip Code - 3 digits,Gender,Race,Ethnicity,Length of Stay,Type of Admission,Patient Disposition,Discharge Year,CCS Diagnosis Code,CCS Diagnosis Description,CCS Procedure Code,CCS Procedure Description,APR DRG Code,APR DRG Description,APR MDC Code,APR MDC Description,APR Severity of Illness Code,APR Severity of Illness Description,APR Risk of Mortality,APR Medical Surgical Description,Payment Typology 1,Payment Typology 2,Payment Typology 3,Birth Weight,Abortion Edit Indicator,Emergency Department Indicator,Total Charges,Total Costs
Long Island,Suffolk,5123000,000885,Long Island Community Hospital,70 or Older,117,F,White,Not Span/Hispanic,6,Emergency,Skilled Nursing Home,2020,CIR009,ACUTE MYOCARDIAL INFARCTION,MAM006,PACEMAKER AND DEFIBRILLATOR INTERROGATION,190,ACUTE MYOCARDIAL INFARCTION,05,DISEASES AND DISORDERS OF THE CIRCULATORY SYSTEM,2,Moderate,Moderate,Medical,Medicare,Medicare,Private Health Insurance,,,Y,63789.44,9080.51
Long Island,Suffolk,5123000,000885,Long Island Community Hospital,70 or Older,117,M,White,Not Span/Hispanic,5,Emergency,Home or Self Care,2020,CIR009,ACUTE MYOCARDIAL INFARCTION,MAM006,PACEMAKER AND DEFIBRILLATOR INTERROGATION,190,ACUTE MYOCARDIAL INFARCTION,05,DISEASES AND DISORDERS OF THE CIRCULATORY SYSTEM,3,Major,Major,Medical,Medicare,Medicare,Medicaid,,,Y,46665.24,9226.77
Long Island,Suffolk,5123000,000885,Long Island Community Hospital,70 or Older,117,M,White,Not Span/Hispanic,2,Emergency,Short-term Hospital,2020,CIR009,ACUTE MYOCARDIAL INFARCTION,MAM005,MEASUREMENT DURING CARDIAC CATHETERIZATION,190,ACUTE MYOCARDIAL INFARCTION,05,DISEASES AND DISORDERS OF THE CIRCULATORY SYSTEM,4,Extreme,Extreme,Medical,Medicare,,,,,Y,52940.83,8921.9
Long Island,Suffolk,5123000,000885,Long Island Community Hospital,70 or Older,117,M,White,Not Span/Hispanic,3,Emergency,Short-term Hospital,2020,CIR009,ACUTE MYOCARDIAL INFARCTION,IMG001,CARDIAC AND CORONARY FLUOROSCOPY,190,ACUTE MYOCARDIAL INFARCTION,05,DISEASES AND DISORDERS OF THE CIRCULATORY SYSTEM,3,Major,Major,Medical,Medicare,Medicare,Medicaid,,,Y,40777.77,7954.32
Long Island,Suffolk,5123000,000885,Long Island Community Hospital,70 or Older,119,M,Black/African American,Not Span/Hispanic,7,Emergency,Skilled Nursing Home,2020,CIR009,ACUTE MYOCARDIAL INFARCTION,IMG001,CARDIAC AND CORONARY FLUOROSCOPY,190,ACUTE MYOCARDIAL INFARCTION,05,DISEASES AND DISORDERS OF THE CIRCULATORY SYSTEM,1,Minor,Major,Medical,Medicare,Medicaid,,,,Y,77066.83,13948.18
Long Island,Suffolk,5123000,000885,Long Island Community Hospital,70 or Older,119,F,White,Not Span/Hispanic,1,Emergency,Home or Self Care,2020,CIR009,ACUTE MYOCARDIAL INFARCTION,MAM005,MEASUREMENT DURING CARDIAC CATHETERIZATION,190,ACUTE MYOCARDIAL INFARCTION,05,DISEASES AND DISORDERS OF THE CIRCULATORY SYSTEM,1,Minor,Moderate,Medical,Medicare,Medicare,Blue Cross/Blue Shield,,,Y,32383.52,5766.75
Long Island,Suffolk,5123000,000885,Long Island Community Hospital,70 or Older,117,F,White,Not Span/Hispanic,2,Emergency,Home or Self Care,2020,CIR009,ACUTE MYOCARDIAL INFARCTION,MAM005,MEASUREMENT DURING CARDIAC CATHETERIZATION,190,ACUTE MYOCARDIAL INFARCTION,05,DISEASES AND DISORDERS OF THE CIRCULATORY SYSTEM,2,Moderate,Minor,Medical,Medicare,Medicare,Private Health Insurance,,,Y,42498.99,7559.45
Long Island,Suffolk,5123000,000885,Long Island Community Hospital,70 or Older,117,F,White,Not Span/Hispanic,2,Emergency,Skilled Nursing Home,2020,CIR009,ACUTE MYOCARDIAL INFARCTION,,,190,ACUTE MYOCARDIAL INFARCTION,05,DISEASES AND DISORDERS OF THE CIRCULATORY SYSTEM,1,Minor,Major,Medical,Medicare,Medicare,Medicaid,,,Y,23006.41,3786.44
Long Island,Suffolk,5123000,000885,Long Island Community Hospital,70 or Older,119,M,White,Not Span/Hispanic,12,Emergency,Short-term Hospital,2020,CIR009,ACUTE MYOCARDIAL INFARCTION,MAM005,MEASUREMENT DURING CARDIAC CATHETERIZATION,190,ACUTE MYOCARDIAL INFARCTION,05,DISEASES AND DISORDERS OF THE CIRCULATORY SYSTEM,4,Extreme,Extreme,Medical,Medicare,,,,,Y,151668.89,25101.16
Long Island,Suffolk,5123000,000885,Long Island Community Hospital,50 to 69,117,M,White,Not Span/Hispanic,1,Emergency,Short-term Hospital,2020,CIR009,ACUTE MYOCARDIAL INFARCTION,MAM005,MEASUREMENT DURING CARDIAC CATHETERIZATION,190,ACUTE MYOCARDIAL INFARCTION,05,DISEASES AND DISORDERS OF THE CIRCULATORY SYSTEM,4,Extreme,Extreme,Medical,Self-Pay,,,,,Y,35271.86,6222.53
Long Island,Suffolk,5123000,000885,Long Island Community Hospital,70 or Older,117,F,White,Not Span/Hispanic,4,Emergency,Short-term Hospital,2020,CIR009,ACUTE MYOCARDIAL INFARCTION,MAM005,MEASUREMENT DURING CARDIAC CATHETERIZATION,190,ACUTE MYOCARDIAL INFARCTION,05,DISEASES AND DISORDERS OF THE CIRCULATORY SYSTEM,1,Minor,Moderate,Medical,Medicare,Medicare,,,,Y,45062.08,9258.63
Long Island,Suffolk,5123000,000885,Long Island Community Hospital,70 or Older,117,F,White,Not Span/Hispanic,7,Emergency,Expired,2020,CIR009,ACUTE MYOCARDIAL INFARCTION,ESA004,NON-INVASIVE VENTILATION,190,ACUTE MYOCARDIAL INFARCTION,05,DISEASES AND DISORDERS OF THE CIRCULATORY SYSTEM,4,Extreme,Extreme,Medical,Medicare,Medicare,Blue Cross/Blue Shield,,,Y,98867.99,14304.64
Long Island,Suffolk,5123000,000885,Long Island Community Hospital,70 or Older,117,M,White,Not Span/Hispanic,9,Emergency,Home w/ Home Health Services,2020,CIR009,ACUTE MYOCARDIAL INFARCTION,MAM005,MEASUREMENT DURING CARDIAC CATHETERIZATION,190,ACUTE MYOCARDIAL INFARCTION,05,DISEASES AND DISORDERS OF THE CIRCULATORY SYSTEM,3,Major,Moderate,Medical,Medicare,,,,,Y,86163.63,16650.88
Long Island,Suffolk,5123000,000885,Long Island Community Hospital,50 to 69,117,F,White,Not Span/Hispanic,1,Emergency,Home or Self Care,2020,CIR009,ACUTE MYOCARDIAL INFARCTION,MAM005,MEASUREMENT DURING CARDIAC CATHETERIZATION,190,ACUTE MYOCARDIAL INFARCTION,05,DISEASES AND DISORDERS OF THE CIRCULATORY SYSTEM,1,Minor,Minor,Medical,Medicare,,,,,Y,31051.2,5560.87
Long Island,Suffolk,5123000,000885,Long Island Community Hospital,50 to 69,119,F,Other Race,Not Span/Hispanic,1,Emergency,Short-term Hospital,2020,CIR009,ACUTE MYOCARDIAL INFARCTION,ESA004,NON-INVASIVE VENTILATION,190,ACUTE MYOCARDIAL INFARCTION,05,DISEASES AND DISORDERS OF THE CIRCULATORY SYSTEM,3,Major,Major,Medical,Blue Cross/Blue Shield,,,,,Y,45400.97,6430.3
Long Island,Suffolk,5123000,000885,Long Island Community Hospital,50 to 69,117,M,White,Not Span/Hispanic,2,Emergency,Home or Self Care,2020,CIR009,ACUTE MYOCARDIAL INFARCTION,ESA004,NON-INVASIVE VENTILATION,190,ACUTE MYOCARDIAL INFARCTION,05,DISEASES AND DISORDERS OF THE CIRCULATORY SYSTEM,2,Moderate,Major,Medical,Private Health Insurance,,,,,Y,44875.28,5845.68
Long Island,Suffolk,5123000,000885,Long Island Community Hospital,50 to 69,119,M,White,Not Span/Hispanic,5,Emergency,Home or Self Care,2020,CIR009,ACUTE MYOCARDIAL INFARCTION,,,190,ACUTE MYOCARDIAL INFARCTION,05,DISEASES AND DISORDERS OF THE CIRCULATORY SYSTEM,3,Major,Major,Medical,Medicare,Medicare,,,,Y,52458.15,9508.25
Long Island,Suffolk,5123000,000885,Long Island Community Hospital,70 or Older,117,F,White,Not Span/Hispanic,2,Emergency,Home w/ Home Health Services,2020,CIR009,ACUTE MYOCARDIAL INFARCTION,OTR004,ISOLATION PROCEDURES,190,ACUTE MYOCARDIAL INFARCTION,05,DISEASES AND DISORDERS OF THE CIRCULATORY SYSTEM,2,Moderate,Major,Medical,Medicare,Medicare,Private Health Insurance,,,Y,46875.71,4247.31
Long Island,Suffolk,5123000,000885,Long Island Community Hospital,70 or Older,117,F,White,Not Span/Hispanic,2,Emergency,Home or Self Care,2020,CIR009,ACUTE MYOCARDIAL INFARCTION,MAM005,MEASUREMENT DURING CARDIAC CATHETERIZATION,190,ACUTE MYOCARDIAL INFARCTION,05,DISEASES AND DISORDERS OF THE CIRCULATORY SYSTEM,1,Minor,Minor,Medical,Medicare,,,,,Y,36907.78,6751.86
Long Island,Suffolk,5123000,000885,Long Island Community Hospital,70 or Older,117,M,White,Not Span/Hispanic,2,Emergency,Expired,2020,CIR009,ACUTE MYOCARDIAL INFARCTION,RES007,AIRWAY INTUBATION,190,ACUTE MYOCARDIAL INFARCTION,05,DISEASES AND DISORDERS OF THE CIRCULATORY SYSTEM,4,Extreme,Extreme,Medical,Medicare,,,,,Y,56967.87,8681
Long Island,Suffolk,5123000,000885,Long Island Community Hospital,70 or Older,117,F,White,Not Span/Hispanic,1,Emergency,Short-term Hospital,2020,CIR009,ACUTE MYOCARDIAL INFARCTION,,,190,ACUTE MYOCARDIAL INFARCTION,05,DISEASES AND DISORDERS OF THE CIRCULATORY SYSTEM,2,Moderate,Major,Medical,Medicare,,,,,Y,19778.18,2639.79
Long Island,Suffolk,5123000,000885,Long Island Community Hospital,70 or Older,117,F,White,Not Span/Hispanic,4,Emergency,Home or Self Care,2020,CIR009,ACUTE MYOCARDIAL INFARCTION,MAM005,MEASUREMENT DURING CARDIAC CATHETERIZATION,190,ACUTE MYOCARDIAL INFARCTION,05,DISEASES AND DISORDERS OF THE CIRCULATORY SYSTEM,4,Extreme,Extreme,Medical,Medicare,Medicare,Blue Cross/Blue Shield,,,Y,59349.75,10965.6
Long Island,Suffolk,5123000,000885,Long Island Community Hospital,70 or Older,119,F,White,Not Span/Hispanic,1,Emergency,Expired,2020,CIR009,ACUTE MYOCARDIAL INFARCTION,ESA005,CARDIAC CHEST COMPRESSION,190,ACUTE MYOCARDIAL INFARCTION,05,DISEASES AND DISORDERS OF THE CIRCULATORY SYSTEM,2,Moderate,Major,Medical,Medicare,Medicare,Blue Cross/Blue Shield,,,Y,20449.7,2498.87
Long Island,Suffolk,5123000,000885,Long Island Community Hospital,70 or Older,117,M,White,Not Span/Hispanic,8,Emergency,Home w/ Home Health Services,2020,CIR009,ACUTE MYOCARDIAL INFARCTION,OTR004,ISOLATION PROCEDURES,190,ACUTE MYOCARDIAL INFARCTION,05,DISEASES AND DISORDERS OF THE CIRCULATORY SYSTEM,4,Extreme,Extreme,Medical,Medicare,Medicare,Blue Cross/Blue Shield,,,Y,49306.7,11387.94
Long Island,Suffolk,5123000,000885,Long Island Community Hospital,70 or Older,117,F,White,Not Span/Hispanic,7,Emergency,Home or Self Care,2020,CIR009,ACUTE MYOCARDIAL INFARCTION,,,190,ACUTE MYOCARDIAL INFARCTION,05,DISEASES AND DISORDERS OF THE CIRCULATORY SYSTEM,4,Extreme,Extreme,Medical,Medicare,Medicare,Medicaid,,,Y,36569.24,9297.1
Long Island,Suffolk,5123000,000885,Long Island Community Hospital,70 or Older,117,M,White,Not Span/Hispanic,51,Emergency,Home or Self Care,2020,CIR009,ACUTE MYOCARDIAL INFARCTION,SUD001,SUBSTANCE USE DETOXIFICATION,190,ACUTE MYOCARDIAL INFARCTION,05,DISEASES AND DISORDERS OF THE CIRCULATORY SYSTEM,2,Moderate,Moderate,Medical,Medicare,Medicare,Medicaid,,,Y,228885.41,62937.49
Long Island,Suffolk,5123000,000885,Long Island Community Hospital,70 or Older,119,F,White,Not Span/Hispanic,2,Emergency,Home or Self Care,2020,CIR009,ACUTE MYOCARDIAL INFARCTION,,,190,ACUTE MYOCARDIAL INFARCTION,05,DISEASES AND DISORDERS OF THE CIRCULATORY SYSTEM,1,Minor,Moderate,Medical,Private Health Insurance,Medicare,,,,Y,21981.45,3906.18
Long Island,Suffolk,5123000,000885,Long Island Community Hospital,50 to 69,119,M,White,Not Span/Hispanic,1,Emergency,Expired,2020,CIR009,ACUTE MYOCARDIAL INFARCTION,ESA003,MECHANICAL VENTILATION,190,ACUTE MYOCARDIAL INFARCTION,05,DISEASES AND DISORDERS OF THE CIRCULATORY SYSTEM,4,Extreme,Extreme,Medical,Private Health Insurance,,,,,Y,25106.18,3694.24
Long Island,Suffolk,5123000,000885,Long Island Community Hospital,50 to 69,117,M,Black/African American,Not Span/Hispanic,2,Emergency,Home or Self Care,2020,CIR009,ACUTE MYOCARDIAL INFARCTION,MAM005,MEASUREMENT DURING CARDIAC CATHETERIZATION,190,ACUTE MYOCARDIAL INFARCTION,05,DISEASES AND DISORDERS OF THE CIRCULATORY SYSTEM,2,Moderate,Moderate,Medical,Private Health Insurance,,,,,Y,46789.94,7811.66
Long Island,Suffolk,5123000,000885,Long Island Community Hospital,50 to 69,117,F,Other Race,Not Span/Hispanic,2,Emergency,Home or Self Care,2020,CIR009,ACUTE MYOCARDIAL INFARCTION,MAM005,MEASUREMENT DURING CARDIAC CATHETERIZATION,190,ACUTE MYOCARDIAL INFARCTION,05,DISEASES AND DISORDERS OF THE CIRCULATORY SYSTEM,3,Major,Major,Medical,Private Health Insurance,Medicaid,,,,Y,48894.88,8292.82
Long Island,Suffolk,5123000,000885,Long Island Community Hospital,70 or Older,117,M,Black/African American,Not Span/Hispanic,1,Emergency,Short-term Hospital,2020,CIR009,ACUTE MYOCARDIAL INFARCTION,ESA004,NON-INVASIVE VENTILATION,190,ACUTE MYOCARDIAL INFARCTION,05,DISEASES AND DISORDERS OF THE CIRCULATORY SYSTEM,4,Extreme,Extreme,Medical,Private Health Insurance,Private Health Insurance,,,,Y,19066.51,2311.16
Long Island,Suffolk,5123000,000885,Long Island Community Hospital,50 to 69,117,M,White,Not Span/Hispanic,14,Emergency,Home w/ Home Health Services,2020,CIR009,ACUTE MYOCARDIAL INFARCTION,ADM003,ADMINISTRATION OF ALBUMIN AND GLOBULIN,190,ACUTE MYOCARDIAL INFARCTION,05,DISEASES AND DISORDERS OF THE CIRCULATORY SYSTEM,3,Major,Major,Medical,Medicare,,,,,Y,262692.05,44444.22
Long Island,Suffolk,5123000,000885,Long Island Community Hospital,50 to 69,119,F,White,Not Span/Hispanic,1,Emergency,Home or Self Care,2020,CIR009,ACUTE MYOCARDIAL INFARCTION,MAM005,MEASUREMENT DURING CARDIAC CATHETERIZATION,190,ACUTE MYOCARDIAL INFARCTION,05,DISEASES AND DISORDERS OF THE CIRCULATORY SYSTEM,1,Minor,Minor,Medical,Blue Cross/Blue Shield,,,,,Y,31277.13,5606.13
Long Island,Suffolk,5123000,000885,Long Island Community Hospital,70 or Older,117,F,White,Not Span/Hispanic,2,Emergency,Home or Self Care,2020,CIR009,ACUTE MYOCARDIAL INFARCTION,OTR004,ISOLATION PROCEDURES,190,ACUTE MYOCARDIAL INFARCTION,05,DISEASES AND DISORDERS OF THE CIRCULATORY SYSTEM,2,Moderate,Major,Medical,Medicare,,,,,Y,20673.27,3608.33
Long Island,Suffolk,5123000,000885,Long Island Community Hospital,50 to 69,119,F,White,Not Span/Hispanic,4,Emergency,Short-term Hospital,2020,CIR009,ACUTE MYOCARDIAL INFARCTION,MAM005,MEASUREMENT DURING CARDIAC CATHETERIZATION,190,ACUTE MYOCARDIAL INFARCTION,05,DISEASES AND DISORDERS OF THE CIRCULATORY SYSTEM,2,Moderate,Major,Medical,Medicaid,,,,,Y,55210.62,10014.74
Long Island,Suffolk,5123000,000885,Long Island Community Hospital,70 or Older,117,M,White,Not Span/Hispanic,4,Emergency,Home w/ Home Health Services,2020,CIR009,ACUTE MYOCARDIAL INFARCTION,OTR004,ISOLATION PROCEDURES,190,ACUTE MYOCARDIAL INFARCTION,05,DISEASES AND DISORDERS OF THE CIRCULATORY SYSTEM,3,Major,Major,Medical,Medicare,,,,,Y,62378.71,11530.04
Long Island,Suffolk,5123000,000885,Long Island Community Hospital,50 to 69,119,F,White,Not Span/Hispanic,1,Emergency,Left Against Medical Advice,2020,CIR009,ACUTE MYOCARDIAL INFARCTION,,,190,ACUTE MYOCARDIAL INFARCTION,05,DISEASES AND DISORDERS OF THE CIRCULATORY SYSTEM,2,Moderate,Major,Medical,Medicaid,,,,,Y,31875.05,2769.91
Long Island,Suffolk,5123000,000885,Long Island Community Hospital,50 to 69,117,M,White,Not Span/Hispanic,6,Emergency,Home or Self Care,2020,CIR009,ACUTE MYOCARDIAL INFARCTION,IMG001,CARDIAC AND CORONARY FLUOROSCOPY,190,ACUTE MYOCARDIAL INFARCTION,05,DISEASES AND DISORDERS OF THE CIRCULATORY SYSTEM,4,Extreme,Extreme,Medical,Medicare,,,,,Y,83757.01,23699.1
Long Island,Suffolk,5123000,000885,Long Island Community Hospital,50 to 69,119,M,Black/African American,Not Span/Hispanic,1,Emergency,Left Against Medical Advice,2020,CIR009,ACUTE MYOCARDIAL INFARCTION,SUD002,PHARMACOTHERAPY FOR SUBSTANCE USE,190,ACUTE MYOCARDIAL INFARCTION,05,DISEASES AND DISORDERS OF THE CIRCULATORY SYSTEM,1,Minor,Minor,Medical,Medicare,,,,,Y,13123.63,2267.49
Long Island,Suffolk,5123000,000885,Long Island Community Hospital,50 to 69,117,M,White,Not Span/Hispanic,1,Emergency,Expired,2020,CIR009,ACUTE MYOCARDIAL INFARCTION,ESA007,CARDIAC PACING,190,ACUTE MYOCARDIAL INFARCTION,05,DISEASES AND DISORDERS OF THE CIRCULATORY SYSTEM,3,Major,Major,Medical,Private Health Insurance,Medicaid,,,,Y,37622.96,6354.92
Long Island,Suffolk,5123000,000885,Long Island Community Hospital,70 or Older,119,M,White,Not Span/Hispanic,3,Emergency,Short-term Hospital,2020,CIR009,ACUTE MYOCARDIAL INFARCTION,IMG001,CARDIAC AND CORONARY FLUOROSCOPY,190,ACUTE MYOCARDIAL INFARCTION,05,DISEASES AND DISORDERS OF THE CIRCULATORY SYSTEM,3,Major,Extreme,Medical,Medicare,Medicare,Private Health Insurance,,,Y,48807.47,8859.99
Long Island,Suffolk,5123000,000885,Long Island Community Hospital,70 or Older,117,F,White,Not Span/Hispanic,2,Emergency,Home w/ Home Health Services,2020,CIR009,ACUTE MYOCARDIAL INFARCTION,,,190,ACUTE MYOCARDIAL INFARCTION,05,DISEASES AND DISORDERS OF THE CIRCULATORY SYSTEM,2,Moderate,Major,Medical,Medicare,Medicare,Blue Cross/Blue Shield,,,Y,27240.76,4168.41
Long Island,Suffolk,5123000,000885,Long Island Community Hospital,70 or Older,117,M,White,Not Span/Hispanic,2,Emergency,Left Against Medical Advice,2020,CIR009,ACUTE MYOCARDIAL INFARCTION,,,190,ACUTE MYOCARDIAL INFARCTION,05,DISEASES AND DISORDERS OF THE CIRCULATORY SYSTEM,3,Major,Major,Medical,Medicare,Medicare,,,,Y,57305.65,5402.66
Long Island,Suffolk,5123000,000885,Long Island Community Hospital,50 to 69,117,M,White,Not Span/Hispanic,1,Emergency,Short-term Hospital,2020,CIR009,ACUTE MYOCARDIAL INFARCTION,MAM005,MEASUREMENT DURING CARDIAC CATHETERIZATION,190,ACUTE MYOCARDIAL INFARCTION,05,DISEASES AND DISORDERS OF THE CIRCULATORY SYSTEM,1,Minor,Minor,Medical,Private Health Insurance,,,,,Y,30507.36,5493.66
Long Island,Suffolk,5123000,000885,Long Island Community Hospital,18 to 29,117,M,Black/African American,Not Span/Hispanic,1,Emergency,Home or Self Care,2020,CIR009,ACUTE MYOCARDIAL INFARCTION,MAM005,MEASUREMENT DURING CARDIAC CATHETERIZATION,190,ACUTE MYOCARDIAL INFARCTION,05,DISEASES AND DISORDERS OF THE CIRCULATORY SYSTEM,2,Moderate,Minor,Medical,Private Health Insurance,,,,,Y,29888.16,5454.28
Long Island,Suffolk,5123000,000885,Long Island Community Hospital,50 to 69,117,M,White,Not Span/Hispanic,1,Emergency,Short-term Hospital,2020,CIR009,ACUTE MYOCARDIAL INFARCTION,ESA009,CARDIAC ASSISTANCE WITH BALLOON PUMP,190,ACUTE MYOCARDIAL INFARCTION,05,DISEASES AND DISORDERS OF THE CIRCULATORY SYSTEM,4,Extreme,Extreme,Medical,Medicare,Medicare,Private Health Insurance,,,Y,41999.69,6557.25
Long Island,Suffolk,5123000,000885,Long Island Community Hospital,30 to 49,119,M,Other Race,Not Span/Hispanic,20,Emergency,Short-term Hospital,2020,CIR009,ACUTE MYOCARDIAL INFARCTION,ESA003,MECHANICAL VENTILATION,190,ACUTE MYOCARDIAL INFARCTION,05,DISEASES AND DISORDERS OF THE CIRCULATORY SYSTEM,4,Extreme,Extreme,Medical,Blue Cross/Blue Shield,,,,,Y,255775.84,45639.73
Long Island,Suffolk,5123000,000885,Long Island Community Hospital,70 or Older,119,M,Black/African American,Not Span/Hispanic,2,Emergency,Home or Self Care,2020,CIR009,ACUTE MYOCARDIAL INFARCTION,ESA001,HEMODIALYSIS,190,ACUTE MYOCARDIAL INFARCTION,05,DISEASES AND DISORDERS OF THE CIRCULATORY SYSTEM,3,Major,Major,Medical,Medicare,Medicaid,,,,Y,50745.49,5052.24
Long Island,Suffolk,5123000,000885,Long Island Community Hospital,70 or Older,117,F,White,Not Span/Hispanic,2,Emergency,Home or Self Care,2020,CIR009,ACUTE MYOCARDIAL INFARCTION,MAM005,MEASUREMENT DURING CARDIAC CATHETERIZATION,190,ACUTE MYOCARDIAL INFARCTION,05,DISEASES AND DISORDERS OF THE CIRCULATORY SYSTEM,2,Moderate,Moderate,Medical,Medicare,Medicare,Blue Cross/Blue Shield,,,Y,47934.36,7864.04
Long Island,Suffolk,5123000,000885,Long Island Community Hospital,70 or Older,117,M,White,Not Span/Hispanic,1,Emergency,Short-term Hospital,2020,CIR009,ACUTE MYOCARDIAL INFARCTION,IMG001,CARDIAC AND CORONARY FLUOROSCOPY,190,ACUTE MYOCARDIAL INFARCTION,05,DISEASES AND DISORDERS OF THE CIRCULATORY SYSTEM,1,Minor,Moderate,Medical,Medicare,Medicare,,,,Y,48051.45,5857.1
Long Island,Suffolk,5123000,000885,Long Island Community Hospital,70 or Older,117,M,White,Not Span/Hispanic,5,Emergency,Home or Self Care,2020,CIR009,ACUTE MYOCARDIAL INFARCTION,GIS001,ESOPHAGOGASTRODUODENOSCOPY (EGD) WITH BIOPSY,190,ACUTE MYOCARDIAL INFARCTION,05,DISEASES AND DISORDERS OF THE CIRCULATORY SYSTEM,3,Major,Major,Medical,Medicare,,,,,Y,68064,13738.17
Long Island,Suffolk,5123000,000885,Long Island Community Hospital,50 to 69,117,M,White,Not Span/Hispanic,8,Emergency,Short-term Hospital,2020,CIR009,ACUTE MYOCARDIAL INFARCTION,ESA003,MECHANICAL VENTILATION,190,ACUTE MYOCARDIAL INFARCTION,05,DISEASES AND DISORDERS OF THE CIRCULATORY SYSTEM,4,Extreme,Extreme,Medical,Private Health Insurance,,,,,Y,133484.09,21097.16
Long Island,Suffolk,5123000,000885,Long Island Community Hospital,30 to 49,119,F,White,Not Span/Hispanic,5,Emergency,Home or Self Care,2020,CIR009,ACUTE MYOCARDIAL INFARCTION,MAM005,MEASUREMENT DURING CARDIAC CATHETERIZATION,190,ACUTE MYOCARDIAL INFARCTION,05,DISEASES AND DISORDERS OF THE CIRCULATORY SYSTEM,2,Moderate,Moderate,Medical,Self-Pay,,,,,Y,60868.95,11135.07
Long Island,Suffolk,5123000,000885,Long Island Community Hospital,70 or Older,117,M,White,Not Span/Hispanic,2,Emergency,Home or Self Care,2020,CIR009,ACUTE MYOCARDIAL INFARCTION,,,190,ACUTE MYOCARDIAL INFARCTION,05,DISEASES AND DISORDERS OF THE CIRCULATORY SYSTEM,1,Minor,Moderate,Medical,Medicare,,,,,Y,39304.98,4129.8
Long Island,Suffolk,5123000,000885,Long Island Community Hospital,50 to 69,117,M,White,Not Span/Hispanic,1,Emergency,Short-term Hospital,2020,CIR009,ACUTE MYOCARDIAL INFARCTION,MAM005,MEASUREMENT DURING CARDIAC CATHETERIZATION,190,ACUTE MYOCARDIAL INFARCTION,05,DISEASES AND DISORDERS OF THE CIRCULATORY SYSTEM,1,Minor,Minor,Medical,Medicaid,,,,,Y,40386.17,6150.59
Long Island,Suffolk,5123000,000885,Long Island Community Hospital,70 or Older,117,M,Black/African American,Not Span/Hispanic,2,Emergency,Home or Self Care,2020,CIR009,ACUTE MYOCARDIAL INFARCTION,MAM005,MEASUREMENT DURING CARDIAC CATHETERIZATION,190,ACUTE MYOCARDIAL INFARCTION,05,DISEASES AND DISORDERS OF THE CIRCULATORY SYSTEM,1,Minor,Moderate,Medical,Medicare,Medicare,Private Health Insurance,,,Y,37690,6854.94
Long Island,Suffolk,5123000,000885,Long Island Community Hospital,50 to 69,117,M,White,Not Span/Hispanic,6,Emergency,Home or Self Care,2020,CIR009,ACUTE MYOCARDIAL INFARCTION,,,190,ACUTE MYOCARDIAL INFARCTION,05,DISEASES AND DISORDERS OF THE CIRCULATORY SYSTEM,4,Extreme,Extreme,Medical,Private Health Insurance,,,,,Y,56862.79,11586.02
Long Island,Suffolk,5123000,000885,Long Island Community Hospital,50 to 69,119,M,Black/African American,Not Span/Hispanic,1,Emergency,Cancer Center or Children's Hospital,2020,CIR009,ACUTE MYOCARDIAL INFARCTION,MAM005,MEASUREMENT DURING CARDIAC CATHETERIZATION,190,ACUTE MYOCARDIAL INFARCTION,05,DISEASES AND DISORDERS OF THE CIRCULATORY SYSTEM,1,Minor,Minor,Medical,Self-Pay,,,,,Y,31364.65,5769.63
Long Island,Suffolk,5123000,000885,Long Island Community Hospital,50 to 69,117,M,White,Not Span/Hispanic,4,Emergency,Home or Self Care,2020,CIR009,ACUTE MYOCARDIAL INFARCTION,MAM005,MEASUREMENT DURING CARDIAC CATHETERIZATION,190,ACUTE MYOCARDIAL INFARCTION,05,DISEASES AND DISORDERS OF THE CIRCULATORY SYSTEM,1,Minor,Minor,Medical,Medicare,,,,,Y,61491.68,10018.96
Long Island,Suffolk,5123000,000885,Long Island Community Hospital,50 to 69,117,M,White,Not Span/Hispanic,18,Emergency,Short-term Hospital,2020,CIR009,ACUTE MYOCARDIAL INFARCTION,RES007,AIRWAY INTUBATION,190,ACUTE MYOCARDIAL INFARCTION,05,DISEASES AND DISORDERS OF THE CIRCULATORY SYSTEM,4,Extreme,Extreme,Medical,Private Health Insurance,Medicaid,,,,Y,242097.37,44381.48
Long Island,Suffolk,5123000,000885,Long Island Community Hospital,50 to 69,119,M,Black/African American,Not Span/Hispanic,5,Emergency,Home or Self Care,2020,CIR009,ACUTE MYOCARDIAL INFARCTION,,,190,ACUTE MYOCARDIAL INFARCTION,05,DISEASES AND DISORDERS OF THE CIRCULATORY SYSTEM,1,Minor,Minor,Medical,Private Health Insurance,Medicaid,,,,Y,33001.59,7516.83
Long Island,Suffolk,5123000,000885,Long Island Community Hospital,70 or Older,117,M,White,Not Span/Hispanic,2,Emergency,Expired,2020,CIR009,ACUTE MYOCARDIAL INFARCTION,,,190,ACUTE MYOCARDIAL INFARCTION,05,DISEASES AND DISORDERS OF THE CIRCULATORY SYSTEM,3,Major,Major,Medical,Medicare,Medicare,Private Health Insurance,,,Y,19657.15,3436.27
Long Island,Suffolk,5123000,000885,Long Island Community Hospital,50 to 69,117,M,Other Race,Not Span/Hispanic,4,Emergency,Home or Self Care,2020,CIR009,ACUTE MYOCARDIAL INFARCTION,MAM005,MEASUREMENT DURING CARDIAC CATHETERIZATION,190,ACUTE MYOCARDIAL INFARCTION,05,DISEASES AND DISORDERS OF THE CIRCULATORY SYSTEM,3,Major,Major,Medical,Medicare,,,,,Y,76875.41,10839.64