Hospital Service Area,Hospital County,Operating Certificate Number,Permanent Facility Id,Facility Name,Age Group,Zip Code - 3 digits,Gender,Race,Ethnicity,Length of Stay,Type of Admission,Patient Disposition,Discharge Year,CCS Diagnosis Code,CCS Diagnosis Description,CCS Procedure Code,CCS Procedure Description,APR DRG Code,APR DRG Description,APR MDC Code,APR MDC Description,APR Severity of Illness Code,APR Severity of Illness Description,APR Risk of Mortality,APR Medical Surgical Description,Payment Typology 1,Payment Typology 2,Payment Typology 3,Birth Weight,Abortion Edit Indicator,Emergency Department Indicator,Total Charges,Total Costs
New York City,Bronx,7000006,001169,Montefiore Medical Center - Henry & Lucy Moses Div,50 to 69,104,F,Other Race,Not Span/Hispanic,1,Emergency,Home or Self Care,2017,101,Coronary atherosclerosis and other heart disease,047,DX CARDIAC CATHETERIZTN,191,Cardiac catheterization for coronary artery disease,05,Diseases and Disorders of the Circulatory System,2,Moderate,Minor,Medical,Medicare,Medicaid,,,N,N,37298.41,11723.45
New York City,Bronx,7000006,001169,Montefiore Medical Center - Henry & Lucy Moses Div,30 to 49,OOS,M,White,Not Span/Hispanic,4,Emergency,Home or Self Care,2017,101,Coronary atherosclerosis and other heart disease,047,DX CARDIAC CATHETERIZTN,191,Cardiac catheterization for coronary artery disease,05,Diseases and Disorders of the Circulatory System,2,Moderate,Moderate,Medical,Medicare,,,,N,Y,81552.09,23814.34
New York City,Bronx,7000006,001169,Montefiore Medical Center - Henry & Lucy Moses Div,50 to 69,107,M,Other Race,Not Span/Hispanic,2,Emergency,Home or Self Care,2017,101,Coronary atherosclerosis and other heart disease,047,DX CARDIAC CATHETERIZTN,191,Cardiac catheterization for coronary artery disease,05,Diseases and Disorders of the Circulatory System,1,Minor,Minor,Medical,Medicaid,,,,N,Y,47882.34,14382.03
New York City,Bronx,7000006,001169,Montefiore Medical Center - Henry & Lucy Moses Div,50 to 69,104,M,Other Race,Spanish/Hispanic,5,Emergency,Home or Self Care,2017,101,Coronary atherosclerosis and other heart disease,047,DX CARDIAC CATHETERIZTN,191,Cardiac catheterization for coronary artery disease,05,Diseases and Disorders of the Circulatory System,2,Moderate,Major,Medical,Private Health Insurance,Medicare,,,N,Y,88065.16,26952.03
New York City,Bronx,7000006,001169,Montefiore Medical Center - Henry & Lucy Moses Div,50 to 69,104,M,Other Race,Spanish/Hispanic,2,Emergency,Home or Self Care,2017,101,Coronary atherosclerosis and other heart disease,047,DX CARDIAC CATHETERIZTN,191,Cardiac catheterization for coronary artery disease,05,Diseases and Disorders of the Circulatory System,2,Moderate,Minor,Medical,Medicare,,,,N,Y,63110.42,19509.00
New York City,Bronx,7000006,001169,Montefiore Medical Center - Henry & Lucy Moses Div,50 to 69,104,M,White,Spanish/Hispanic,5,Emergency,Home or Self Care,2017,101,Coronary atherosclerosis and other heart disease,047,DX CARDIAC CATHETERIZTN,191,Cardiac catheterization for coronary artery disease,05,Diseases and Disorders of the Circulatory System,2,Moderate,Minor,Medical,Medicaid,,,,N,Y,104238.64,31960.90
New York City,Bronx,7000006,001169,Montefiore Medical Center - Henry & Lucy Moses Div,50 to 69,104,M,White,Not Span/Hispanic,5,Emergency,Home or Self Care,2017,101,Coronary atherosclerosis and other heart disease,047,DX CARDIAC CATHETERIZTN,191,Cardiac catheterization for coronary artery disease,05,Diseases and Disorders of the Circulatory System,2,Moderate,Moderate,Medical,Private Health Insurance,,,,N,Y,97980.18,30869.85
New York City,Bronx,7000006,003058,Montefiore Med Center - Jack D Weiler Hosp of A Einstein College Div,50 to 69,104,F,Other Race,Not Span/Hispanic,1,Emergency,Home or Self Care,2017,101,Coronary atherosclerosis and other heart disease,047,DX CARDIAC CATHETERIZTN,191,Cardiac catheterization for coronary artery disease,05,Diseases and Disorders of the Circulatory System,1,Minor,Minor,Medical,Medicaid,,,,N,N,26566.57,7995.23
New York City,Bronx,7000006,003058,Montefiore Med Center - Jack D Weiler Hosp of A Einstein College Div,50 to 69,104,F,Other Race,Spanish/Hispanic,3,Emergency,Home or Self Care,2017,101,Coronary atherosclerosis and other heart disease,047,DX CARDIAC CATHETERIZTN,191,Cardiac catheterization for coronary artery disease,05,Diseases and Disorders of the Circulatory System,2,Moderate,Moderate,Medical,Medicare,,,,N,Y,60991.49,18379.82
New York City,Bronx,7000006,003058,Montefiore Med Center - Jack D Weiler Hosp of A Einstein College Div,50 to 69,104,M,Other Race,Not Span/Hispanic,1,Emergency,Home or Self Care,2017,101,Coronary atherosclerosis and other heart disease,047,DX CARDIAC CATHETERIZTN,191,Cardiac catheterization for coronary artery disease,05,Diseases and Disorders of the Circulatory System,1,Minor,Minor,Medical,Blue Cross/Blue Shield,Medicare,,,N,N,26162.73,7783.99
New York City,Bronx,7000006,003058,Montefiore Med Center - Jack D Weiler Hosp of A Einstein College Div,50 to 69,104,F,Black/African American,Not Span/Hispanic,3,Emergency,Home w/ Home Health Services,2017,101,Coronary atherosclerosis and other heart disease,047,DX CARDIAC CATHETERIZTN,191,Cardiac catheterization for coronary artery disease,05,Diseases and Disorders of the Circulatory System,1,Minor,Minor,Medical,Medicaid,,,,N,Y,55730.02,17095.23
New York City,Manhattan,7002002,001439,Mount Sinai Beth Israel,70 or Older,112,F,White,Not Span/Hispanic,5,Urgent,Home w/ Home Health Services,2017,101,Coronary atherosclerosis and other heart disease,047,DX CARDIAC CATHETERIZTN,191,Cardiac catheterization for coronary artery disease,05,Diseases and Disorders of the Circulatory System,3,Major,Major,Medical,Medicare,Miscellaneous/Other,Medicaid,,N,N,45625.36,14759.32
New York City,Manhattan,7002002,001439,Mount Sinai Beth Israel,50 to 69,100,M,Black/African American,Spanish/Hispanic,4,Emergency,Home or Self Care,2017,101,Coronary atherosclerosis and other heart disease,047,DX CARDIAC CATHETERIZTN,191,Cardiac catheterization for coronary artery disease,05,Diseases and Disorders of the Circulatory System,3,Major,Minor,Medical,Medicaid,Medicaid,Self-Pay,,N,Y,47105.65,14659.57
New York City,Manhattan,7002002,001439,Mount Sinai Beth Israel,50 to 69,113,M,Black/African American,Not Span/Hispanic,1,Urgent,Home or Self Care,2017,101,Coronary atherosclerosis and other heart disease,047,DX CARDIAC CATHETERIZTN,191,Cardiac catheterization for coronary artery disease,05,Diseases and Disorders of the Circulatory System,3,Major,Moderate,Medical,Medicaid,Self-Pay,,,N,N,20125.07,6081.79
New York City,Manhattan,7002002,001439,Mount Sinai Beth Israel,70 or Older,113,M,Other Race,Not Span/Hispanic,1,Urgent,Home or Self Care,2017,101,Coronary atherosclerosis and other heart disease,047,DX CARDIAC CATHETERIZTN,191,Cardiac catheterization for coronary artery disease,05,Diseases and Disorders of the Circulatory System,2,Moderate,Moderate,Medical,Medicaid,Medicaid,Self-Pay,,N,N,19523.96,6023.85
New York City,Manhattan,7002024,001456,Mount Sinai Hospital,70 or Older,OOS,M,White,Not Span/Hispanic,1,Urgent,Home or Self Care,2017,101,Coronary atherosclerosis and other heart disease,047,DX CARDIAC CATHETERIZTN,191,Cardiac catheterization for coronary artery disease,05,Diseases and Disorders of the Circulatory System,1,Minor,Minor,Medical,Medicare,Private Health Insurance,Self-Pay,,N,N,21243.93,6902.69
New York City,Manhattan,7002024,001456,Mount Sinai Hospital,50 to 69,112,F,Other Race,Not Span/Hispanic,1,Urgent,Home or Self Care,2017,101,Coronary atherosclerosis and other heart disease,047,DX CARDIAC CATHETERIZTN,191,Cardiac catheterization for coronary artery disease,05,Diseases and Disorders of the Circulatory System,2,Moderate,Moderate,Medical,Private Health Insurance,Medicare,Self-Pay,,N,N,22855.21,7377.28
New York City,Manhattan,7002024,001456,Mount Sinai Hospital,30 to 49,112,M,White,Not Span/Hispanic,1,Emergency,Home or Self Care,2017,101,Coronary atherosclerosis and other heart disease,047,DX CARDIAC CATHETERIZTN,191,Cardiac catheterization for coronary artery disease,05,Diseases and Disorders of the Circulatory System,1,Minor,Minor,Medical,Private Health Insurance,Self-Pay,,,N,Y,27308.37,10648.65
New York City,Manhattan,7002024,001456,Mount Sinai Hospital,50 to 69,100,F,Other Race,Not Span/Hispanic,2,Emergency,Home or Self Care,2017,101,Coronary atherosclerosis and other heart disease,047,DX CARDIAC CATHETERIZTN,191,Cardiac catheterization for coronary artery disease,05,Diseases and Disorders of the Circulatory System,2,Moderate,Moderate,Medical,Medicare,Medicaid,Self-Pay,,N,Y,34509.05,10527.00
New York City,Manhattan,7002032,001469,Mount Sinai St. Luke's,50 to 69,107,F,White,Not Span/Hispanic,1,Urgent,Home or Self Care,2017,101,Coronary atherosclerosis and other heart disease,047,DX CARDIAC CATHETERIZTN,191,Cardiac catheterization for coronary artery disease,05,Diseases and Disorders of the Circulatory System,2,Moderate,Minor,Medical,Medicaid,Medicaid,Self-Pay,,N,N,6748.29,1948.83
New York City,Manhattan,7002032,001469,Mount Sinai St. Luke's,50 to 69,,F,Black/African American,Unknown,1,Emergency,Home or Self Care,2017,101,Coronary atherosclerosis and other heart disease,047,DX CARDIAC CATHETERIZTN,191,Cardiac catheterization for coronary artery disease,05,Diseases and Disorders of the Circulatory System,2,Moderate,Moderate,Medical,Self-Pay,Self-Pay,,,N,Y,38162.13,18567.41
Hudson Valley,Orange,3523000,000699,Orange Regional Medical Center,70 or Older,109,M,Other Race,Spanish/Hispanic,6,Emergency,Home or Self Care,2017,101,Coronary atherosclerosis and other heart disease,047,DX CARDIAC CATHETERIZTN,191,Cardiac catheterization for coronary artery disease,05,Diseases and Disorders of the Circulatory System,1,Minor,Minor,Medical,Medicare,Blue Cross/Blue Shield,Private Health Insurance,,N,Y,54040.32,19096.15
Hudson Valley,Orange,3523000,000699,Orange Regional Medical Center,70 or Older,127,M,White,Not Span/Hispanic,7,Emergency,Skilled Nursing Home,2017,101,Coronary atherosclerosis and other heart disease,047,DX CARDIAC CATHETERIZTN,191,Cardiac catheterization for coronary artery disease,05,Diseases and Disorders of the Circulatory System,3,Major,Major,Medical,Medicare,Blue Cross/Blue Shield,,,N,Y,60627.01,22784.48
Hudson Valley,Orange,3523000,000699,Orange Regional Medical Center,70 or Older,127,F,White,Not Span/Hispanic,1,Emergency,Home or Self Care,2017,101,Coronary atherosclerosis and other heart disease,047,DX CARDIAC CATHETERIZTN,191,Cardiac catheterization for coronary artery disease,05,Diseases and Disorders of the Circulatory System,1,Minor,Minor,Medical,Medicare,,,,N,Y,17040.98,5106.50
Hudson Valley,Orange,3523000,000699,Orange Regional Medical Center,50 to 69,127,M,White,Not Span/Hispanic,3,Emergency,Home or Self Care,2017,101,Coronary atherosclerosis and other heart disease,047,DX CARDIAC CATHETERIZTN,191,Cardiac catheterization for coronary artery disease,05,Diseases and Disorders of the Circulatory System,2,Moderate,Minor,Medical,Blue Cross/Blue Shield,,,,N,Y,33812.34,12482.40
Hudson Valley,Rockland,4329000,000779,Good Samaritan Hospital of Suffern,70 or Older,109,F,White,Not Span/Hispanic,1,Emergency,Home or Self Care,2017,101,Coronary atherosclerosis and other heart disease,047,DX CARDIAC CATHETERIZTN,191,Cardiac catheterization for coronary artery disease,05,Diseases and Disorders of the Circulatory System,1,Minor,Minor,Medical,Medicare,Private Health Insurance,,,N,N,45369.23,7507.55
New York City,Bronx,7000006,001169,Montefiore Medical Center - Henry & Lucy Moses Div,50 to 69,104,F,Other Race,Spanish/Hispanic,3,Emergency,Home w/ Home Health Services,2017,101,Coronary atherosclerosis and other heart disease,047,DX CARDIAC CATHETERIZTN,191,Cardiac catheterization for coronary artery disease,05,Diseases and Disorders of the Circulatory System,2,Moderate,Minor,Medical,Medicare,Medicaid,,,N,Y,66624.81,20132.72
New York City,Bronx,7000006,001169,Montefiore Medical Center - Henry & Lucy Moses Div,50 to 69,104,F,Other Race,Not Span/Hispanic,1,Emergency,Home or Self Care,2017,101,Coronary atherosclerosis and other heart disease,047,DX CARDIAC CATHETERIZTN,191,Cardiac catheterization for coronary artery disease,05,Diseases and Disorders of the Circulatory System,2,Moderate,Moderate,Medical,Medicare,Medicaid,,,N,N,33452.03,10691.06
New York City,Bronx,7000006,001169,Montefiore Medical Center - Henry & Lucy Moses Div,50 to 69,104,F,Other Race,Not Span/Hispanic,3,Emergency,Home or Self Care,2017,101,Coronary atherosclerosis and other heart disease,047,DX CARDIAC CATHETERIZTN,191,Cardiac catheterization for coronary artery disease,05,Diseases and Disorders of the Circulatory System,1,Minor,Minor,Medical,Private Health Insurance,,,,N,Y,67668.18,20283.49
New York City,Bronx,7000006,003058,Montefiore Med Center - Jack D Weiler Hosp of A Einstein College Div,70 or Older,,M,Other Race,Spanish/Hispanic,1,Emergency,Home or Self Care,2017,101,Coronary atherosclerosis and other heart disease,047,DX CARDIAC CATHETERIZTN,191,Cardiac catheterization for coronary artery disease,05,Diseases and Disorders of the Circulatory System,1,Minor,Minor,Medical,Medicare,Private Health Insurance,,,N,N,30975.31,9548.24
New York City,Bronx,7000006,003058,Montefiore Med Center - Jack D Weiler Hosp of A Einstein College Div,30 to 49,104,F,Black/African American,Not Span/Hispanic,6,Emergency,Home or Self Care,2017,101,Coronary atherosclerosis and other heart disease,047,DX CARDIAC CATHETERIZTN,191,Cardiac catheterization for coronary artery disease,05,Diseases and Disorders of the Circulatory System,3,Major,Major,Medical,Medicare,Medicaid,,,N,Y,123579.07,35366.76
New York City,Manhattan,7002002,001439,Mount Sinai Beth Israel,50 to 69,112,M,Black/African American,Unknown,6,Urgent,Home or Self Care,2017,101,Coronary atherosclerosis and other heart disease,047,DX CARDIAC CATHETERIZTN,191,Cardiac catheterization for coronary artery disease,05,Diseases and Disorders of the Circulatory System,1,Minor,Minor,Medical,Private Health Insurance,Self-Pay,,,N,N,55562.91,19493.99
New York City,Manhattan,7002002,001439,Mount Sinai Beth Israel,50 to 69,100,M,Other Race,Not Span/Hispanic,1,Emergency,Home or Self Care,2017,101,Coronary atherosclerosis and other heart disease,047,DX CARDIAC CATHETERIZTN,191,Cardiac catheterization for coronary artery disease,05,Diseases and Disorders of the Circulatory System,1,Minor,Minor,Medical,Private Health Insurance,Self-Pay,,,N,Y,19420.15,5314.96
New York City,Manhattan,7002024,001456,Mount Sinai Hospital,70 or Older,113,M,White,Not Span/Hispanic,4,Elective,Home or Self Care,2017,101,Coronary atherosclerosis and other heart disease,047,DX CARDIAC CATHETERIZTN,191,Cardiac catheterization for coronary artery disease,05,Diseases and Disorders of the Circulatory System,2,Moderate,Moderate,Medical,Medicare,Private Health Insurance,Self-Pay,,N,N,46443.32,12871.02
New York City,Manhattan,7002024,001456,Mount Sinai Hospital,30 to 49,112,F,Other Race,Not Span/Hispanic,1,Urgent,Home or Self Care,2017,101,Coronary atherosclerosis and other heart disease,047,DX CARDIAC CATHETERIZTN,191,Cardiac catheterization for coronary artery disease,05,Diseases and Disorders of the Circulatory System,2,Moderate,Moderate,Medical,Medicaid,Medicaid,Self-Pay,,N,N,18044.78,5521.24
New York City,Manhattan,7002024,001456,Mount Sinai Hospital,70 or Older,103,M,White,Not Span/Hispanic,1,Urgent,Home or Self Care,2017,101,Coronary atherosclerosis and other heart disease,047,DX CARDIAC CATHETERIZTN,191,Cardiac catheterization for coronary artery disease,05,Diseases and Disorders of the Circulatory System,2,Moderate,Minor,Medical,Medicare,Medicaid,Self-Pay,,N,N,17814.31,5309.62
New York City,Manhattan,7002024,001456,Mount Sinai Hospital,50 to 69,111,F,Black/African American,Not Span/Hispanic,2,Urgent,Home or Self Care,2017,101,Coronary atherosclerosis and other heart disease,047,DX CARDIAC CATHETERIZTN,191,Cardiac catheterization for coronary artery disease,05,Diseases and Disorders of the Circulatory System,2,Moderate,Moderate,Medical,Medicare,Medicare,Medicaid,,N,N,23618.78,7375.62
New York City,Manhattan,7002024,001456,Mount Sinai Hospital,70 or Older,112,M,Other Race,Not Span/Hispanic,5,Urgent,Skilled Nursing Home,2017,101,Coronary atherosclerosis and other heart disease,047,DX CARDIAC CATHETERIZTN,191,Cardiac catheterization for coronary artery disease,05,Diseases and Disorders of the Circulatory System,2,Moderate,Moderate,Medical,Medicare,Medicaid,Self-Pay,,N,N,52508.73,15712.77
New York City,Manhattan,7002032,001469,Mount Sinai St. Luke's,50 to 69,107,M,Other Race,Not Span/Hispanic,1,Urgent,Home or Self Care,2017,101,Coronary atherosclerosis and other heart disease,047,DX CARDIAC CATHETERIZTN,191,Cardiac catheterization for coronary artery disease,05,Diseases and Disorders of the Circulatory System,2,Moderate,Moderate,Medical,Private Health Insurance,Self-Pay,,,N,N,18078.73,12636.43
New York City,Manhattan,7002032,001469,Mount Sinai St. Luke's,70 or Older,,M,Other Race,Not Span/Hispanic,4,Urgent,Home or Self Care,2017,101,Coronary atherosclerosis and other heart disease,047,DX CARDIAC CATHETERIZTN,191,Cardiac catheterization for coronary artery disease,05,Diseases and Disorders of the Circulatory System,3,Major,Major,Medical,Medicare,Medicaid,Self-Pay,,N,N,44258.20,21678.57
New York City,Manhattan,7002032,001469,Mount Sinai St. Luke's,70 or Older,100,M,Black/African American,Spanish/Hispanic,1,Emergency,Home or Self Care,2017,101,Coronary atherosclerosis and other heart disease,047,DX CARDIAC CATHETERIZTN,191,Cardiac catheterization for coronary artery disease,05,Diseases and Disorders of the Circulatory System,1,Minor,Minor,Medical,Medicare,Medicare,Self-Pay,,N,Y,17496.78,5947.33
New York City,Bronx,7000006,001169,Montefiore Medical Center - Henry & Lucy Moses Div,50 to 69,104,M,Other Race,Not Span/Hispanic,1,Emergency,Home or Self Care,2017,101,Coronary atherosclerosis and other heart disease,047,DX CARDIAC CATHETERIZTN,191,Cardiac catheterization for coronary artery disease,05,Diseases and Disorders of the Circulatory System,1,Minor,Minor,Medical,Medicaid,,,,N,N,30181.90,9868.68
New York City,Bronx,7000006,003058,Montefiore Med Center - Jack D Weiler Hosp of A Einstein College Div,50 to 69,104,M,Other Race,Not Span/Hispanic,4,Emergency,Home or Self Care,2017,101,Coronary atherosclerosis and other heart disease,047,DX CARDIAC CATHETERIZTN,191,Cardiac catheterization for coronary artery disease,05,Diseases and Disorders of the Circulatory System,1,Minor,Minor,Medical,Blue Cross/Blue Shield,,,,N,Y,70436.32,21014.91
New York City,Bronx,7000006,003058,Montefiore Med Center - Jack D Weiler Hosp of A Einstein College Div,70 or Older,104,M,White,Not Span/Hispanic,1,Emergency,Home or Self Care,2017,101,Coronary atherosclerosis and other heart disease,047,DX CARDIAC CATHETERIZTN,191,Cardiac catheterization for coronary artery disease,05,Diseases and Disorders of the Circulatory System,1,Minor,Moderate,Medical,Medicare,Blue Cross/Blue Shield,,,N,Y,28477.54,8133.00
New York City,Bronx,7000006,003058,Montefiore Med Center - Jack D Weiler Hosp of A Einstein College Div,50 to 69,104,M,Other Race,Not Span/Hispanic,1,Emergency,Home or Self Care,2017,101,Coronary atherosclerosis and other heart disease,047,DX CARDIAC CATHETERIZTN,191,Cardiac catheterization for coronary artery disease,05,Diseases and Disorders of the Circulatory System,1,Minor,Minor,Medical,Medicaid,,,,N,N,30630.68,9599.91
New York City,Bronx,7000006,003058,Montefiore Med Center - Jack D Weiler Hosp of A Einstein College Div,50 to 69,104,M,Other Race,Not Span/Hispanic,1,Emergency,Home or Self Care,2017,237,Complication of device; implant or graft,047,DX CARDIAC CATHETERIZTN,191,Cardiac catheterization for coronary artery disease,05,Diseases and Disorders of the Circulatory System,1,Minor,Minor,Medical,Private Health Insurance,,,,N,N,31201.76,9430.07
New York City,Bronx,7000006,003058,Montefiore Med Center - Jack D Weiler Hosp of A Einstein College Div,50 to 69,104,F,Other Race,Not Span/Hispanic,1,Emergency,Home or Self Care,2017,101,Coronary atherosclerosis and other heart disease,047,DX CARDIAC CATHETERIZTN,191,Cardiac catheterization for coronary artery disease,05,Diseases and Disorders of the Circulatory System,1,Minor,Minor,Medical,Medicaid,,,,N,Y,36394.81,10840.53
New York City,Kings,7001003,001288,Brooklyn Hospital Center - Downtown Campus,50 to 69,112,M,White,Unknown,3,Emergency,Short-term Hospital,2017,101,Coronary atherosclerosis and other heart disease,047,DX CARDIAC CATHETERIZTN,191,Cardiac catheterization for coronary artery disease,05,Diseases and Disorders of the Circulatory System,1,Minor,Minor,Medical,Medicare,Medicare,Self-Pay,,N,Y,42059.94,7208.39
New York City,Kings,7001003,001288,Brooklyn Hospital Center - Downtown Campus,50 to 69,112,F,Other Race,Spanish/Hispanic,3,Emergency,Home or Self Care,2017,101,Coronary atherosclerosis and other heart disease,047,DX CARDIAC CATHETERIZTN,191,Cardiac catheterization for coronary artery disease,05,Diseases and Disorders of the Circulatory System,1,Minor,Minor,Medical,Medicaid,Medicaid,Self-Pay,,N,Y,33548.49,5851.36
New York City,Kings,7001003,001288,Brooklyn Hospital Center - Downtown Campus,50 to 69,112,F,Black/African American,Unknown,2,Emergency,Home or Self Care,2017,101,Coronary atherosclerosis and other heart disease,047,DX CARDIAC CATHETERIZTN,191,Cardiac catheterization for coronary artery disease,05,Diseases and Disorders of the Circulatory System,1,Minor,Minor,Medical,Medicaid,Medicaid,Self-Pay,,N,Y,29355.76,5079.21
New York City,Kings,7001003,001288,Brooklyn Hospital Center - Downtown Campus,30 to 49,112,F,Black/African American,Not Span/Hispanic,3,Emergency,Short-term Hospital,2017,101,Coronary atherosclerosis and other heart disease,047,DX CARDIAC CATHETERIZTN,191,Cardiac catheterization for coronary artery disease,05,Diseases and Disorders of the Circulatory System,1,Minor,Minor,Medical,Private Health Insurance,Self-Pay,,,N,Y,39681.03,6424.26
New York City,Kings,7001003,001288,Brooklyn Hospital Center - Downtown Campus,70 or Older,112,M,Other Race,Spanish/Hispanic,6,Emergency,Home or Self Care,2017,101,Coronary atherosclerosis and other heart disease,047,DX CARDIAC CATHETERIZTN,191,Cardiac catheterization for coronary artery disease,05,Diseases and Disorders of the Circulatory System,2,Moderate,Moderate,Medical,Medicare,Medicaid,Self-Pay,,N,Y,81250.43,13633.43
New York City,Kings,7001037,001320,University Hospital of Brooklyn,70 or Older,112,M,Black/African American,Not Span/Hispanic,5,Emergency,Short-term Hospital,2017,101,Coronary atherosclerosis and other heart disease,047,DX CARDIAC CATHETERIZTN,191,Cardiac catheterization for coronary artery disease,05,Diseases and Disorders of the Circulatory System,2,Moderate,Moderate,Medical,Medicare,Self-Pay,,,N,Y,38605.63,31645.56
New York City,Kings,7001037,001320,University Hospital of Brooklyn,50 to 69,112,M,Black/African American,Not Span/Hispanic,1,Emergency,Home or Self Care,2017,101,Coronary atherosclerosis and other heart disease,047,DX CARDIAC CATHETERIZTN,191,Cardiac catheterization for coronary artery disease,05,Diseases and Disorders of the Circulatory System,1,Minor,Minor,Medical,Private Health Insurance,Self-Pay,,,N,Y,15934.36,10364.59
New York City,Kings,7001037,001320,University Hospital of Brooklyn,50 to 69,112,F,Black/African American,Not Span/Hispanic,5,Emergency,Home or Self Care,2017,101,Coronary atherosclerosis and other heart disease,047,DX CARDIAC CATHETERIZTN,191,Cardiac catheterization for coronary artery disease,05,Diseases and Disorders of the Circulatory System,2,Moderate,Minor,Medical,Medicaid,Self-Pay,,,N,Y,37558.18,24205.00