Hospital Service Area,Hospital County,Operating Certificate Number,Permanent Facility Id,Facility Name,Age Group,Zip Code - 3 digits,Gender,Race,Ethnicity,Length of Stay,Type of Admission,Patient Disposition,Discharge Year,CCS Diagnosis Code,CCS Diagnosis Description,CCS Procedure Code,CCS Procedure Description,APR DRG Code,APR DRG Description,APR MDC Code,APR MDC Description,APR Severity of Illness Code,APR Severity of Illness Description,APR Risk of Mortality,APR Medical Surgical Description,Payment Typology 1,Payment Typology 2,Payment Typology 3,Birth Weight,Abortion Edit Indicator,Emergency Department Indicator,Total Charges,Total Costs
Long Island,Suffolk,5123000,000885,Long Island Community Hospital,50 to 69,119,M,White,Not Span/Hispanic,3,Emergency,Home or Self Care,2020,CIR011,CORONARY ATHEROSCLEROSIS AND OTHER HEART DISEASE,MAM005,MEASUREMENT DURING CARDIAC CATHETERIZATION,191,CARDIAC CATHETERIZATION FOR CORONARY ARTERY DISEASE,05,DISEASES AND DISORDERS OF THE CIRCULATORY SYSTEM,2,Moderate,Moderate,Medical,Medicare,,,,,Y,36242.42,7458.3
Long Island,Suffolk,5123000,000885,Long Island Community Hospital,70 or Older,119,F,White,Not Span/Hispanic,4,Emergency,Home or Self Care,2020,CIR011,CORONARY ATHEROSCLEROSIS AND OTHER HEART DISEASE,MAM005,MEASUREMENT DURING CARDIAC CATHETERIZATION,191,CARDIAC CATHETERIZATION FOR CORONARY ARTERY DISEASE,05,DISEASES AND DISORDERS OF THE CIRCULATORY SYSTEM,2,Moderate,Major,Medical,Medicare,Medicare,Private Health Insurance,,,Y,57034.39,10897.53
Long Island,Suffolk,5123000,000885,Long Island Community Hospital,50 to 69,119,M,White,Not Span/Hispanic,1,Emergency,Home or Self Care,2020,CIR011,CORONARY ATHEROSCLEROSIS AND OTHER HEART DISEASE,IMG001,CARDIAC AND CORONARY FLUOROSCOPY,191,CARDIAC CATHETERIZATION FOR CORONARY ARTERY DISEASE,05,DISEASES AND DISORDERS OF THE CIRCULATORY SYSTEM,1,Minor,Minor,Medical,Blue Cross/Blue Shield,,,,,Y,31726.93,5574.28
Long Island,Suffolk,5123000,000885,Long Island Community Hospital,50 to 69,117,M,Black/African American,Not Span/Hispanic,1,Emergency,Home or Self Care,2020,CIR011,CORONARY ATHEROSCLEROSIS AND OTHER HEART DISEASE,MAM005,MEASUREMENT DURING CARDIAC CATHETERIZATION,191,CARDIAC CATHETERIZATION FOR CORONARY ARTERY DISEASE,05,DISEASES AND DISORDERS OF THE CIRCULATORY SYSTEM,1,Minor,Minor,Medical,Private Health Insurance,Medicaid,,,,Y,31158.2,5402.25
Long Island,Suffolk,5123000,000885,Long Island Community Hospital,50 to 69,117,M,Black/African American,Not Span/Hispanic,2,Emergency,Home or Self Care,2020,CIR011,CORONARY ATHEROSCLEROSIS AND OTHER HEART DISEASE,MAM005,MEASUREMENT DURING CARDIAC CATHETERIZATION,191,CARDIAC CATHETERIZATION FOR CORONARY ARTERY DISEASE,05,DISEASES AND DISORDERS OF THE CIRCULATORY SYSTEM,2,Moderate,Moderate,Medical,Medicare,Medicare,,,,Y,36640.82,7040.52
Long Island,Suffolk,5123000,000885,Long Island Community Hospital,70 or Older,117,M,Other Race,Not Span/Hispanic,2,Emergency,Short-term Hospital,2020,CIR011,CORONARY ATHEROSCLEROSIS AND OTHER HEART DISEASE,MAM005,MEASUREMENT DURING CARDIAC CATHETERIZATION,191,CARDIAC CATHETERIZATION FOR CORONARY ARTERY DISEASE,05,DISEASES AND DISORDERS OF THE CIRCULATORY SYSTEM,2,Moderate,Minor,Medical,Medicare,Medicare,,,,Y,40869.06,7338.37
Long Island,Suffolk,5123000,000885,Long Island Community Hospital,50 to 69,117,M,White,Not Span/Hispanic,1,Emergency,Home or Self Care,2020,CIR011,CORONARY ATHEROSCLEROSIS AND OTHER HEART DISEASE,MAM005,MEASUREMENT DURING CARDIAC CATHETERIZATION,191,CARDIAC CATHETERIZATION FOR CORONARY ARTERY DISEASE,05,DISEASES AND DISORDERS OF THE CIRCULATORY SYSTEM,1,Minor,Minor,Medical,Private Health Insurance,,,,,Y,29867.11,5484.44
Long Island,Suffolk,5123000,000885,Long Island Community Hospital,30 to 49,119,F,White,Not Span/Hispanic,14,Emergency,Home or Self Care,2020,CIR011,CORONARY ATHEROSCLEROSIS AND OTHER HEART DISEASE,MAM005,MEASUREMENT DURING CARDIAC CATHETERIZATION,191,CARDIAC CATHETERIZATION FOR CORONARY ARTERY DISEASE,05,DISEASES AND DISORDERS OF THE CIRCULATORY SYSTEM,1,Minor,Moderate,Medical,Medicare,Medicare,Private Health Insurance,,,Y,121805.37,24893.31
Long Island,Suffolk,5123000,000885,Long Island Community Hospital,50 to 69,117,M,White,Not Span/Hispanic,6,Emergency,Home or Self Care,2020,CIR011,CORONARY ATHEROSCLEROSIS AND OTHER HEART DISEASE,MAM005,MEASUREMENT DURING CARDIAC CATHETERIZATION,191,CARDIAC CATHETERIZATION FOR CORONARY ARTERY DISEASE,05,DISEASES AND DISORDERS OF THE CIRCULATORY SYSTEM,2,Moderate,Moderate,Medical,Medicare,Medicare,Medicaid,,,Y,59553.98,11835.41
Long Island,Suffolk,5123000,000885,Long Island Community Hospital,70 or Older,117,F,Other Race,Not Span/Hispanic,3,Emergency,Skilled Nursing Home,2020,CIR011,CORONARY ATHEROSCLEROSIS AND OTHER HEART DISEASE,MAM005,MEASUREMENT DURING CARDIAC CATHETERIZATION,191,CARDIAC CATHETERIZATION FOR CORONARY ARTERY DISEASE,05,DISEASES AND DISORDERS OF THE CIRCULATORY SYSTEM,2,Moderate,Minor,Medical,Medicare,Medicare,Medicaid,,,Y,51037.11,9944.66
Long Island,Suffolk,5123000,000885,Long Island Community Hospital,70 or Older,117,M,White,Not Span/Hispanic,5,Emergency,Short-term Hospital,2020,CIR011,CORONARY ATHEROSCLEROSIS AND OTHER HEART DISEASE,IMG001,CARDIAC AND CORONARY FLUOROSCOPY,191,CARDIAC CATHETERIZATION FOR CORONARY ARTERY DISEASE,05,DISEASES AND DISORDERS OF THE CIRCULATORY SYSTEM,3,Major,Major,Medical,Medicare,Medicare,Blue Cross/Blue Shield,,,Y,66236.55,12276.66
Long Island,Suffolk,5123000,000885,Long Island Community Hospital,70 or Older,119,M,Other Race,Not Span/Hispanic,1,Emergency,Home or Self Care,2020,CIR011,CORONARY ATHEROSCLEROSIS AND OTHER HEART DISEASE,MAM005,MEASUREMENT DURING CARDIAC CATHETERIZATION,191,CARDIAC CATHETERIZATION FOR CORONARY ARTERY DISEASE,05,DISEASES AND DISORDERS OF THE CIRCULATORY SYSTEM,2,Moderate,Minor,Medical,Medicare,Medicare,Private Health Insurance,,,Y,37522.16,6088.68
Long Island,Suffolk,5123000,000885,Long Island Community Hospital,70 or Older,117,F,Other Race,Not Span/Hispanic,3,Emergency,Home or Self Care,2020,CIR011,CORONARY ATHEROSCLEROSIS AND OTHER HEART DISEASE,IMG001,CARDIAC AND CORONARY FLUOROSCOPY,191,CARDIAC CATHETERIZATION FOR CORONARY ARTERY DISEASE,05,DISEASES AND DISORDERS OF THE CIRCULATORY SYSTEM,1,Minor,Minor,Medical,Medicare,,,,,Y,42891.63,8207.16
Long Island,Suffolk,5123000,000885,Long Island Community Hospital,50 to 69,119,M,White,Not Span/Hispanic,3,Emergency,Home or Self Care,2020,CIR011,CORONARY ATHEROSCLEROSIS AND OTHER HEART DISEASE,MAM005,MEASUREMENT DURING CARDIAC CATHETERIZATION,191,CARDIAC CATHETERIZATION FOR CORONARY ARTERY DISEASE,05,DISEASES AND DISORDERS OF THE CIRCULATORY SYSTEM,2,Moderate,Moderate,Medical,Medicare,,,,,N,36152.54,7577.18
Long Island,Suffolk,5123000,000885,Long Island Community Hospital,30 to 49,117,F,White,Not Span/Hispanic,3,Emergency,Home or Self Care,2020,CIR011,CORONARY ATHEROSCLEROSIS AND OTHER HEART DISEASE,MAM005,MEASUREMENT DURING CARDIAC CATHETERIZATION,191,CARDIAC CATHETERIZATION FOR CORONARY ARTERY DISEASE,05,DISEASES AND DISORDERS OF THE CIRCULATORY SYSTEM,1,Minor,Minor,Medical,Private Health Insurance,Medicaid,,,,Y,47842.44,9324.71
Long Island,Suffolk,5123000,000885,Long Island Community Hospital,50 to 69,119,M,White,Not Span/Hispanic,3,Emergency,Home or Self Care,2020,CIR011,CORONARY ATHEROSCLEROSIS AND OTHER HEART DISEASE,MAM005,MEASUREMENT DURING CARDIAC CATHETERIZATION,191,CARDIAC CATHETERIZATION FOR CORONARY ARTERY DISEASE,05,DISEASES AND DISORDERS OF THE CIRCULATORY SYSTEM,1,Minor,Minor,Medical,Blue Cross/Blue Shield,,,,,Y,40584.84,7709.49
Long Island,Suffolk,5123000,000885,Long Island Community Hospital,30 to 49,117,F,White,Not Span/Hispanic,1,Emergency,Home or Self Care,2020,CIR011,CORONARY ATHEROSCLEROSIS AND OTHER HEART DISEASE,MAM005,MEASUREMENT DURING CARDIAC CATHETERIZATION,191,CARDIAC CATHETERIZATION FOR CORONARY ARTERY DISEASE,05,DISEASES AND DISORDERS OF THE CIRCULATORY SYSTEM,2,Moderate,Minor,Medical,Private Health Insurance,Medicaid,,,,Y,31708.85,5699.69
