Hospital Service Area,Hospital County,Operating Certificate Number,Permanent Facility Id,Facility Name,Age Group,Zip Code - 3 digits,Gender,Race,Ethnicity,Length of Stay,Type of Admission,Patient Disposition,Discharge Year,CCS Diagnosis Code,CCS Diagnosis Description,CCS Procedure Code,CCS Procedure Description,APR DRG Code,APR DRG Description,APR MDC Code,APR MDC Description,APR Severity of Illness Code,APR Severity of Illness Description,APR Risk of Mortality,APR Medical Surgical Description,Payment Typology 1,Payment Typology 2,Payment Typology 3,Birth Weight,Abortion Edit Indicator,Emergency Department Indicator,Total Charges,Total Costs
Long Island,Nassau,2908000,000511,NYU Winthrop Hospital,50 to 69,115,M,White,Not Span/Hispanic,15,Urgent,Home or Self Care,2017,106,Cardiac dysrhythmias,225,CONV OF CARDIAC RHYTHM,192,Cardiac catheterization for other non-coronary conditions,05,Diseases and Disorders of the Circulatory System,3,Major,Moderate,Medical,Medicare,Medicare,Medicaid,,N,N,186072.69,47411.71
Long Island,Nassau,2908000,000511,NYU Winthrop Hospital,70 or Older,115,F,Black/African American,Not Span/Hispanic,6,Emergency,Home w/ Home Health Services,2017,102,Nonspecific chest pain,047,DX CARDIAC CATHETERIZTN,192,Cardiac catheterization for other non-coronary conditions,05,Diseases and Disorders of the Circulatory System,2,Moderate,Minor,Medical,Medicare,Medicare,,,N,Y,91555.36,22913.30
Long Island,Nassau,2908000,000511,NYU Winthrop Hospital,70 or Older,115,F,White,Not Span/Hispanic,7,Emergency,Home w/ Home Health Services,2017,104,Other and ill-defined heart disease,047,DX CARDIAC CATHETERIZTN,192,Cardiac catheterization for other non-coronary conditions,05,Diseases and Disorders of the Circulatory System,2,Moderate,Moderate,Medical,Medicare,Medicare,,,N,Y,129799.79,28614.22
Long Island,Nassau,2908000,000511,NYU Winthrop Hospital,50 to 69,115,M,Other Race,Spanish/Hispanic,22,Emergency,Skilled Nursing Home,2017,099,Hypertension with complications and secondary hypertension,047,DX CARDIAC CATHETERIZTN,192,Cardiac catheterization for other non-coronary conditions,05,Diseases and Disorders of the Circulatory System,3,Major,Moderate,Medical,Medicare,Medicare,,,N,Y,320364.01,71570.45
Long Island,Nassau,2908000,000511,NYU Winthrop Hospital,30 to 49,110,M,White,Not Span/Hispanic,6,Emergency,Home or Self Care,2017,106,Cardiac dysrhythmias,225,CONV OF CARDIAC RHYTHM,192,Cardiac catheterization for other non-coronary conditions,05,Diseases and Disorders of the Circulatory System,3,Major,Major,Medical,Medicaid,Medicaid,,,N,Y,109628.54,25923.94
Long Island,Nassau,2908000,000511,NYU Winthrop Hospital,70 or Older,115,F,White,Not Span/Hispanic,6,Emergency,Home w/ Home Health Services,2017,099,Hypertension with complications and secondary hypertension,047,DX CARDIAC CATHETERIZTN,192,Cardiac catheterization for other non-coronary conditions,05,Diseases and Disorders of the Circulatory System,3,Major,Major,Medical,Medicare,,,,N,Y,85942.44,22123.38
Long Island,Nassau,2908000,000511,NYU Winthrop Hospital,50 to 69,118,M,Other Race,Not Span/Hispanic,4,Emergency,Home or Self Care,2017,099,Hypertension with complications and secondary hypertension,047,DX CARDIAC CATHETERIZTN,192,Cardiac catheterization for other non-coronary conditions,05,Diseases and Disorders of the Circulatory System,2,Moderate,Minor,Medical,Medicaid,Medicaid,,,N,Y,62080.13,15477.17
Long Island,Nassau,2908000,000511,NYU Winthrop Hospital,70 or Older,112,M,Black/African American,Not Span/Hispanic,3,Emergency,Home w/ Home Health Services,2017,102,Nonspecific chest pain,047,DX CARDIAC CATHETERIZTN,192,Cardiac catheterization for other non-coronary conditions,05,Diseases and Disorders of the Circulatory System,2,Moderate,Minor,Medical,Medicare,Medicare,,,N,Y,57539.46,13614.04
Long Island,Nassau,2908000,000511,NYU Winthrop Hospital,70 or Older,115,M,Black/African American,Not Span/Hispanic,2,Emergency,Left Against Medical Advice,2017,102,Nonspecific chest pain,047,DX CARDIAC CATHETERIZTN,192,Cardiac catheterization for other non-coronary conditions,05,Diseases and Disorders of the Circulatory System,1,Minor,Minor,Medical,Private Health Insurance,,,,N,Y,46647.24,10492.34
Long Island,Nassau,2908000,000511,NYU Winthrop Hospital,70 or Older,117,F,White,Not Span/Hispanic,10,Emergency,Home w/ Home Health Services,2017,106,Cardiac dysrhythmias,047,DX CARDIAC CATHETERIZTN,192,Cardiac catheterization for other non-coronary conditions,05,Diseases and Disorders of the Circulatory System,3,Major,Major,Medical,Medicare,Medicare,Private Health Insurance,,N,Y,199818.43,47435.91
Long Island,Nassau,2908000,000511,NYU Winthrop Hospital,70 or Older,115,M,White,Not Span/Hispanic,4,Emergency,Home or Self Care,2017,106,Cardiac dysrhythmias,047,DX CARDIAC CATHETERIZTN,192,Cardiac catheterization for other non-coronary conditions,05,Diseases and Disorders of the Circulatory System,3,Major,Major,Medical,Medicare,Medicare,Private Health Insurance,,N,Y,109367.05,23812.03
Long Island,Nassau,2908000,000511,NYU Winthrop Hospital,50 to 69,117,M,White,Not Span/Hispanic,2,Elective,Home or Self Care,2017,106,Cardiac dysrhythmias,062,OT DX CARDIOVASC PRCS,192,Cardiac catheterization for other non-coronary conditions,05,Diseases and Disorders of the Circulatory System,2,Moderate,Moderate,Medical,Private Health Insurance,Medicare,Medicare,,N,N,188623.41,45259.13
Long Island,Nassau,2908000,000511,NYU Winthrop Hospital,30 to 49,115,M,White,Spanish/Hispanic,6,Emergency,Home or Self Care,2017,106,Cardiac dysrhythmias,047,DX CARDIAC CATHETERIZTN,192,Cardiac catheterization for other non-coronary conditions,05,Diseases and Disorders of the Circulatory System,3,Major,Major,Medical,Medicaid,,,,N,Y,142383.03,31043.01
Long Island,Nassau,2908000,000511,NYU Winthrop Hospital,50 to 69,119,M,White,Not Span/Hispanic,1,Elective,Home or Self Care,2017,096,Heart valve disorders,047,DX CARDIAC CATHETERIZTN,192,Cardiac catheterization for other non-coronary conditions,05,Diseases and Disorders of the Circulatory System,1,Minor,Minor,Medical,Medicare,Private Health Insurance,,,N,N,60439.69,14486.32
Long Island,Nassau,2908000,000511,NYU Winthrop Hospital,70 or Older,117,M,White,Not Span/Hispanic,9,Emergency,Home w/ Home Health Services,2017,106,Cardiac dysrhythmias,047,DX CARDIAC CATHETERIZTN,192,Cardiac catheterization for other non-coronary conditions,05,Diseases and Disorders of the Circulatory System,3,Major,Major,Medical,Medicare,Medicare,Private Health Insurance,,N,Y,150480.08,36587.86
Long Island,Nassau,2908000,000511,NYU Winthrop Hospital,70 or Older,115,M,White,Not Span/Hispanic,8,Emergency,Home w/ Home Health Services,2017,099,Hypertension with complications and secondary hypertension,047,DX CARDIAC CATHETERIZTN,192,Cardiac catheterization for other non-coronary conditions,05,Diseases and Disorders of the Circulatory System,3,Major,Major,Medical,Medicare,Medicare,,,N,Y,171308.79,40657.66
Long Island,Nassau,2908000,000511,NYU Winthrop Hospital,50 to 69,117,M,White,Not Span/Hispanic,1,Emergency,Expired,2017,115,Aortic; peripheral; and visceral artery aneurysms,225,CONV OF CARDIAC RHYTHM,192,Cardiac catheterization for other non-coronary conditions,05,Diseases and Disorders of the Circulatory System,3,Major,Major,Medical,Private Health Insurance,,,,N,Y,44350.24,8098.66
Long Island,Nassau,2908000,000511,NYU Winthrop Hospital,50 to 69,115,M,White,Not Span/Hispanic,1,Emergency,Home or Self Care,2017,102,Nonspecific chest pain,047,DX CARDIAC CATHETERIZTN,192,Cardiac catheterization for other non-coronary conditions,05,Diseases and Disorders of the Circulatory System,2,Moderate,Minor,Medical,Private Health Insurance,,,,N,Y,35187.18,7013.43
Long Island,Nassau,2908000,000511,NYU Winthrop Hospital,30 to 49,117,F,Black/African American,Not Span/Hispanic,3,Elective,Home or Self Care,2017,106,Cardiac dysrhythmias,202,ELECTROCARDIOGRAM,192,Cardiac catheterization for other non-coronary conditions,05,Diseases and Disorders of the Circulatory System,2,Moderate,Moderate,Medical,Medicaid,Medicaid,,,N,N,105621.67,23196.34
Long Island,Nassau,2908000,000511,NYU Winthrop Hospital,70 or Older,117,F,White,Not Span/Hispanic,2,Emergency,Home or Self Care,2017,102,Nonspecific chest pain,047,DX CARDIAC CATHETERIZTN,192,Cardiac catheterization for other non-coronary conditions,05,Diseases and Disorders of the Circulatory System,1,Minor,Minor,Medical,Medicare,Medicare,Self-Pay,,N,Y,69271.96,14836.23
Long Island,Nassau,2908000,000511,NYU Winthrop Hospital,70 or Older,117,F,White,Not Span/Hispanic,1,Elective,Home or Self Care,2017,114,Peripheral and visceral atherosclerosis,047,DX CARDIAC CATHETERIZTN,192,Cardiac catheterization for other non-coronary conditions,05,Diseases and Disorders of the Circulatory System,2,Moderate,Minor,Medical,Medicare,Medicare,Private Health Insurance,,N,N,54752.53,12817.67
Long Island,Nassau,2908000,000511,NYU Winthrop Hospital,70 or Older,114,F,Black/African American,Spanish/Hispanic,2,Emergency,Home or Self Care,2017,102,Nonspecific chest pain,047,DX CARDIAC CATHETERIZTN,192,Cardiac catheterization for other non-coronary conditions,05,Diseases and Disorders of the Circulatory System,2,Moderate,Minor,Medical,Medicare,Medicare,Private Health Insurance,,N,Y,40550.17,9396.54
Long Island,Nassau,2908000,000511,NYU Winthrop Hospital,70 or Older,115,F,Black/African American,Not Span/Hispanic,2,Emergency,Home or Self Care,2017,245,Syncope,202,ELECTROCARDIOGRAM,192,Cardiac catheterization for other non-coronary conditions,05,Diseases and Disorders of the Circulatory System,2,Moderate,Moderate,Medical,Medicare,Medicare,,,N,Y,145612.45,30386.50
Long Island,Nassau,2908000,000511,NYU Winthrop Hospital,50 to 69,115,F,Other Race,Not Span/Hispanic,3,Emergency,Home or Self Care,2017,102,Nonspecific chest pain,047,DX CARDIAC CATHETERIZTN,192,Cardiac catheterization for other non-coronary conditions,05,Diseases and Disorders of the Circulatory System,1,Minor,Minor,Medical,Private Health Insurance,,,,N,Y,63680.38,14392.67
Long Island,Nassau,2908000,000511,NYU Winthrop Hospital,70 or Older,110,F,Other Race,Not Span/Hispanic,4,Emergency,Home w/ Home Health Services,2017,245,Syncope,202,ELECTROCARDIOGRAM,192,Cardiac catheterization for other non-coronary conditions,05,Diseases and Disorders of the Circulatory System,1,Minor,Minor,Medical,Medicare,Medicare,,,N,Y,169755.75,34943.56
Long Island,Nassau,2908000,000511,NYU Winthrop Hospital,50 to 69,115,F,White,Spanish/Hispanic,2,Emergency,Home or Self Care,2017,102,Nonspecific chest pain,047,DX CARDIAC CATHETERIZTN,192,Cardiac catheterization for other non-coronary conditions,05,Diseases and Disorders of the Circulatory System,2,Moderate,Minor,Medical,Medicare,Medicare,,,N,Y,57507.96,12070.38
Long Island,Nassau,2908000,000511,NYU Winthrop Hospital,50 to 69,119,F,White,Not Span/Hispanic,2,Urgent,Home or Self Care,2017,245,Syncope,047,DX CARDIAC CATHETERIZTN,192,Cardiac catheterization for other non-coronary conditions,05,Diseases and Disorders of the Circulatory System,1,Minor,Minor,Medical,Medicare,Medicare,Medicaid,,N,N,36604.95,8719.57
Long Island,Nassau,2908000,000511,NYU Winthrop Hospital,70 or Older,115,F,White,Not Span/Hispanic,5,Emergency,Home or Self Care,2017,245,Syncope,047,DX CARDIAC CATHETERIZTN,192,Cardiac catheterization for other non-coronary conditions,05,Diseases and Disorders of the Circulatory System,2,Moderate,Minor,Medical,Private Health Insurance,,,,N,Y,106468.79,23979.74
Long Island,Nassau,2908000,000511,NYU Winthrop Hospital,70 or Older,113,M,White,Not Span/Hispanic,2,Emergency,Home or Self Care,2017,245,Syncope,202,ELECTROCARDIOGRAM,192,Cardiac catheterization for other non-coronary conditions,05,Diseases and Disorders of the Circulatory System,2,Moderate,Minor,Medical,Blue Cross/Blue Shield,Medicare,Medicare,,N,Y,117227.08,23923.90
Long Island,Nassau,2908000,000511,NYU Winthrop Hospital,50 to 69,117,F,White,Not Span/Hispanic,1,Emergency,Home or Self Care,2017,102,Nonspecific chest pain,047,DX CARDIAC CATHETERIZTN,192,Cardiac catheterization for other non-coronary conditions,05,Diseases and Disorders of the Circulatory System,1,Minor,Minor,Medical,Blue Cross/Blue Shield,Medicare,Medicare,,N,Y,35333.62,7512.21
Long Island,Nassau,2908000,000511,NYU Winthrop Hospital,70 or Older,119,F,White,Not Span/Hispanic,9,Emergency,Hospice - Home,2017,099,Hypertension with complications and secondary hypertension,047,DX CARDIAC CATHETERIZTN,192,Cardiac catheterization for other non-coronary conditions,05,Diseases and Disorders of the Circulatory System,3,Major,Major,Medical,Medicare,Medicare,Blue Cross/Blue Shield,,N,Y,144217.24,33344.58
Long Island,Nassau,2908000,000511,NYU Winthrop Hospital,70 or Older,115,M,White,Not Span/Hispanic,11,Emergency,Hospice - Home,2017,099,Hypertension with complications and secondary hypertension,049,OTHER OR HEART PRCS,192,Cardiac catheterization for other non-coronary conditions,05,Diseases and Disorders of the Circulatory System,3,Major,Major,Medical,Medicare,Medicare,Blue Cross/Blue Shield,,N,Y,170368.26,44784.75
Long Island,Nassau,2908000,000511,NYU Winthrop Hospital,50 to 69,115,F,White,Not Span/Hispanic,1,Emergency,Home or Self Care,2017,102,Nonspecific chest pain,047,DX CARDIAC CATHETERIZTN,192,Cardiac catheterization for other non-coronary conditions,05,Diseases and Disorders of the Circulatory System,1,Minor,Minor,Medical,Medicare,Medicare,Private Health Insurance,,N,Y,29973.48,6630.04
Long Island,Nassau,2908000,000511,NYU Winthrop Hospital,50 to 69,115,F,White,Not Span/Hispanic,2,Emergency,Home or Self Care,2017,102,Nonspecific chest pain,047,DX CARDIAC CATHETERIZTN,192,Cardiac catheterization for other non-coronary conditions,05,Diseases and Disorders of the Circulatory System,1,Minor,Minor,Medical,Medicare,Medicare,Blue Cross/Blue Shield,,N,Y,48918.12,10945.30
Long Island,Nassau,2908000,000511,NYU Winthrop Hospital,50 to 69,115,M,White,Not Span/Hispanic,2,Emergency,Home or Self Care,2017,099,Hypertension with complications and secondary hypertension,047,DX CARDIAC CATHETERIZTN,192,Cardiac catheterization for other non-coronary conditions,05,Diseases and Disorders of the Circulatory System,3,Major,Major,Medical,Blue Cross/Blue Shield,Blue Cross/Blue Shield,Medicare,,N,Y,66309.58,11884.74
Long Island,Nassau,2908000,000511,NYU Winthrop Hospital,70 or Older,115,F,White,Not Span/Hispanic,8,Emergency,Home w/ Home Health Services,2017,099,Hypertension with complications and secondary hypertension,047,DX CARDIAC CATHETERIZTN,192,Cardiac catheterization for other non-coronary conditions,05,Diseases and Disorders of the Circulatory System,2,Moderate,Moderate,Medical,Medicare,Medicare,,,N,Y,115168.49,29835.81
Long Island,Nassau,2908000,000511,NYU Winthrop Hospital,70 or Older,119,M,White,Not Span/Hispanic,2,Elective,Home or Self Care,2017,096,Heart valve disorders,047,DX CARDIAC CATHETERIZTN,192,Cardiac catheterization for other non-coronary conditions,05,Diseases and Disorders of the Circulatory System,2,Moderate,Moderate,Medical,Medicare,Medicare,Private Health Insurance,,N,N,43954.25,8997.59
Long Island,Nassau,2908000,000511,NYU Winthrop Hospital,70 or Older,115,M,White,Not Span/Hispanic,1,Emergency,Home or Self Care,2017,102,Nonspecific chest pain,047,DX CARDIAC CATHETERIZTN,192,Cardiac catheterization for other non-coronary conditions,05,Diseases and Disorders of the Circulatory System,2,Moderate,Minor,Medical,Medicare,Medicare,Blue Cross/Blue Shield,,N,Y,41911.31,8535.89
Long Island,Nassau,2908000,000511,NYU Winthrop Hospital,70 or Older,115,F,White,Not Span/Hispanic,4,Emergency,Home or Self Care,2017,106,Cardiac dysrhythmias,047,DX CARDIAC CATHETERIZTN,192,Cardiac catheterization for other non-coronary conditions,05,Diseases and Disorders of the Circulatory System,2,Moderate,Moderate,Medical,Medicare,Medicare,Private Health Insurance,,N,Y,76670.98,18413.27
Long Island,Nassau,2908000,000511,NYU Winthrop Hospital,70 or Older,115,M,White,Not Span/Hispanic,1,Emergency,Home or Self Care,2017,102,Nonspecific chest pain,047,DX CARDIAC CATHETERIZTN,192,Cardiac catheterization for other non-coronary conditions,05,Diseases and Disorders of the Circulatory System,1,Minor,Minor,Medical,Medicare,Medicare,Private Health Insurance,,N,Y,33683.46,7059.42
Long Island,Nassau,2908000,000511,NYU Winthrop Hospital,70 or Older,115,F,White,Spanish/Hispanic,1,Emergency,Home or Self Care,2017,096,Heart valve disorders,047,DX CARDIAC CATHETERIZTN,192,Cardiac catheterization for other non-coronary conditions,05,Diseases and Disorders of the Circulatory System,2,Moderate,Major,Medical,Blue Cross/Blue Shield,Medicare,Medicare,,N,Y,30969.45,7041.25
Long Island,Nassau,2908000,000511,NYU Winthrop Hospital,70 or Older,119,F,White,Not Span/Hispanic,3,Urgent,Home w/ Home Health Services,2017,096,Heart valve disorders,047,DX CARDIAC CATHETERIZTN,192,Cardiac catheterization for other non-coronary conditions,05,Diseases and Disorders of the Circulatory System,2,Moderate,Minor,Medical,Medicare,Medicare,Private Health Insurance,,N,N,51887.90,12351.56
Long Island,Nassau,2908000,000511,NYU Winthrop Hospital,50 to 69,118,F,White,Not Span/Hispanic,24,Urgent,Skilled Nursing Home,2017,099,Hypertension with complications and secondary hypertension,047,DX CARDIAC CATHETERIZTN,192,Cardiac catheterization for other non-coronary conditions,05,Diseases and Disorders of the Circulatory System,4,Extreme,Extreme,Medical,Private Health Insurance,Medicare,Medicare,,N,N,388294.00,92010.20
Long Island,Nassau,2908000,000511,NYU Winthrop Hospital,70 or Older,115,M,White,Not Span/Hispanic,7,Emergency,Home w/ Home Health Services,2017,099,Hypertension with complications and secondary hypertension,047,DX CARDIAC CATHETERIZTN,192,Cardiac catheterization for other non-coronary conditions,05,Diseases and Disorders of the Circulatory System,3,Major,Major,Medical,Medicare,Medicare,Private Health Insurance,,N,Y,121943.34,28211.62
Long Island,Nassau,2908000,000511,NYU Winthrop Hospital,70 or Older,115,F,White,Not Span/Hispanic,6,Emergency,Home w/ Home Health Services,2017,245,Syncope,062,OT DX CARDIOVASC PRCS,192,Cardiac catheterization for other non-coronary conditions,05,Diseases and Disorders of the Circulatory System,2,Moderate,Moderate,Medical,Medicare,Medicare,Private Health Insurance,,N,Y,169423.10,39719.42
Long Island,Nassau,2908000,000511,NYU Winthrop Hospital,50 to 69,115,F,Black/African American,Not Span/Hispanic,5,Emergency,Home or Self Care,2017,102,Nonspecific chest pain,047,DX CARDIAC CATHETERIZTN,192,Cardiac catheterization for other non-coronary conditions,05,Diseases and Disorders of the Circulatory System,2,Moderate,Minor,Medical,Medicaid,Medicaid,,,N,Y,86547.20,20964.37
Long Island,Nassau,2908000,000511,NYU Winthrop Hospital,50 to 69,110,M,White,Not Span/Hispanic,7,Emergency,Home or Self Care,2017,099,Hypertension with complications and secondary hypertension,047,DX CARDIAC CATHETERIZTN,192,Cardiac catheterization for other non-coronary conditions,05,Diseases and Disorders of the Circulatory System,3,Major,Moderate,Medical,Private Health Insurance,,,,N,Y,109522.56,27746.14
Long Island,Nassau,2908000,000511,NYU Winthrop Hospital,50 to 69,115,F,Other Race,Spanish/Hispanic,6,Emergency,Home or Self Care,2017,245,Syncope,202,ELECTROCARDIOGRAM,192,Cardiac catheterization for other non-coronary conditions,05,Diseases and Disorders of the Circulatory System,2,Moderate,Moderate,Medical,Medicaid,,,,N,Y,201597.29,43872.25
Long Island,Nassau,2908000,000511,NYU Winthrop Hospital,30 to 49,115,F,White,Spanish/Hispanic,4,Urgent,Home or Self Care,2017,245,Syncope,202,ELECTROCARDIOGRAM,192,Cardiac catheterization for other non-coronary conditions,05,Diseases and Disorders of the Circulatory System,2,Moderate,Minor,Medical,Medicaid,Medicaid,,,N,N,180610.10,41378.99
Long Island,Nassau,2908000,000511,NYU Winthrop Hospital,50 to 69,115,F,White,Not Span/Hispanic,10,Emergency,Skilled Nursing Home,2017,099,Hypertension with complications and secondary hypertension,047,DX CARDIAC CATHETERIZTN,192,Cardiac catheterization for other non-coronary conditions,05,Diseases and Disorders of the Circulatory System,3,Major,Extreme,Medical,Medicare,Medicare,Medicaid,,N,Y,155505.90,37484.42
Long Island,Nassau,2908000,000511,NYU Winthrop Hospital,30 to 49,114,F,Black/African American,Not Span/Hispanic,4,Emergency,Home or Self Care,2017,106,Cardiac dysrhythmias,062,OT DX CARDIOVASC PRCS,192,Cardiac catheterization for other non-coronary conditions,05,Diseases and Disorders of the Circulatory System,1,Minor,Minor,Medical,Medicaid,Medicaid,,,N,Y,210137.33,46636.26
Long Island,Nassau,2908000,000511,NYU Winthrop Hospital,70 or Older,115,M,White,Not Span/Hispanic,10,Emergency,Home w/ Home Health Services,2017,106,Cardiac dysrhythmias,047,DX CARDIAC CATHETERIZTN,192,Cardiac catheterization for other non-coronary conditions,05,Diseases and Disorders of the Circulatory System,3,Major,Moderate,Medical,Medicare,Medicare,,,N,Y,166905.73,39951.66
Long Island,Nassau,2908000,000511,NYU Winthrop Hospital,70 or Older,117,F,White,Not Span/Hispanic,4,Emergency,Home or Self Care,2017,102,Nonspecific chest pain,047,DX CARDIAC CATHETERIZTN,192,Cardiac catheterization for other non-coronary conditions,05,Diseases and Disorders of the Circulatory System,2,Moderate,Minor,Medical,Medicare,Medicare,Private Health Insurance,,N,Y,75200.95,17934.42
Long Island,Nassau,2908000,000511,NYU Winthrop Hospital,70 or Older,117,M,White,Not Span/Hispanic,8,Emergency,Inpatient Rehabilitation Facility,2017,107,Cardiac arrest and ventricular fibrillation,047,DX CARDIAC CATHETERIZTN,192,Cardiac catheterization for other non-coronary conditions,05,Diseases and Disorders of the Circulatory System,2,Moderate,Moderate,Medical,Medicare,Medicare,Private Health Insurance,,N,Y,137631.43,29832.36
Long Island,Nassau,2908000,000511,NYU Winthrop Hospital,50 to 69,115,F,White,Not Span/Hispanic,3,Emergency,Home or Self Care,2017,102,Nonspecific chest pain,047,DX CARDIAC CATHETERIZTN,192,Cardiac catheterization for other non-coronary conditions,05,Diseases and Disorders of the Circulatory System,2,Moderate,Minor,Medical,Federal/State/Local/VA,,,,N,Y,89217.18,18597.74
Long Island,Nassau,2908000,000511,NYU Winthrop Hospital,50 to 69,115,M,Black/African American,Not Span/Hispanic,4,Emergency,Home or Self Care,2017,106,Cardiac dysrhythmias,225,CONV OF CARDIAC RHYTHM,192,Cardiac catheterization for other non-coronary conditions,05,Diseases and Disorders of the Circulatory System,2,Moderate,Minor,Medical,Blue Cross/Blue Shield,Medicare,,,N,Y,54210.01,13982.60
Long Island,Nassau,2908000,000511,NYU Winthrop Hospital,70 or Older,114,F,Black/African American,Not Span/Hispanic,18,Emergency,Home w/ Home Health Services,2017,099,Hypertension with complications and secondary hypertension,047,DX CARDIAC CATHETERIZTN,192,Cardiac catheterization for other non-coronary conditions,05,Diseases and Disorders of the Circulatory System,4,Extreme,Extreme,Medical,Medicare,,,,N,Y,328043.72,70470.43
Long Island,Nassau,2908000,000511,NYU Winthrop Hospital,50 to 69,114,M,Black/African American,Not Span/Hispanic,4,Emergency,Home or Self Care,2017,245,Syncope,047,DX CARDIAC CATHETERIZTN,192,Cardiac catheterization for other non-coronary conditions,05,Diseases and Disorders of the Circulatory System,2,Moderate,Minor,Medical,Blue Cross/Blue Shield,,,,N,Y,131453.09,29326.27
Long Island,Nassau,2908000,000511,NYU Winthrop Hospital,70 or Older,117,F,White,Not Span/Hispanic,5,Urgent,Home or Self Care,2017,106,Cardiac dysrhythmias,047,DX CARDIAC CATHETERIZTN,192,Cardiac catheterization for other non-coronary conditions,05,Diseases and Disorders of the Circulatory System,1,Minor,Minor,Medical,Medicare,Medicare,Blue Cross/Blue Shield,,N,N,206765.55,46837.08