Hospital Service Area,Hospital County,Operating Certificate Number,Permanent Facility Id,Facility Name,Age Group,Zip Code - 3 digits,Gender,Race,Ethnicity,Length of Stay,Type of Admission,Patient Disposition,Discharge Year,CCS Diagnosis Code,CCS Diagnosis Description,CCS Procedure Code,CCS Procedure Description,APR DRG Code,APR DRG Description,APR MDC Code,APR MDC Description,APR Severity of Illness Code,APR Severity of Illness Description,APR Risk of Mortality,APR Medical Surgical Description,Payment Typology 1,Payment Typology 2,Payment Typology 3,Birth Weight,Abortion Edit Indicator,Emergency Department Indicator,Total Charges,Total Costs
Long Island,Suffolk,5123000,000885,Brookhaven Memorial Hospital Medical Center Inc,50 to 69,119,M,White,Not Span/Hispanic,4,Emergency,Home w/ Home Health Services,2017,102,Nonspecific chest pain,047,DX CARDIAC CATHETERIZTN,192,Cardiac catheterization for other non-coronary conditions,05,Diseases and Disorders of the Circulatory System,3,Major,Minor,Medical,Medicare,Medicare,,,N,Y,49494.68,10688.09
Long Island,Suffolk,5123000,000885,Brookhaven Memorial Hospital Medical Center Inc,50 to 69,117,M,White,Not Span/Hispanic,1,Emergency,Home or Self Care,2017,106,Cardiac dysrhythmias,047,DX CARDIAC CATHETERIZTN,192,Cardiac catheterization for other non-coronary conditions,05,Diseases and Disorders of the Circulatory System,2,Moderate,Minor,Medical,Private Health Insurance,Private Health Insurance,Private Health Insurance,,N,Y,29316.48,5384.83
Long Island,Suffolk,5123000,000885,Brookhaven Memorial Hospital Medical Center Inc,50 to 69,117,M,White,Not Span/Hispanic,20,Emergency,Home or Self Care,2017,097,Peri-; endo-; and myocarditis; cardiomyopathy (except that caused by tuberculosis or sexually transmitted disease),047,DX CARDIAC CATHETERIZTN,192,Cardiac catheterization for other non-coronary conditions,05,Diseases and Disorders of the Circulatory System,2,Moderate,Minor,Medical,Private Health Insurance,Medicaid,,,N,Y,130904.30,29319.46
Long Island,Suffolk,5123000,000885,Brookhaven Memorial Hospital Medical Center Inc,50 to 69,119,F,White,Not Span/Hispanic,2,Emergency,Home or Self Care,2017,097,Peri-; endo-; and myocarditis; cardiomyopathy (except that caused by tuberculosis or sexually transmitted disease),047,DX CARDIAC CATHETERIZTN,192,Cardiac catheterization for other non-coronary conditions,05,Diseases and Disorders of the Circulatory System,3,Major,Moderate,Medical,Private Health Insurance,,,,N,Y,44440.93,8350.70
Long Island,Suffolk,5123000,000885,Brookhaven Memorial Hospital Medical Center Inc,50 to 69,117,M,White,Not Span/Hispanic,4,Emergency,Home or Self Care,2017,106,Cardiac dysrhythmias,047,DX CARDIAC CATHETERIZTN,192,Cardiac catheterization for other non-coronary conditions,05,Diseases and Disorders of the Circulatory System,3,Major,Major,Medical,Private Health Insurance,,,,N,Y,59516.91,11293.17
Long Island,Suffolk,5123000,000885,Brookhaven Memorial Hospital Medical Center Inc,30 to 49,117,M,Other Race,Not Span/Hispanic,1,Emergency,Home or Self Care,2017,102,Nonspecific chest pain,047,DX CARDIAC CATHETERIZTN,192,Cardiac catheterization for other non-coronary conditions,05,Diseases and Disorders of the Circulatory System,3,Major,Minor,Medical,Private Health Insurance,Medicaid,,,N,Y,43014.15,6706.17
Long Island,Suffolk,5123000,000885,Brookhaven Memorial Hospital Medical Center Inc,30 to 49,119,M,White,Not Span/Hispanic,6,Emergency,Home or Self Care,2017,099,Hypertension with complications and secondary hypertension,047,DX CARDIAC CATHETERIZTN,192,Cardiac catheterization for other non-coronary conditions,05,Diseases and Disorders of the Circulatory System,3,Major,Major,Medical,Blue Cross/Blue Shield,,,,N,Y,78453.28,15256.93
Long Island,Suffolk,5123000,000885,Brookhaven Memorial Hospital Medical Center Inc,70 or Older,117,F,White,Not Span/Hispanic,3,Emergency,Home w/ Home Health Services,2017,096,Heart valve disorders,047,DX CARDIAC CATHETERIZTN,192,Cardiac catheterization for other non-coronary conditions,05,Diseases and Disorders of the Circulatory System,2,Moderate,Minor,Medical,Medicare,Private Health Insurance,,,N,Y,60774.76,11660.54
Long Island,Suffolk,5123000,000885,Brookhaven Memorial Hospital Medical Center Inc,50 to 69,119,F,White,Not Span/Hispanic,7,Emergency,Short-term Hospital,2017,099,Hypertension with complications and secondary hypertension,047,DX CARDIAC CATHETERIZTN,192,Cardiac catheterization for other non-coronary conditions,05,Diseases and Disorders of the Circulatory System,3,Major,Moderate,Medical,Medicare,Medicare,,,N,Y,82016.04,15265.09
Long Island,Suffolk,5123000,000885,Brookhaven Memorial Hospital Medical Center Inc,70 or Older,119,M,White,Not Span/Hispanic,2,Emergency,Short-term Hospital,2017,117,Other circulatory disease,173,OT DX PRC SKIN/SUBCUTAN,192,Cardiac catheterization for other non-coronary conditions,05,Diseases and Disorders of the Circulatory System,2,Moderate,Moderate,Medical,Medicare,Medicare,Medicaid,,N,Y,146646.43,23956.19
Long Island,Suffolk,5123000,000885,Brookhaven Memorial Hospital Medical Center Inc,30 to 49,119,F,White,Not Span/Hispanic,1,Emergency,Home or Self Care,2017,102,Nonspecific chest pain,047,DX CARDIAC CATHETERIZTN,192,Cardiac catheterization for other non-coronary conditions,05,Diseases and Disorders of the Circulatory System,1,Minor,Minor,Medical,Private Health Insurance,,,,N,Y,27147.57,5346.45
Long Island,Suffolk,5123000,000885,Brookhaven Memorial Hospital Medical Center Inc,70 or Older,117,F,White,Not Span/Hispanic,24,Emergency,Home w/ Home Health Services,2017,108,Congestive heart failure; nonhypertensive,047,DX CARDIAC CATHETERIZTN,192,Cardiac catheterization for other non-coronary conditions,05,Diseases and Disorders of the Circulatory System,3,Major,Moderate,Medical,Medicare,Medicare,Blue Cross/Blue Shield,,N,Y,193628.58,39816.60
Long Island,Suffolk,5123000,000885,Brookhaven Memorial Hospital Medical Center Inc,70 or Older,117,F,White,Not Span/Hispanic,6,Emergency,Short-term Hospital,2017,096,Heart valve disorders,047,DX CARDIAC CATHETERIZTN,192,Cardiac catheterization for other non-coronary conditions,05,Diseases and Disorders of the Circulatory System,2,Moderate,Moderate,Medical,Medicare,,,,N,Y,79779.84,14450.61
Long Island,Suffolk,5123000,000885,Brookhaven Memorial Hospital Medical Center Inc,50 to 69,117,F,White,Not Span/Hispanic,2,Emergency,Home or Self Care,2017,102,Nonspecific chest pain,047,DX CARDIAC CATHETERIZTN,192,Cardiac catheterization for other non-coronary conditions,05,Diseases and Disorders of the Circulatory System,2,Moderate,Minor,Medical,Private Health Insurance,Medicare,,,N,Y,46329.12,9366.25
Long Island,Suffolk,5123000,000885,Brookhaven Memorial Hospital Medical Center Inc,50 to 69,117,F,White,Not Span/Hispanic,3,Emergency,Home or Self Care,2017,102,Nonspecific chest pain,047,DX CARDIAC CATHETERIZTN,192,Cardiac catheterization for other non-coronary conditions,05,Diseases and Disorders of the Circulatory System,2,Moderate,Minor,Medical,Private Health Insurance,,,,N,Y,61637.15,10626.80
Long Island,Suffolk,5123000,000885,Brookhaven Memorial Hospital Medical Center Inc,50 to 69,119,F,White,Not Span/Hispanic,1,Emergency,Home or Self Care,2017,102,Nonspecific chest pain,047,DX CARDIAC CATHETERIZTN,192,Cardiac catheterization for other non-coronary conditions,05,Diseases and Disorders of the Circulatory System,1,Minor,Minor,Medical,Private Health Insurance,,,,N,Y,27675.95,5434.56
Long Island,Suffolk,5123000,000885,Brookhaven Memorial Hospital Medical Center Inc,70 or Older,119,F,Other Race,Not Span/Hispanic,1,Emergency,Home or Self Care,2017,102,Nonspecific chest pain,047,DX CARDIAC CATHETERIZTN,192,Cardiac catheterization for other non-coronary conditions,05,Diseases and Disorders of the Circulatory System,2,Moderate,Minor,Medical,Medicare,Medicare,Medicaid,,N,Y,35470.78,6808.16
Long Island,Suffolk,5123000,000885,Brookhaven Memorial Hospital Medical Center Inc,50 to 69,117,M,White,Not Span/Hispanic,2,Emergency,Home w/ Home Health Services,2017,099,Hypertension with complications and secondary hypertension,047,DX CARDIAC CATHETERIZTN,192,Cardiac catheterization for other non-coronary conditions,05,Diseases and Disorders of the Circulatory System,3,Major,Major,Medical,Medicare,,,,N,Y,48766.65,9894.41
Long Island,Suffolk,5123000,000885,Brookhaven Memorial Hospital Medical Center Inc,50 to 69,119,M,White,Not Span/Hispanic,2,Emergency,Home or Self Care,2017,102,Nonspecific chest pain,047,DX CARDIAC CATHETERIZTN,192,Cardiac catheterization for other non-coronary conditions,05,Diseases and Disorders of the Circulatory System,2,Moderate,Minor,Medical,Medicare,Medicare,Private Health Insurance,,N,Y,37571.95,6939.09
Long Island,Suffolk,5123000,000885,Brookhaven Memorial Hospital Medical Center Inc,30 to 49,117,M,White,Not Span/Hispanic,1,Emergency,Home or Self Care,2017,660,Alcohol-related disorders,047,DX CARDIAC CATHETERIZTN,192,Cardiac catheterization for other non-coronary conditions,05,Diseases and Disorders of the Circulatory System,1,Minor,Minor,Medical,Medicaid,,,,N,Y,29935.05,5809.36
Long Island,Suffolk,5123000,000885,Brookhaven Memorial Hospital Medical Center Inc,50 to 69,117,F,White,Not Span/Hispanic,19,Emergency,Home w/ Home Health Services,2017,106,Cardiac dysrhythmias,047,DX CARDIAC CATHETERIZTN,192,Cardiac catheterization for other non-coronary conditions,05,Diseases and Disorders of the Circulatory System,3,Major,Moderate,Medical,Medicare,Medicare,Private Health Insurance,,N,Y,171762.42,32745.61
Long Island,Suffolk,5123000,000885,Brookhaven Memorial Hospital Medical Center Inc,50 to 69,119,F,Other Race,Not Span/Hispanic,5,Emergency,Home or Self Care,2017,102,Nonspecific chest pain,047,DX CARDIAC CATHETERIZTN,192,Cardiac catheterization for other non-coronary conditions,05,Diseases and Disorders of the Circulatory System,2,Moderate,Minor,Medical,Private Health Insurance,,,,N,Y,90916.81,15110.66
Long Island,Suffolk,5123000,000885,Brookhaven Memorial Hospital Medical Center Inc,50 to 69,117,M,Other Race,Not Span/Hispanic,2,Emergency,Home or Self Care,2017,212,Other bone disease and musculoskeletal deformities,058,HEMODIALYSIS,192,Cardiac catheterization for other non-coronary conditions,05,Diseases and Disorders of the Circulatory System,3,Major,Moderate,Medical,Private Health Insurance,,,,N,Y,44348.85,8491.61
Long Island,Suffolk,5123000,000885,Brookhaven Memorial Hospital Medical Center Inc,70 or Older,119,M,White,Not Span/Hispanic,6,Emergency,Home w/ Home Health Services,2017,099,Hypertension with complications and secondary hypertension,047,DX CARDIAC CATHETERIZTN,192,Cardiac catheterization for other non-coronary conditions,05,Diseases and Disorders of the Circulatory System,3,Major,Extreme,Medical,Medicare,Medicare,Blue Cross/Blue Shield,,N,Y,73263.56,15240.85
Long Island,Suffolk,5123000,000885,Brookhaven Memorial Hospital Medical Center Inc,50 to 69,117,F,White,Not Span/Hispanic,1,Emergency,Home or Self Care,2017,104,Other and ill-defined heart disease,047,DX CARDIAC CATHETERIZTN,192,Cardiac catheterization for other non-coronary conditions,05,Diseases and Disorders of the Circulatory System,1,Minor,Minor,Medical,Private Health Insurance,,,,N,Y,30856.67,6060.78
Long Island,Suffolk,5123000,000885,Brookhaven Memorial Hospital Medical Center Inc,50 to 69,119,M,White,Not Span/Hispanic,2,Emergency,Home or Self Care,2017,106,Cardiac dysrhythmias,047,DX CARDIAC CATHETERIZTN,192,Cardiac catheterization for other non-coronary conditions,05,Diseases and Disorders of the Circulatory System,1,Minor,Minor,Medical,Blue Cross/Blue Shield,Medicare,,,N,Y,100157.50,21165.41
Long Island,Suffolk,5123000,000885,Brookhaven Memorial Hospital Medical Center Inc,50 to 69,119,F,White,Not Span/Hispanic,1,Emergency,Home or Self Care,2017,102,Nonspecific chest pain,047,DX CARDIAC CATHETERIZTN,192,Cardiac catheterization for other non-coronary conditions,05,Diseases and Disorders of the Circulatory System,1,Minor,Minor,Medical,Private Health Insurance,,,,N,Y,26422.25,5392.49
Long Island,Suffolk,5123000,000885,Brookhaven Memorial Hospital Medical Center Inc,70 or Older,119,F,White,Not Span/Hispanic,2,Emergency,Home or Self Care,2017,245,Syncope,047,DX CARDIAC CATHETERIZTN,192,Cardiac catheterization for other non-coronary conditions,05,Diseases and Disorders of the Circulatory System,3,Major,Major,Medical,Medicare,Medicare,Private Health Insurance,,N,Y,49793.53,9424.49
Long Island,Suffolk,5123000,000885,Brookhaven Memorial Hospital Medical Center Inc,50 to 69,117,F,White,Not Span/Hispanic,1,Emergency,Short-term Hospital,2017,108,Congestive heart failure; nonhypertensive,047,DX CARDIAC CATHETERIZTN,192,Cardiac catheterization for other non-coronary conditions,05,Diseases and Disorders of the Circulatory System,2,Moderate,Minor,Medical,Private Health Insurance,,,,N,Y,29909.96,6380.67
Long Island,Suffolk,5123000,000885,Brookhaven Memorial Hospital Medical Center Inc,50 to 69,117,M,White,Not Span/Hispanic,2,Emergency,Short-term Hospital,2017,099,Hypertension with complications and secondary hypertension,047,DX CARDIAC CATHETERIZTN,192,Cardiac catheterization for other non-coronary conditions,05,Diseases and Disorders of the Circulatory System,3,Major,Major,Medical,Private Health Insurance,Medicare,,,N,Y,42029.96,7633.47
Long Island,Suffolk,5123000,000885,Brookhaven Memorial Hospital Medical Center Inc,18 to 29,119,M,Black/African American,Not Span/Hispanic,1,Emergency,Court/Law Enforcement,2017,213,Cardiac and circulatory congenital anomalies,047,DX CARDIAC CATHETERIZTN,192,Cardiac catheterization for other non-coronary conditions,05,Diseases and Disorders of the Circulatory System,1,Minor,Minor,Medical,Medicaid,,,,N,Y,28490.80,5883.21
Long Island,Suffolk,5123000,000885,Brookhaven Memorial Hospital Medical Center Inc,30 to 49,117,M,Other Race,Not Span/Hispanic,6,Emergency,Home w/ Home Health Services,2017,099,Hypertension with complications and secondary hypertension,047,DX CARDIAC CATHETERIZTN,192,Cardiac catheterization for other non-coronary conditions,05,Diseases and Disorders of the Circulatory System,3,Major,Major,Medical,Medicare,Medicare,Medicaid,,N,Y,71703.10,13706.98
Long Island,Suffolk,5123000,000885,Brookhaven Memorial Hospital Medical Center Inc,30 to 49,117,M,White,Not Span/Hispanic,4,Emergency,Home or Self Care,2017,106,Cardiac dysrhythmias,047,DX CARDIAC CATHETERIZTN,192,Cardiac catheterization for other non-coronary conditions,05,Diseases and Disorders of the Circulatory System,2,Moderate,Minor,Medical,Private Health Insurance,,,,N,Y,72133.77,11907.50
Long Island,Suffolk,5123000,000885,Brookhaven Memorial Hospital Medical Center Inc,50 to 69,117,M,White,Not Span/Hispanic,7,Emergency,Short-term Hospital,2017,099,Hypertension with complications and secondary hypertension,047,DX CARDIAC CATHETERIZTN,192,Cardiac catheterization for other non-coronary conditions,05,Diseases and Disorders of the Circulatory System,4,Extreme,Major,Medical,Private Health Insurance,Medicare,,,N,Y,111588.27,21996.02
Long Island,Suffolk,5123000,000885,Brookhaven Memorial Hospital Medical Center Inc,50 to 69,117,F,White,Not Span/Hispanic,1,Emergency,Home or Self Care,2017,102,Nonspecific chest pain,047,DX CARDIAC CATHETERIZTN,192,Cardiac catheterization for other non-coronary conditions,05,Diseases and Disorders of the Circulatory System,1,Minor,Minor,Medical,Private Health Insurance,,,,N,Y,36333.60,7456.66
Long Island,Suffolk,5123000,000885,Brookhaven Memorial Hospital Medical Center Inc,30 to 49,119,F,White,Not Span/Hispanic,1,Emergency,Short-term Hospital,2017,108,Congestive heart failure; nonhypertensive,047,DX CARDIAC CATHETERIZTN,192,Cardiac catheterization for other non-coronary conditions,05,Diseases and Disorders of the Circulatory System,2,Moderate,Minor,Medical,Private Health Insurance,,,,N,Y,47230.34,8070.87
Long Island,Suffolk,5123000,000885,Brookhaven Memorial Hospital Medical Center Inc,50 to 69,117,F,Other Race,Not Span/Hispanic,1,Emergency,Home or Self Care,2017,102,Nonspecific chest pain,047,DX CARDIAC CATHETERIZTN,192,Cardiac catheterization for other non-coronary conditions,05,Diseases and Disorders of the Circulatory System,2,Moderate,Minor,Medical,Private Health Insurance,,,,N,Y,41728.66,6790.26
Long Island,Suffolk,5123000,000885,Brookhaven Memorial Hospital Medical Center Inc,50 to 69,117,F,Other Race,Not Span/Hispanic,1,Emergency,Home or Self Care,2017,102,Nonspecific chest pain,047,DX CARDIAC CATHETERIZTN,192,Cardiac catheterization for other non-coronary conditions,05,Diseases and Disorders of the Circulatory System,2,Moderate,Minor,Medical,Private Health Insurance,,,,N,Y,36456.45,6664.34
Long Island,Suffolk,5123000,000885,Brookhaven Memorial Hospital Medical Center Inc,70 or Older,OOS,F,White,Not Span/Hispanic,5,Emergency,Home or Self Care,2017,106,Cardiac dysrhythmias,047,DX CARDIAC CATHETERIZTN,192,Cardiac catheterization for other non-coronary conditions,05,Diseases and Disorders of the Circulatory System,3,Major,Moderate,Medical,Medicare,Medicare,,,N,Y,71331.52,14833.50
Long Island,Suffolk,5123000,000885,Brookhaven Memorial Hospital Medical Center Inc,50 to 69,119,M,White,Not Span/Hispanic,1,Emergency,Home or Self Care,2017,102,Nonspecific chest pain,047,DX CARDIAC CATHETERIZTN,192,Cardiac catheterization for other non-coronary conditions,05,Diseases and Disorders of the Circulatory System,1,Minor,Minor,Medical,Private Health Insurance,,,,N,Y,35546.27,6757.23
Long Island,Suffolk,5123000,000885,Brookhaven Memorial Hospital Medical Center Inc,18 to 29,117,M,Black/African American,Not Span/Hispanic,1,Emergency,Home or Self Care,2017,106,Cardiac dysrhythmias,047,DX CARDIAC CATHETERIZTN,192,Cardiac catheterization for other non-coronary conditions,05,Diseases and Disorders of the Circulatory System,2,Moderate,Minor,Medical,Private Health Insurance,,,,N,Y,48338.94,9689.04
Long Island,Suffolk,5123000,000885,Brookhaven Memorial Hospital Medical Center Inc,70 or Older,117,F,Other Race,Not Span/Hispanic,9,Emergency,Short-term Hospital,2017,099,Hypertension with complications and secondary hypertension,047,DX CARDIAC CATHETERIZTN,192,Cardiac catheterization for other non-coronary conditions,05,Diseases and Disorders of the Circulatory System,3,Major,Extreme,Medical,Medicare,Medicare,Medicaid,,N,Y,103214.37,19966.66
Long Island,Suffolk,5123000,000885,Brookhaven Memorial Hospital Medical Center Inc,70 or Older,OOS,M,White,Not Span/Hispanic,5,Emergency,Home or Self Care,2017,106,Cardiac dysrhythmias,047,DX CARDIAC CATHETERIZTN,192,Cardiac catheterization for other non-coronary conditions,05,Diseases and Disorders of the Circulatory System,3,Major,Major,Medical,Medicare,Medicare,Private Health Insurance,,N,Y,84711.00,16543.12
Long Island,Suffolk,5123000,000885,Brookhaven Memorial Hospital Medical Center Inc,70 or Older,117,F,White,Not Span/Hispanic,4,Emergency,Home or Self Care,2017,099,Hypertension with complications and secondary hypertension,047,DX CARDIAC CATHETERIZTN,192,Cardiac catheterization for other non-coronary conditions,05,Diseases and Disorders of the Circulatory System,3,Major,Extreme,Medical,Medicare,,,,N,Y,61400.01,11605.50
Long Island,Suffolk,5123000,000885,Brookhaven Memorial Hospital Medical Center Inc,70 or Older,119,M,White,Not Span/Hispanic,4,Emergency,Skilled Nursing Home,2017,106,Cardiac dysrhythmias,047,DX CARDIAC CATHETERIZTN,192,Cardiac catheterization for other non-coronary conditions,05,Diseases and Disorders of the Circulatory System,3,Major,Major,Medical,Medicare,Medicare,Blue Cross/Blue Shield,,N,Y,54371.32,10671.09
Long Island,Suffolk,5123000,000885,Brookhaven Memorial Hospital Medical Center Inc,50 to 69,119,F,White,Not Span/Hispanic,1,Emergency,Home or Self Care,2017,102,Nonspecific chest pain,047,DX CARDIAC CATHETERIZTN,192,Cardiac catheterization for other non-coronary conditions,05,Diseases and Disorders of the Circulatory System,2,Moderate,Minor,Medical,Medicare,Medicare,Private Health Insurance,,N,Y,43860.97,8159.26
Long Island,Suffolk,5123000,000885,Brookhaven Memorial Hospital Medical Center Inc,50 to 69,119,M,Black/African American,Not Span/Hispanic,5,Emergency,Expired,2017,107,Cardiac arrest and ventricular fibrillation,216,RESP INTUB/MECH VENTIL,192,Cardiac catheterization for other non-coronary conditions,05,Diseases and Disorders of the Circulatory System,4,Extreme,Extreme,Medical,Private Health Insurance,Medicaid,,,N,Y,114926.51,18576.45
Long Island,Suffolk,5123000,000885,Brookhaven Memorial Hospital Medical Center Inc,50 to 69,119,M,White,Not Span/Hispanic,8,Emergency,Short-term Hospital,2017,099,Hypertension with complications and secondary hypertension,193,DX ULTRASOUND HEART,192,Cardiac catheterization for other non-coronary conditions,05,Diseases and Disorders of the Circulatory System,3,Major,Moderate,Medical,Private Health Insurance,,,,N,Y,93514.04,19313.57
Long Island,Suffolk,5123000,000885,Brookhaven Memorial Hospital Medical Center Inc,30 to 49,119,F,Other Race,Not Span/Hispanic,1,Emergency,Home or Self Care,2017,102,Nonspecific chest pain,047,DX CARDIAC CATHETERIZTN,192,Cardiac catheterization for other non-coronary conditions,05,Diseases and Disorders of the Circulatory System,1,Minor,Minor,Medical,Private Health Insurance,Medicaid,,,N,Y,56714.07,11676.34
Long Island,Suffolk,5123000,000885,Brookhaven Memorial Hospital Medical Center Inc,30 to 49,119,M,White,Not Span/Hispanic,2,Emergency,Home or Self Care,2017,099,Hypertension with complications and secondary hypertension,047,DX CARDIAC CATHETERIZTN,192,Cardiac catheterization for other non-coronary conditions,05,Diseases and Disorders of the Circulatory System,3,Major,Moderate,Medical,Blue Cross/Blue Shield,,,,N,Y,62311.88,11420.24
Long Island,Suffolk,5123000,000885,Brookhaven Memorial Hospital Medical Center Inc,30 to 49,117,M,White,Not Span/Hispanic,4,Emergency,Left Against Medical Advice,2017,102,Nonspecific chest pain,047,DX CARDIAC CATHETERIZTN,192,Cardiac catheterization for other non-coronary conditions,05,Diseases and Disorders of the Circulatory System,2,Moderate,Minor,Medical,Medicaid,,,,N,Y,58116.99,11900.35
Long Island,Suffolk,5123000,000885,Brookhaven Memorial Hospital Medical Center Inc,30 to 49,117,M,White,Not Span/Hispanic,9,Emergency,Home or Self Care,2017,108,Congestive heart failure; nonhypertensive,047,DX CARDIAC CATHETERIZTN,192,Cardiac catheterization for other non-coronary conditions,05,Diseases and Disorders of the Circulatory System,4,Extreme,Extreme,Medical,Self-Pay,,,,N,Y,91732.39,18247.63
Long Island,Suffolk,5123000,000885,Brookhaven Memorial Hospital Medical Center Inc,30 to 49,117,M,Black/African American,Not Span/Hispanic,8,Emergency,Home or Self Care,2017,099,Hypertension with complications and secondary hypertension,047,DX CARDIAC CATHETERIZTN,192,Cardiac catheterization for other non-coronary conditions,05,Diseases and Disorders of the Circulatory System,2,Moderate,Moderate,Medical,Private Health Insurance,,,,N,Y,87009.82,18373.49
Long Island,Suffolk,5123000,000885,Brookhaven Memorial Hospital Medical Center Inc,70 or Older,117,F,Other Race,Not Span/Hispanic,5,Emergency,Home w/ Home Health Services,2017,107,Cardiac arrest and ventricular fibrillation,173,OT DX PRC SKIN/SUBCUTAN,192,Cardiac catheterization for other non-coronary conditions,05,Diseases and Disorders of the Circulatory System,3,Major,Major,Medical,Medicare,Medicare,Medicaid,,N,Y,160106.49,29816.11
Long Island,Suffolk,5123000,000885,Brookhaven Memorial Hospital Medical Center Inc,50 to 69,117,F,White,Not Span/Hispanic,3,Emergency,Home or Self Care,2017,212,Other bone disease and musculoskeletal deformities,047,DX CARDIAC CATHETERIZTN,192,Cardiac catheterization for other non-coronary conditions,05,Diseases and Disorders of the Circulatory System,2,Moderate,Minor,Medical,Private Health Insurance,,,,N,Y,56247.80,11105.99