Hospital Service Area,Hospital County,Operating Certificate Number,Permanent Facility Id,Facility Name,Age Group,Zip Code - 3 digits,Gender,Race,Ethnicity,Length of Stay,Type of Admission,Patient Disposition,Discharge Year,CCS Diagnosis Code,CCS Diagnosis Description,CCS Procedure Code,CCS Procedure Description,APR DRG Code,APR DRG Description,APR MDC Code,APR MDC Description,APR Severity of Illness Code,APR Severity of Illness Description,APR Risk of Mortality,APR Medical Surgical Description,Payment Typology 1,Payment Typology 2,Payment Typology 3,Birth Weight,Abortion Edit Indicator,Emergency Department Indicator,Total Charges,Total Costs
New York City,Queens,7003004,001630,Long Island Jewish Medical Center,50 to 69,114,M,Other Race,Not Span/Hispanic,10,Emergency,Home or Self Care,2018,CIR019,HEART FAILURE,MAM005,MEASUREMENT DURING CARDIAC CATHETERIZATION,192,CARDIAC CATHETERIZATION FOR OTHER NON-CORONARY CONDITIONS,05,DISEASES AND DISORDERS OF THE CIRCULATORY SYSTEM,3,Major,Moderate,Medical,Medicare,Medicare,Self-Pay,,,false,170696.08,31940.08
Long Island,Suffolk,5154000,000924,South Shore University Hospital,50 to 69,119,M,White,Not Span/Hispanic,6,Emergency,Home or Self Care,2018,CIR017,CARDIAC DYSRHYTHMIAS,MAM005,MEASUREMENT DURING CARDIAC CATHETERIZATION,192,CARDIAC CATHETERIZATION FOR OTHER NON-CORONARY CONDITIONS,05,DISEASES AND DISORDERS OF THE CIRCULATORY SYSTEM,2,Moderate,Moderate,Medical,Blue Cross/Blue Shield,Medicare,,,,true,57559.43,12480.52
New York City,Manhattan,7002054,001464,New York-Presbyterian Hospital - Columbia Presbyterian Center,70 or Older,112,M,Other Race,Not Span/Hispanic,3,Urgent,Home or Self Care,2018,CIR003,NONRHEUMATIC AND UNSPECIFIED VALVE DISORDERS,MAM005,MEASUREMENT DURING CARDIAC CATHETERIZATION,192,CARDIAC CATHETERIZATION FOR OTHER NON-CORONARY CONDITIONS,05,DISEASES AND DISORDERS OF THE CIRCULATORY SYSTEM,2,Moderate,Moderate,Medical,Medicare,Medicare,Self-Pay,,,false,63795.02,23583.09
New York City,Richmond,7004010,001738,Richmond University Medical Center,50 to 69,103,M,White,Not Span/Hispanic,4,Emergency,Home or Self Care,2018,CIR019,HEART FAILURE,MAM005,MEASUREMENT DURING CARDIAC CATHETERIZATION,192,CARDIAC CATHETERIZATION FOR OTHER NON-CORONARY CONDITIONS,05,DISEASES AND DISORDERS OF THE CIRCULATORY SYSTEM,3,Major,Minor,Medical,Blue Cross/Blue Shield,Self-Pay,Self-Pay,,,true,43507.04,7819.74
Long Island,Suffolk,5151001,000245,Stony Brook University Hospital,50 to 69,OOS,F,White,Not Span/Hispanic,3,Emergency,Home or Self Care,2018,CIR012,NONSPECIFIC CHEST PAIN,MAM005,MEASUREMENT DURING CARDIAC CATHETERIZATION,192,CARDIAC CATHETERIZATION FOR OTHER NON-CORONARY CONDITIONS,05,DISEASES AND DISORDERS OF THE CIRCULATORY SYSTEM,2,Moderate,Minor,Medical,Medicare,Self-Pay,,,,true,49147.84,11348.86
Capital/Adirond,Schenectady,4601001,000829,Ellis Hospital,70 or Older,123,F,White,Not Span/Hispanic,8,Emergency,Short-term Hospital,2018,CIR001,CHRONIC RHEUMATIC HEART DISEASE,MAM005,MEASUREMENT DURING CARDIAC CATHETERIZATION,192,CARDIAC CATHETERIZATION FOR OTHER NON-CORONARY CONDITIONS,05,DISEASES AND DISORDERS OF THE CIRCULATORY SYSTEM,3,Major,Major,Medical,Medicare,Medicare,Private Health Insurance,,,true,39893.7,10008.33
New York City,Bronx,7000006,003058,Montefiore Med Center - Jack D Weiler Hosp of A Einstein College Div,50 to 69,104,M,White,Not Span/Hispanic,6,Emergency,Home w/ Home Health Services,2018,CIR019,HEART FAILURE,MAM005,MEASUREMENT DURING CARDIAC CATHETERIZATION,192,CARDIAC CATHETERIZATION FOR OTHER NON-CORONARY CONDITIONS,05,DISEASES AND DISORDERS OF THE CIRCULATORY SYSTEM,2,Moderate,Moderate,Medical,Medicare,Private Health Insurance,,,,true,107205.95,20857.72
Long Island,Suffolk,5154001,000925,Good Samaritan Hospital Medical Center,70 or Older,117,F,White,Not Span/Hispanic,6,Emergency,Home or Self Care,2018,CIR019,HEART FAILURE,MAM005,MEASUREMENT DURING CARDIAC CATHETERIZATION,192,CARDIAC CATHETERIZATION FOR OTHER NON-CORONARY CONDITIONS,05,DISEASES AND DISORDERS OF THE CIRCULATORY SYSTEM,2,Moderate,Major,Medical,Medicare,Medicare,Medicaid,,,true,99965.06,16129.39
New York City,Queens,7003010,001637,New York - Presbyterian/Queens,70 or Older,113,M,Other Race,Spanish/Hispanic,1,Elective,Home or Self Care,2018,CIR017,CARDIAC DYSRHYTHMIAS,CAR009,LEFT ATRIAL APPENDAGE PROCEDURES,192,CARDIAC CATHETERIZATION FOR OTHER NON-CORONARY CONDITIONS,05,DISEASES AND DISORDERS OF THE CIRCULATORY SYSTEM,2,Moderate,Moderate,Medical,Medicare,Medicare,Self-Pay,,,false,54479.67,36397.4
Long Island,Suffolk,5155000,000938,Peconic Bay Medical Center,50 to 69,119,M,White,Spanish/Hispanic,2,Emergency,Home or Self Care,2018,CIR017,CARDIAC DYSRHYTHMIAS,ESA006,CARDIOVERSION,192,CARDIAC CATHETERIZATION FOR OTHER NON-CORONARY CONDITIONS,05,DISEASES AND DISORDERS OF THE CIRCULATORY SYSTEM,2,Moderate,Moderate,Medical,Blue Cross/Blue Shield,Private Health Insurance,,,,true,48627.01,10539.7
New York City,Kings,7001020,001305,Maimonides Medical Center,70 or Older,112,M,White,Not Span/Hispanic,3,Elective,Home or Self Care,2018,CIR019,HEART FAILURE,IMG001,CARDIAC AND CORONARY FLUOROSCOPY,192,CARDIAC CATHETERIZATION FOR OTHER NON-CORONARY CONDITIONS,05,DISEASES AND DISORDERS OF THE CIRCULATORY SYSTEM,2,Moderate,Moderate,Medical,Medicare,Private Health Insurance,Self-Pay,,,false,56639,13923.72
New York City,Manhattan,7002054,001464,New York-Presbyterian Hospital - Columbia Presbyterian Center,50 to 69,100,M,White,Not Span/Hispanic,16,Urgent,Inpatient Rehabilitation Facility,2018,CIR004,ENDOCARDITIS AND ENDOCARDIAL DISEASE,MAM005,MEASUREMENT DURING CARDIAC CATHETERIZATION,192,CARDIAC CATHETERIZATION FOR OTHER NON-CORONARY CONDITIONS,05,DISEASES AND DISORDERS OF THE CIRCULATORY SYSTEM,4,Extreme,Extreme,Medical,Blue Cross/Blue Shield,Self-Pay,,,,false,342159.68,107533.25
New York City,Manhattan,7002054,001464,New York-Presbyterian Hospital - Columbia Presbyterian Center,50 to 69,100,M,Multi-racial,Not Span/Hispanic,2,Emergency,Home or Self Care,2018,CIR012,NONSPECIFIC CHEST PAIN,MAM005,MEASUREMENT DURING CARDIAC CATHETERIZATION,192,CARDIAC CATHETERIZATION FOR OTHER NON-CORONARY CONDITIONS,05,DISEASES AND DISORDERS OF THE CIRCULATORY SYSTEM,1,Minor,Minor,Medical,Private Health Insurance,Self-Pay,,,,true,52583.83,21324.89
New York City,Kings,7001020,001305,Maimonides Medical Center,70 or Older,112,F,White,Not Span/Hispanic,18,Emergency,Skilled Nursing Home,2018,CIR019,HEART FAILURE,MAM005,MEASUREMENT DURING CARDIAC CATHETERIZATION,192,CARDIAC CATHETERIZATION FOR OTHER NON-CORONARY CONDITIONS,05,DISEASES AND DISORDERS OF THE CIRCULATORY SYSTEM,3,Major,Major,Medical,Medicare,Medicaid,Self-Pay,,,true,227060.15,61655.47
New York City,Manhattan,7002054,001464,New York-Presbyterian Hospital - Columbia Presbyterian Center,50 to 69,100,M,Other Race,Spanish/Hispanic,5,Emergency,Home or Self Care,2018,CIR019,HEART FAILURE,MAM005,MEASUREMENT DURING CARDIAC CATHETERIZATION,192,CARDIAC CATHETERIZATION FOR OTHER NON-CORONARY CONDITIONS,05,DISEASES AND DISORDERS OF THE CIRCULATORY SYSTEM,3,Major,Major,Medical,Medicare,Medicare,Medicaid,,,true,75413.29,18449.51
New York City,Manhattan,7002054,001464,New York-Presbyterian Hospital - Columbia Presbyterian Center,70 or Older,124,M,White,Not Span/Hispanic,5,Emergency,Home or Self Care,2018,CIR019,HEART FAILURE,MAM005,MEASUREMENT DURING CARDIAC CATHETERIZATION,192,CARDIAC CATHETERIZATION FOR OTHER NON-CORONARY CONDITIONS,05,DISEASES AND DISORDERS OF THE CIRCULATORY SYSTEM,3,Major,Major,Medical,Medicare,Federal/State/Local/VA,Self-Pay,,,true,80505.82,19248.66
New York City,Manhattan,7002054,001464,New York-Presbyterian Hospital - Columbia Presbyterian Center,70 or Older,100,M,Black/African American,Spanish/Hispanic,16,Urgent,Home w/ Home Health Services,2018,END003,DIABETES MELLITUS WITH COMPLICATION,MAM005,MEASUREMENT DURING CARDIAC CATHETERIZATION,192,CARDIAC CATHETERIZATION FOR OTHER NON-CORONARY CONDITIONS,05,DISEASES AND DISORDERS OF THE CIRCULATORY SYSTEM,3,Major,Major,Medical,Medicare,Medicare,Medicaid,,,false,277858.07,70541.82
New York City,Bronx,7000014,001176,SBH Health System,50 to 69,104,F,Other Race,Not Span/Hispanic,3,Emergency,Home or Self Care,2018,CIR017,CARDIAC DYSRHYTHMIAS,MAM005,MEASUREMENT DURING CARDIAC CATHETERIZATION,192,CARDIAC CATHETERIZATION FOR OTHER NON-CORONARY CONDITIONS,05,DISEASES AND DISORDERS OF THE CIRCULATORY SYSTEM,2,Moderate,Major,Medical,Medicaid,Medicare,,,,true,27199.61,7858.47
New York City,Kings,7001021,001306,New York - Presbyterian Brooklyn Methodist Hospital,70 or Older,112,F,Other Race,Not Span/Hispanic,2,Emergency,Home w/ Home Health Services,2018,CIR017,CARDIAC DYSRHYTHMIAS,MAM005,MEASUREMENT DURING CARDIAC CATHETERIZATION,192,CARDIAC CATHETERIZATION FOR OTHER NON-CORONARY CONDITIONS,05,DISEASES AND DISORDERS OF THE CIRCULATORY SYSTEM,2,Moderate,Major,Medical,Medicare,Medicaid,Self-Pay,,,true,31162.95,6056.2
New York City,Kings,7001021,001306,New York - Presbyterian Brooklyn Methodist Hospital,30 to 49,112,F,Black/African American,Not Span/Hispanic,6,Emergency,Home or Self Care,2018,CIR008,HYPERTENSION WITH COMPLICATIONS AND SECONDARY HYPERTENSION,MAM005,MEASUREMENT DURING CARDIAC CATHETERIZATION,192,CARDIAC CATHETERIZATION FOR OTHER NON-CORONARY CONDITIONS,05,DISEASES AND DISORDERS OF THE CIRCULATORY SYSTEM,2,Moderate,Minor,Medical,"Managed Care, Unspecified",Medicaid,Self-Pay,,,true,64232.76,13438.14
Finger Lakes,Monroe,2701005,000413,Strong Memorial Hospital,30 to 49,138,F,White,Not Span/Hispanic,10,Elective,Home or Self Care,2018,CIR019,HEART FAILURE,MAM005,MEASUREMENT DURING CARDIAC CATHETERIZATION,192,CARDIAC CATHETERIZATION FOR OTHER NON-CORONARY CONDITIONS,05,DISEASES AND DISORDERS OF THE CIRCULATORY SYSTEM,2,Moderate,Moderate,Medical,Medicaid,Self-Pay,,,,false,44430.46,19164.52
Capital/Adirond,Albany,0101004,000005,St. Peter's Hospital,70 or Older,120,F,White,Not Span/Hispanic,14,Emergency,Hospice - Medical Facility,2018,CIR019,HEART FAILURE,MAM005,MEASUREMENT DURING CARDIAC CATHETERIZATION,192,CARDIAC CATHETERIZATION FOR OTHER NON-CORONARY CONDITIONS,05,DISEASES AND DISORDERS OF THE CIRCULATORY SYSTEM,4,Extreme,Extreme,Medical,Medicare,Medicare,,,,true,119131.65,39239.99
Long Island,Suffolk,5154001,000925,Good Samaritan Hospital Medical Center,30 to 49,117,F,White,Spanish/Hispanic,2,Emergency,Home or Self Care,2018,CIR019,HEART FAILURE,MAM005,MEASUREMENT DURING CARDIAC CATHETERIZATION,192,CARDIAC CATHETERIZATION FOR OTHER NON-CORONARY CONDITIONS,05,DISEASES AND DISORDERS OF THE CIRCULATORY SYSTEM,2,Moderate,Minor,Medical,Blue Cross/Blue Shield,,,,,true,53153,6271.11
Long Island,Suffolk,5153000,000913,Huntington Hospital,70 or Older,117,F,White,Not Span/Hispanic,5,Emergency,Home w/ Home Health Services,2018,CIR019,HEART FAILURE,MAM005,MEASUREMENT DURING CARDIAC CATHETERIZATION,192,CARDIAC CATHETERIZATION FOR OTHER NON-CORONARY CONDITIONS,05,DISEASES AND DISORDERS OF THE CIRCULATORY SYSTEM,3,Major,Major,Medical,Medicare,Medicaid,,,,true,62588.63,14415.23
Long Island,Suffolk,5153000,000913,Huntington Hospital,70 or Older,117,M,White,Not Span/Hispanic,6,Emergency,Skilled Nursing Home,2018,CIR019,HEART FAILURE,MAM005,MEASUREMENT DURING CARDIAC CATHETERIZATION,192,CARDIAC CATHETERIZATION FOR OTHER NON-CORONARY CONDITIONS,05,DISEASES AND DISORDERS OF THE CIRCULATORY SYSTEM,2,Moderate,Major,Medical,Medicare,Blue Cross/Blue Shield,Private Health Insurance,,,true,53098.81,16595.39
Long Island,Suffolk,5153000,000913,Huntington Hospital,70 or Older,117,F,White,Not Span/Hispanic,2,Emergency,Home w/ Home Health Services,2018,CIR017,CARDIAC DYSRHYTHMIAS,MAM005,MEASUREMENT DURING CARDIAC CATHETERIZATION,192,CARDIAC CATHETERIZATION FOR OTHER NON-CORONARY CONDITIONS,05,DISEASES AND DISORDERS OF THE CIRCULATORY SYSTEM,2,Moderate,Minor,Medical,Medicare,Blue Cross/Blue Shield,,,,true,27741.06,7672.59
Long Island,Nassau,2951001,000541,North Shore University Hospital,70 or Older,112,F,Other Race,Not Span/Hispanic,6,Emergency,Home w/ Home Health Services,2018,CIR017,CARDIAC DYSRHYTHMIAS,MAM005,MEASUREMENT DURING CARDIAC CATHETERIZATION,192,CARDIAC CATHETERIZATION FOR OTHER NON-CORONARY CONDITIONS,05,DISEASES AND DISORDERS OF THE CIRCULATORY SYSTEM,2,Moderate,Major,Medical,Medicare,Medicare,Medicaid,,,true,92706.62,14651.51
Finger Lakes,Monroe,2701003,000411,Rochester General Hospital,50 to 69,145,M,White,Not Span/Hispanic,5,Urgent,Home or Self Care,2018,CIR019,HEART FAILURE,MAM005,MEASUREMENT DURING CARDIAC CATHETERIZATION,192,CARDIAC CATHETERIZATION FOR OTHER NON-CORONARY CONDITIONS,05,DISEASES AND DISORDERS OF THE CIRCULATORY SYSTEM,2,Moderate,Moderate,Medical,Blue Cross/Blue Shield,,,,,false,18115.91,8399.19
Long Island,Nassau,2951001,000541,North Shore University Hospital,50 to 69,113,M,Other Race,Unknown,2,Emergency,Home or Self Care,2018,CIR005,MYOCARDITIS AND CARDIOMYOPATHY,MAM005,MEASUREMENT DURING CARDIAC CATHETERIZATION,192,CARDIAC CATHETERIZATION FOR OTHER NON-CORONARY CONDITIONS,05,DISEASES AND DISORDERS OF THE CIRCULATORY SYSTEM,1,Minor,Minor,Medical,Private Health Insurance,,,,,true,50563.49,7755.29
Finger Lakes,Monroe,2701003,000411,Rochester General Hospital,30 to 49,146,M,Other Race,Spanish/Hispanic,3,Emergency,Home or Self Care,2018,CIR012,NONSPECIFIC CHEST PAIN,MAM005,MEASUREMENT DURING CARDIAC CATHETERIZATION,192,CARDIAC CATHETERIZATION FOR OTHER NON-CORONARY CONDITIONS,05,DISEASES AND DISORDERS OF THE CIRCULATORY SYSTEM,3,Major,Minor,Medical,Medicaid,,,,,true,21056.6,7621.52
Capital/Adirond,Albany,0101004,000005,St. Peter's Hospital,70 or Older,122,F,Other Race,Not Span/Hispanic,12,Elective,Home or Self Care,2018,CIR019,HEART FAILURE,MAM005,MEASUREMENT DURING CARDIAC CATHETERIZATION,192,CARDIAC CATHETERIZATION FOR OTHER NON-CORONARY CONDITIONS,05,DISEASES AND DISORDERS OF THE CIRCULATORY SYSTEM,3,Major,Moderate,Medical,Medicare,,,,,false,68445.45,27755.27
Long Island,Nassau,2951001,000541,North Shore University Hospital,50 to 69,117,M,Black/African American,Not Span/Hispanic,1,Urgent,Home or Self Care,2018,CIR005,MYOCARDITIS AND CARDIOMYOPATHY,MAM005,MEASUREMENT DURING CARDIAC CATHETERIZATION,192,CARDIAC CATHETERIZATION FOR OTHER NON-CORONARY CONDITIONS,05,DISEASES AND DISORDERS OF THE CIRCULATORY SYSTEM,2,Moderate,Moderate,Medical,Private Health Insurance,Medicare,Medicare,,,false,23824,4190.25
Long Island,Suffolk,5154001,000925,Good Samaritan Hospital Medical Center,70 or Older,117,M,White,Not Span/Hispanic,6,Emergency,Home or Self Care,2018,CIR019,HEART FAILURE,MAM005,MEASUREMENT DURING CARDIAC CATHETERIZATION,192,CARDIAC CATHETERIZATION FOR OTHER NON-CORONARY CONDITIONS,05,DISEASES AND DISORDERS OF THE CIRCULATORY SYSTEM,2,Moderate,Moderate,Medical,Medicare,Medicare,,,,true,88933,12975.85
Western NY,Erie,1401014,000207,Buffalo General Medical Center,50 to 69,142,M,Black/African American,Not Span/Hispanic,15,Emergency,Home w/ Home Health Services,2018,CIR019,HEART FAILURE,MAM005,MEASUREMENT DURING CARDIAC CATHETERIZATION,192,CARDIAC CATHETERIZATION FOR OTHER NON-CORONARY CONDITIONS,05,DISEASES AND DISORDERS OF THE CIRCULATORY SYSTEM,4,Extreme,Extreme,Medical,Medicare,Self-Pay,,,,true,114655.37,39006.95
Capital/Adirond,Albany,0101004,000005,St. Peter's Hospital,70 or Older,122,M,Other Race,Not Span/Hispanic,3,Elective,Home or Self Care,2018,CIR019,HEART FAILURE,MAM005,MEASUREMENT DURING CARDIAC CATHETERIZATION,192,CARDIAC CATHETERIZATION FOR OTHER NON-CORONARY CONDITIONS,05,DISEASES AND DISORDERS OF THE CIRCULATORY SYSTEM,3,Major,Major,Medical,Medicare,Medicare,Medicaid,,,false,26388.9,7924.68
Capital/Adirond,Schenectady,4601001,000829,Ellis Hospital,50 to 69,123,F,White,Not Span/Hispanic,1,Emergency,Home or Self Care,2018,CIR012,NONSPECIFIC CHEST PAIN,IMG001,CARDIAC AND CORONARY FLUOROSCOPY,192,CARDIAC CATHETERIZATION FOR OTHER NON-CORONARY CONDITIONS,05,DISEASES AND DISORDERS OF THE CIRCULATORY SYSTEM,1,Minor,Minor,Medical,Medicare,Medicare,Private Health Insurance,,,true,21338.95,3236.52
New York City,Queens,7003004,001630,Long Island Jewish Medical Center,50 to 69,116,F,Other Race,Not Span/Hispanic,7,Emergency,Home w/ Home Health Services,2018,CIR019,HEART FAILURE,MAM005,MEASUREMENT DURING CARDIAC CATHETERIZATION,192,CARDIAC CATHETERIZATION FOR OTHER NON-CORONARY CONDITIONS,05,DISEASES AND DISORDERS OF THE CIRCULATORY SYSTEM,3,Major,Moderate,Medical,Medicare,Medicare,Medicaid,,,false,99480.3,18781.4
Long Island,Suffolk,5151001,000245,Stony Brook University Hospital,30 to 49,117,M,White,Not Span/Hispanic,3,Urgent,Home or Self Care,2018,CIR017,CARDIAC DYSRHYTHMIAS,ESA006,CARDIOVERSION,192,CARDIAC CATHETERIZATION FOR OTHER NON-CORONARY CONDITIONS,05,DISEASES AND DISORDERS OF THE CIRCULATORY SYSTEM,2,Moderate,Moderate,Medical,Private Health Insurance,,,,,false,44416.3,11970.11
New York City,Kings,7001037,001320,University Hospital of Brooklyn,30 to 49,112,M,Black/African American,Not Span/Hispanic,2,Emergency,Home or Self Care,2018,CIR012,NONSPECIFIC CHEST PAIN,MAM005,MEASUREMENT DURING CARDIAC CATHETERIZATION,192,CARDIAC CATHETERIZATION FOR OTHER NON-CORONARY CONDITIONS,05,DISEASES AND DISORDERS OF THE CIRCULATORY SYSTEM,3,Major,Minor,Medical,Medicaid,Medicaid,Self-Pay,,,true,22718,11797.97
Long Island,Nassau,2951001,000541,North Shore University Hospital,70 or Older,113,M,White,Not Span/Hispanic,9,Emergency,Home or Self Care,2018,CIR019,HEART FAILURE,MAM005,MEASUREMENT DURING CARDIAC CATHETERIZATION,192,CARDIAC CATHETERIZATION FOR OTHER NON-CORONARY CONDITIONS,05,DISEASES AND DISORDERS OF THE CIRCULATORY SYSTEM,2,Moderate,Moderate,Medical,Medicare,Private Health Insurance,,,,true,120976.23,20032.47
Central NY,Onondaga,3301003,000630,St. Joseph's Hospital Health Center,50 to 69,130,M,White,Not Span/Hispanic,4,Emergency,Home or Self Care,2018,CIR019,HEART FAILURE,MAM005,MEASUREMENT DURING CARDIAC CATHETERIZATION,192,CARDIAC CATHETERIZATION FOR OTHER NON-CORONARY CONDITIONS,05,DISEASES AND DISORDERS OF THE CIRCULATORY SYSTEM,2,Moderate,Moderate,Medical,Medicaid,,,,,true,29202.94,7309.92
Long Island,Nassau,2950001,000527,Mount Sinai South Nassau,50 to 69,115,F,White,Not Span/Hispanic,3,Emergency,Home or Self Care,2018,CIR012,NONSPECIFIC CHEST PAIN,MAM005,MEASUREMENT DURING CARDIAC CATHETERIZATION,192,CARDIAC CATHETERIZATION FOR OTHER NON-CORONARY CONDITIONS,05,DISEASES AND DISORDERS OF THE CIRCULATORY SYSTEM,1,Minor,Minor,Medical,Medicaid,Medicaid,,,,true,64372,10792.93
Long Island,Nassau,2951001,000541,North Shore University Hospital,50 to 69,114,F,Other Race,Not Span/Hispanic,1,Emergency,Home or Self Care,2018,CIR012,NONSPECIFIC CHEST PAIN,MAM005,MEASUREMENT DURING CARDIAC CATHETERIZATION,192,CARDIAC CATHETERIZATION FOR OTHER NON-CORONARY CONDITIONS,05,DISEASES AND DISORDERS OF THE CIRCULATORY SYSTEM,1,Minor,Minor,Medical,Blue Cross/Blue Shield,,,,,true,24550,4606.23
New York City,Kings,7001003,001288,Brooklyn Hospital Center - Downtown Campus,50 to 69,112,F,Other Race,Spanish/Hispanic,6,Emergency,Short-term Hospital,2018,CIR019,HEART FAILURE,MAM005,MEASUREMENT DURING CARDIAC CATHETERIZATION,192,CARDIAC CATHETERIZATION FOR OTHER NON-CORONARY CONDITIONS,05,DISEASES AND DISORDERS OF THE CIRCULATORY SYSTEM,2,Moderate,Moderate,Medical,Medicaid,Medicaid,Self-Pay,,,true,91258.11,15995.01
New York City,Bronx,7000006,003058,Montefiore Med Center - Jack D Weiler Hosp of A Einstein College Div,50 to 69,104,F,Black/African American,Not Span/Hispanic,7,Emergency,Home or Self Care,2018,CIR019,HEART FAILURE,MAM005,MEASUREMENT DURING CARDIAC CATHETERIZATION,192,CARDIAC CATHETERIZATION FOR OTHER NON-CORONARY CONDITIONS,05,DISEASES AND DISORDERS OF THE CIRCULATORY SYSTEM,2,Moderate,Moderate,Medical,Medicare,,,,,true,112987.64,21683.34
Western NY,Erie,1401014,000207,Buffalo General Medical Center,50 to 69,140,M,White,Not Span/Hispanic,9,Urgent,Skilled Nursing Home,2018,CIR019,HEART FAILURE,MAM005,MEASUREMENT DURING CARDIAC CATHETERIZATION,192,CARDIAC CATHETERIZATION FOR OTHER NON-CORONARY CONDITIONS,05,DISEASES AND DISORDERS OF THE CIRCULATORY SYSTEM,3,Major,Moderate,Medical,Medicare,Self-Pay,,,,false,30527.49,14318.91
New York City,Queens,7003004,001638,Long Island Jewish Forest Hills,70 or Older,113,F,Other Race,Spanish/Hispanic,2,Emergency,Short-term Hospital,2018,CIR017,CARDIAC DYSRHYTHMIAS,MAM005,MEASUREMENT DURING CARDIAC CATHETERIZATION,192,CARDIAC CATHETERIZATION FOR OTHER NON-CORONARY CONDITIONS,05,DISEASES AND DISORDERS OF THE CIRCULATORY SYSTEM,1,Minor,Minor,Medical,Medicare,Medicaid,,,,true,22588,4081.51
Capital/Adirond,Albany,0101004,000005,St. Peter's Hospital,50 to 69,121,M,White,Not Span/Hispanic,2,Emergency,Home or Self Care,2018,CIR012,NONSPECIFIC CHEST PAIN,MAM005,MEASUREMENT DURING CARDIAC CATHETERIZATION,192,CARDIAC CATHETERIZATION FOR OTHER NON-CORONARY CONDITIONS,05,DISEASES AND DISORDERS OF THE CIRCULATORY SYSTEM,2,Moderate,Minor,Medical,Private Health Insurance,Medicare,,,,true,27100.65,6577.8
Capital/Adirond,Otsego,3824000,000746,Mary Imogene Bassett Hospital,30 to 49,137,M,White,Not Span/Hispanic,13,Urgent,Home w/ Home Health Services,2018,CIR019,HEART FAILURE,IMG001,CARDIAC AND CORONARY FLUOROSCOPY,192,CARDIAC CATHETERIZATION FOR OTHER NON-CORONARY CONDITIONS,05,DISEASES AND DISORDERS OF THE CIRCULATORY SYSTEM,4,Extreme,Extreme,Medical,Medicaid,,,,,false,84466.98,56345.75
Long Island,Nassau,2908000,000511,NYU Langone Hospital-Long Island,70 or Older,115,F,Black/African American,Not Span/Hispanic,4,Emergency,Home w/ Home Health Services,2018,CIR012,NONSPECIFIC CHEST PAIN,MAM005,MEASUREMENT DURING CARDIAC CATHETERIZATION,192,CARDIAC CATHETERIZATION FOR OTHER NON-CORONARY CONDITIONS,05,DISEASES AND DISORDERS OF THE CIRCULATORY SYSTEM,3,Major,Major,Medical,Medicare,Medicare,Medicaid,,,true,83869.49,14300.46
Long Island,Nassau,2953000,000563,St. Francis Hospital & Heart Center,70 or Older,113,F,White,Not Span/Hispanic,1,Emergency,Home or Self Care,2018,CIR019,HEART FAILURE,MAM005,MEASUREMENT DURING CARDIAC CATHETERIZATION,192,CARDIAC CATHETERIZATION FOR OTHER NON-CORONARY CONDITIONS,05,DISEASES AND DISORDERS OF THE CIRCULATORY SYSTEM,2,Moderate,Minor,Medical,Medicare,Blue Cross/Blue Shield,,,,true,35326,4117.12
Hudson Valley,Dutchess,1302001,000181,Vassar Brothers Medical Center,70 or Older,125,M,White,Not Span/Hispanic,6,Emergency,Home or Self Care,2018,CIR019,HEART FAILURE,MAM005,MEASUREMENT DURING CARDIAC CATHETERIZATION,192,CARDIAC CATHETERIZATION FOR OTHER NON-CORONARY CONDITIONS,05,DISEASES AND DISORDERS OF THE CIRCULATORY SYSTEM,3,Major,Extreme,Medical,Medicare,Blue Cross/Blue Shield,,,,true,39474.21,10839.86
Capital/Adirond,Albany,0101004,000005,St. Peter's Hospital,30 to 49,121,F,White,Not Span/Hispanic,3,Emergency,Home or Self Care,2018,CIR012,NONSPECIFIC CHEST PAIN,MAM005,MEASUREMENT DURING CARDIAC CATHETERIZATION,192,CARDIAC CATHETERIZATION FOR OTHER NON-CORONARY CONDITIONS,05,DISEASES AND DISORDERS OF THE CIRCULATORY SYSTEM,1,Minor,Minor,Medical,Medicaid,Medicaid,,,,true,37189.95,9869.01
New York City,Bronx,7000006,001169,Montefiore Medical Center - Henry & Lucy Moses Div,70 or Older,104,M,Black/African American,Not Span/Hispanic,8,Emergency,Home w/ Home Health Services,2018,CIR019,HEART FAILURE,IMG008,ULTRASONOGRAPHY,192,CARDIAC CATHETERIZATION FOR OTHER NON-CORONARY CONDITIONS,05,DISEASES AND DISORDERS OF THE CIRCULATORY SYSTEM,2,Moderate,Moderate,Medical,Medicare,Medicaid,,,,true,117032.81,23963.31
New York City,Bronx,7000006,001169,Montefiore Medical Center - Henry & Lucy Moses Div,50 to 69,117,M,White,Unknown,5,Emergency,Home or Self Care,2018,CIR019,HEART FAILURE,MAM005,MEASUREMENT DURING CARDIAC CATHETERIZATION,192,CARDIAC CATHETERIZATION FOR OTHER NON-CORONARY CONDITIONS,05,DISEASES AND DISORDERS OF THE CIRCULATORY SYSTEM,3,Major,Major,Medical,Medicare,,,,,false,104473.29,20984.51