Hospital Service Area,Hospital County,Operating Certificate Number,Permanent Facility Id,Facility Name,Age Group,Zip Code - 3 digits,Gender,Race,Ethnicity,Length of Stay,Type of Admission,Patient Disposition,Discharge Year,CCS Diagnosis Code,CCS Diagnosis Description,CCS Procedure Code,CCS Procedure Description,APR DRG Code,APR DRG Description,APR MDC Code,APR MDC Description,APR Severity of Illness Code,APR Severity of Illness Description,APR Risk of Mortality,APR Medical Surgical Description,Payment Typology 1,Payment Typology 2,Payment Typology 3,Birth Weight,Abortion Edit Indicator,Emergency Department Indicator,Total Charges,Total Costs
Long Island,Suffolk,5123000,000885,Long Island Community Hospital,50 to 69,117,M,White,Not Span/Hispanic,14,Emergency,Expired,2019,CIR018,CARDIAC ARREST AND VENTRICULAR FIBRILLATION,ADM006,INFUSION OF VASOPRESSOR,196,CARDIAC ARREST & SHOCK,05,DISEASES AND DISORDERS OF THE CIRCULATORY SYSTEM,4,Extreme,Extreme,Medical,Private Health Insurance,Medicare,Medicare,,,true,185424.39,31417.74
Long Island,Suffolk,5123000,000885,Long Island Community Hospital,70 or Older,117,M,White,Not Span/Hispanic,1,Emergency,Expired,2019,CIR018,CARDIAC ARREST AND VENTRICULAR FIBRILLATION,RES007,AIRWAY INTUBATION,196,CARDIAC ARREST & SHOCK,05,DISEASES AND DISORDERS OF THE CIRCULATORY SYSTEM,4,Extreme,Extreme,Medical,Medicare,Medicare,Blue Cross/Blue Shield,,,true,15138.8,3161.53
Long Island,Suffolk,5123000,000885,Long Island Community Hospital,70 or Older,117,F,White,Not Span/Hispanic,29,Emergency,Skilled Nursing Home,2019,SYM003,SHOCK,ESA001,HEMODIALYSIS,196,CARDIAC ARREST & SHOCK,05,DISEASES AND DISORDERS OF THE CIRCULATORY SYSTEM,3,Major,Extreme,Medical,Medicare,Medicare,,,,true,199504.6,45062.7
Long Island,Suffolk,5123000,000885,Long Island Community Hospital,50 to 69,119,M,White,Not Span/Hispanic,8,Emergency,Expired,2019,CIR018,CARDIAC ARREST AND VENTRICULAR FIBRILLATION,RES007,AIRWAY INTUBATION,196,CARDIAC ARREST & SHOCK,05,DISEASES AND DISORDERS OF THE CIRCULATORY SYSTEM,4,Extreme,Extreme,Medical,Medicare,Medicare,Medicaid,,,true,128081.7,20361.75
Long Island,Suffolk,5123000,000885,Long Island Community Hospital,30 to 49,117,F,White,Not Span/Hispanic,5,Emergency,Expired,2019,CIR018,CARDIAC ARREST AND VENTRICULAR FIBRILLATION,ESA003,MECHANICAL VENTILATION,196,CARDIAC ARREST & SHOCK,05,DISEASES AND DISORDERS OF THE CIRCULATORY SYSTEM,4,Extreme,Extreme,Medical,Self-Pay,,,,,true,132430.45,20961.6
Long Island,Suffolk,5123000,000885,Long Island Community Hospital,70 or Older,117,M,White,Not Span/Hispanic,2,Emergency,Expired,2019,CIR018,CARDIAC ARREST AND VENTRICULAR FIBRILLATION,ESA003,MECHANICAL VENTILATION,196,CARDIAC ARREST & SHOCK,05,DISEASES AND DISORDERS OF THE CIRCULATORY SYSTEM,4,Extreme,Extreme,Medical,Medicare,Medicare,Blue Cross/Blue Shield,,,true,42769.65,5696.87
Long Island,Suffolk,5123000,000885,Long Island Community Hospital,18 to 29,119,M,Black/African American,Not Span/Hispanic,1,Emergency,Short-term Hospital,2019,SYM003,SHOCK,,,196,CARDIAC ARREST & SHOCK,05,DISEASES AND DISORDERS OF THE CIRCULATORY SYSTEM,3,Major,Major,Medical,Private Health Insurance,,,,,true,28874.32,3211.07
Long Island,Suffolk,5123000,000885,Long Island Community Hospital,50 to 69,117,M,White,Not Span/Hispanic,1,Emergency,Expired,2019,CIR018,CARDIAC ARREST AND VENTRICULAR FIBRILLATION,ESA003,MECHANICAL VENTILATION,196,CARDIAC ARREST & SHOCK,05,DISEASES AND DISORDERS OF THE CIRCULATORY SYSTEM,4,Extreme,Extreme,Medical,Medicare,Medicare,Private Health Insurance,,,true,39242.23,2870.79
Long Island,Suffolk,5123000,000885,Long Island Community Hospital,70 or Older,117,M,White,Not Span/Hispanic,2,Emergency,Home or Self Care,2019,CIR018,CARDIAC ARREST AND VENTRICULAR FIBRILLATION,MAM006,PACEMAKER AND DEFIBRILLATOR INTERROGATION,196,CARDIAC ARREST & SHOCK,05,DISEASES AND DISORDERS OF THE CIRCULATORY SYSTEM,1,Minor,Minor,Medical,Medicare,Medicare,Blue Cross/Blue Shield,,,true,17485.17,3467.04
Long Island,Suffolk,5123000,000885,Long Island Community Hospital,70 or Older,119,F,White,Not Span/Hispanic,2,Emergency,Expired,2019,SYM003,SHOCK,ESA004,NON-INVASIVE VENTILATION,196,CARDIAC ARREST & SHOCK,05,DISEASES AND DISORDERS OF THE CIRCULATORY SYSTEM,4,Extreme,Extreme,Medical,Medicare,Medicare,Blue Cross/Blue Shield,,,true,43967.07,6175.56
Long Island,Suffolk,5123000,000885,Long Island Community Hospital,70 or Older,117,F,White,Not Span/Hispanic,7,Emergency,Home w/ Home Health Services,2019,SYM003,SHOCK,ADM006,INFUSION OF VASOPRESSOR,196,CARDIAC ARREST & SHOCK,05,DISEASES AND DISORDERS OF THE CIRCULATORY SYSTEM,3,Major,Major,Medical,Medicare,Medicare,Medicaid,,,true,58450.96,10477.16
Long Island,Suffolk,5123000,000885,Long Island Community Hospital,70 or Older,117,F,White,Not Span/Hispanic,1,Emergency,Expired,2019,CIR018,CARDIAC ARREST AND VENTRICULAR FIBRILLATION,ESA003,MECHANICAL VENTILATION,196,CARDIAC ARREST & SHOCK,05,DISEASES AND DISORDERS OF THE CIRCULATORY SYSTEM,4,Extreme,Extreme,Medical,Medicare,,,,,true,20999.82,3406.19
Long Island,Suffolk,5123000,000885,Long Island Community Hospital,30 to 49,117,F,Other Race,Not Span/Hispanic,1,Emergency,Short-term Hospital,2019,CIR018,CARDIAC ARREST AND VENTRICULAR FIBRILLATION,ESA003,MECHANICAL VENTILATION,196,CARDIAC ARREST & SHOCK,05,DISEASES AND DISORDERS OF THE CIRCULATORY SYSTEM,4,Extreme,Extreme,Medical,Private Health Insurance,,,,,true,41492.64,3945.68
Long Island,Suffolk,5123000,000885,Long Island Community Hospital,50 to 69,117,M,White,Not Span/Hispanic,2,Emergency,Short-term Hospital,2019,CIR018,CARDIAC ARREST AND VENTRICULAR FIBRILLATION,ESA003,MECHANICAL VENTILATION,196,CARDIAC ARREST & SHOCK,05,DISEASES AND DISORDERS OF THE CIRCULATORY SYSTEM,4,Extreme,Extreme,Medical,Private Health Insurance,,,,,true,28875.45,5790.87
Long Island,Suffolk,5123000,000885,Long Island Community Hospital,50 to 69,117,F,White,Not Span/Hispanic,4,Emergency,Expired,2019,SYM003,SHOCK,CAR024,VENOUS AND ARTERIAL CATHETER PLACEMENT,196,CARDIAC ARREST & SHOCK,05,DISEASES AND DISORDERS OF THE CIRCULATORY SYSTEM,4,Extreme,Extreme,Medical,Private Health Insurance,Medicaid,,,,true,125738.86,20381.24
Long Island,Suffolk,5123000,000885,Long Island Community Hospital,30 to 49,119,M,Other Race,Not Span/Hispanic,4,Emergency,Expired,2019,CIR018,CARDIAC ARREST AND VENTRICULAR FIBRILLATION,RES007,AIRWAY INTUBATION,196,CARDIAC ARREST & SHOCK,05,DISEASES AND DISORDERS OF THE CIRCULATORY SYSTEM,4,Extreme,Extreme,Medical,Self-Pay,,,,,true,132047.37,19983.26
