Hospital Service Area,Hospital County,Operating Certificate Number,Permanent Facility Id,Facility Name,Age Group,Zip Code - 3 digits,Gender,Race,Ethnicity,Length of Stay,Type of Admission,Patient Disposition,Discharge Year,CCS Diagnosis Code,CCS Diagnosis Description,CCS Procedure Code,CCS Procedure Description,APR DRG Code,APR DRG Description,APR MDC Code,APR MDC Description,APR Severity of Illness Code,APR Severity of Illness Description,APR Risk of Mortality,APR Medical Surgical Description,Payment Typology 1,Payment Typology 2,Payment Typology 3,Birth Weight,Abortion Edit Indicator,Emergency Department Indicator,Total Charges,Total Costs
New York City,Manhattan,7002001,001438,Bellevue Hospital Center,70 or Older,112,F,Black/African American,Not Span/Hispanic,1,Urgent,Expired,2020,CIR018,CARDIAC ARREST AND VENTRICULAR FIBRILLATION,RES007,AIRWAY INTUBATION,196,CARDIAC ARREST & SHOCK,05,DISEASES AND DISORDERS OF THE CIRCULATORY SYSTEM,4,Extreme,Extreme,Medical,Private Health Insurance,,,,,N,7712.11,4435.11
New York City,Manhattan,7002001,001438,Bellevue Hospital Center,70 or Older,114,M,Other Race,Unknown,1,Urgent,Expired,2020,CIR018,CARDIAC ARREST AND VENTRICULAR FIBRILLATION,RES007,AIRWAY INTUBATION,196,CARDIAC ARREST & SHOCK,05,DISEASES AND DISORDERS OF THE CIRCULATORY SYSTEM,2,Moderate,Major,Medical,Medicare,Medicaid,,,,N,8594.96,4942.82
New York City,Manhattan,7002001,001438,Bellevue Hospital Center,50 to 69,114,F,Other Race,Not Span/Hispanic,1,Emergency,Expired,2020,CIR018,CARDIAC ARREST AND VENTRICULAR FIBRILLATION,CAR024,VENOUS AND ARTERIAL CATHETER PLACEMENT,196,CARDIAC ARREST & SHOCK,05,DISEASES AND DISORDERS OF THE CIRCULATORY SYSTEM,4,Extreme,Extreme,Medical,Self-Pay,,,,,Y,19176.1,11027.87
New York City,Manhattan,7002001,001438,Bellevue Hospital Center,50 to 69,112,M,Other Race,Spanish/Hispanic,1,Emergency,Expired,2020,CIR018,CARDIAC ARREST AND VENTRICULAR FIBRILLATION,,,196,CARDIAC ARREST & SHOCK,05,DISEASES AND DISORDERS OF THE CIRCULATORY SYSTEM,2,Moderate,Moderate,Medical,Medicaid,,,,,Y,9449.27,5434.12
New York City,Manhattan,7002001,001438,Bellevue Hospital Center,70 or Older,104,F,Other Race,Unknown,1,Elective,Expired,2020,SYM003,SHOCK,ADM001,TRANSFUSION OF BLOOD AND BLOOD PRODUCTS,196,CARDIAC ARREST & SHOCK,05,DISEASES AND DISORDERS OF THE CIRCULATORY SYSTEM,3,Major,Moderate,Medical,Medicare,Medicaid,,,,N,19066.33,10964.74
New York City,Manhattan,7002001,001438,Bellevue Hospital Center,0 to 17,104,F,Black/African American,Not Span/Hispanic,14,Emergency,Home or Self Care,2020,SYM003,SHOCK,ADM021,"ADMINISTRATION OF THERAPEUTIC SUBSTANCES, NEC",196,CARDIAC ARREST & SHOCK,05,DISEASES AND DISORDERS OF THE CIRCULATORY SYSTEM,2,Moderate,Minor,Medical,Medicaid,,,,,Y,93618.19,53838.32
New York City,Manhattan,7002001,001438,Bellevue Hospital Center,70 or Older,112,F,Black/African American,Not Span/Hispanic,1,Urgent,Expired,2020,CIR018,CARDIAC ARREST AND VENTRICULAR FIBRILLATION,ESA003,MECHANICAL VENTILATION,196,CARDIAC ARREST & SHOCK,05,DISEASES AND DISORDERS OF THE CIRCULATORY SYSTEM,3,Major,Major,Medical,Medicare,Medicaid,,,,N,15004.47,8628.83
New York City,Manhattan,7002001,001438,Bellevue Hospital Center,70 or Older,100,M,Other Race,Unknown,1,Emergency,Expired,2020,CIR018,CARDIAC ARREST AND VENTRICULAR FIBRILLATION,RES007,AIRWAY INTUBATION,196,CARDIAC ARREST & SHOCK,05,DISEASES AND DISORDERS OF THE CIRCULATORY SYSTEM,4,Extreme,Extreme,Medical,Medicare,,,,,Y,15634.44,8991.12
New York City,Manhattan,7002001,001438,Bellevue Hospital Center,70 or Older,112,M,White,Not Span/Hispanic,2,Urgent,Expired,2020,SYM003,SHOCK,MAM011,ELECTROENCEPHALOGRAM (EEG),196,CARDIAC ARREST & SHOCK,05,DISEASES AND DISORDERS OF THE CIRCULATORY SYSTEM,3,Major,Extreme,Medical,Medicare,Medicaid,,,,N,37950.4,21824.67
New York City,Manhattan,7002001,001438,Bellevue Hospital Center,50 to 69,100,M,Other Race,Not Span/Hispanic,1,Emergency,Expired,2020,CIR018,CARDIAC ARREST AND VENTRICULAR FIBRILLATION,ESA003,MECHANICAL VENTILATION,196,CARDIAC ARREST & SHOCK,05,DISEASES AND DISORDERS OF THE CIRCULATORY SYSTEM,4,Extreme,Extreme,Medical,Self-Pay,,,,,Y,39654.73,22804.8
New York City,Manhattan,7002001,001438,Bellevue Hospital Center,50 to 69,100,M,White,Not Span/Hispanic,11,Emergency,Left Against Medical Advice,2020,CIR018,CARDIAC ARREST AND VENTRICULAR FIBRILLATION,CAR024,VENOUS AND ARTERIAL CATHETER PLACEMENT,196,CARDIAC ARREST & SHOCK,05,DISEASES AND DISORDERS OF THE CIRCULATORY SYSTEM,4,Extreme,Extreme,Medical,Medicaid,,,,,Y,148784.09,85563.35
New York City,Manhattan,7002001,001438,Bellevue Hospital Center,70 or Older,112,F,Black/African American,Not Span/Hispanic,1,Urgent,Expired,2020,CIR018,CARDIAC ARREST AND VENTRICULAR FIBRILLATION,ESA003,MECHANICAL VENTILATION,196,CARDIAC ARREST & SHOCK,05,DISEASES AND DISORDERS OF THE CIRCULATORY SYSTEM,4,Extreme,Extreme,Medical,Medicare,Private Health Insurance,,,,N,7712.11,4435.11
