Hospital Service Area,Hospital County,Operating Certificate Number,Permanent Facility Id,Facility Name,Age Group,Zip Code - 3 digits,Gender,Race,Ethnicity,Length of Stay,Type of Admission,Patient Disposition,Discharge Year,CCS Diagnosis Code,CCS Diagnosis Description,CCS Procedure Code,CCS Procedure Description,APR DRG Code,APR DRG Description,APR MDC Code,APR MDC Description,APR Severity of Illness Code,APR Severity of Illness Description,APR Risk of Mortality,APR Medical Surgical Description,Payment Typology 1,Payment Typology 2,Payment Typology 3,Birth Weight,Abortion Edit Indicator,Emergency Department Indicator,Total Charges,Total Costs
New York City,Manhattan,7002001,001438,Bellevue Hospital Center,50 to 69,104,F,Black/African American,Not Span/Hispanic,29,Emergency,Hospice - Medical Facility,2017,115,Aortic; peripheral; and visceral artery aneurysms,193,DX ULTRASOUND HEART,197,Peripheral & other vascular disorders,05,Diseases and Disorders of the Circulatory System,4,Extreme,Major,Medical,Medicare,Medicare,Medicaid,,N,N,197519.93,127350.58
New York City,Manhattan,7002001,001438,Bellevue Hospital Center,50 to 69,112,M,White,Not Span/Hispanic,4,Emergency,Home or Self Care,2017,121,Other diseases of veins and lymphatics,000,NO PROC,197,Peripheral & other vascular disorders,05,Diseases and Disorders of the Circulatory System,3,Major,Major,Medical,Medicaid,,,,N,Y,24930.45,16073.86
New York City,Manhattan,7002001,001438,Bellevue Hospital Center,70 or Older,113,M,Other Race,Not Span/Hispanic,1,Emergency,Home or Self Care,2017,114,Peripheral and visceral atherosclerosis,193,DX ULTRASOUND HEART,197,Peripheral & other vascular disorders,05,Diseases and Disorders of the Circulatory System,2,Moderate,Moderate,Medical,Medicaid,,,,N,N,15227.97,9818.20
New York City,Manhattan,7002001,001438,Bellevue Hospital Center,50 to 69,100,M,White,Not Span/Hispanic,9,Emergency,Psychiatric Hospital or Unit of Hosp,2017,248,Gangrene,231,OTHER THERAPEUTIC PRCS,197,Peripheral & other vascular disorders,05,Diseases and Disorders of the Circulatory System,3,Major,Moderate,Medical,Medicare,Medicare,Medicaid,,N,Y,58356.23,37625.06
New York City,Manhattan,7002001,001438,Bellevue Hospital Center,50 to 69,113,M,Other Race,Not Span/Hispanic,2,Emergency,Home or Self Care,2017,115,Aortic; peripheral; and visceral artery aneurysms,000,NO PROC,197,Peripheral & other vascular disorders,05,Diseases and Disorders of the Circulatory System,3,Major,Major,Medical,Medicaid,,,,N,Y,24600.56,15861.16
New York City,Manhattan,7002001,001438,Bellevue Hospital Center,70 or Older,112,F,White,Not Span/Hispanic,2,Emergency,Home or Self Care,2017,115,Aortic; peripheral; and visceral artery aneurysms,000,NO PROC,197,Peripheral & other vascular disorders,05,Diseases and Disorders of the Circulatory System,2,Moderate,Moderate,Medical,Medicare,Medicaid,,,N,N,17628.66,11366.04
New York City,Manhattan,7002001,001438,Bellevue Hospital Center,30 to 49,111,F,White,Spanish/Hispanic,4,Emergency,Home or Self Care,2017,118,Phlebitis; thrombophlebitis and thromboembolism,000,NO PROC,197,Peripheral & other vascular disorders,05,Diseases and Disorders of the Circulatory System,3,Major,Minor,Medical,Medicaid,,,,N,N,27368.54,17645.81
New York City,Manhattan,7002001,001438,Bellevue Hospital Center,50 to 69,112,M,Black/African American,Not Span/Hispanic,5,Emergency,Home or Self Care,2017,115,Aortic; peripheral; and visceral artery aneurysms,198,MAG RESONANCE IMAGING,197,Peripheral & other vascular disorders,05,Diseases and Disorders of the Circulatory System,3,Major,Moderate,Medical,Medicaid,Medicaid,,,N,N,46308.39,29857.24
New York City,Manhattan,7002001,001438,Bellevue Hospital Center,30 to 49,104,M,Black/African American,Not Span/Hispanic,1,Emergency,Home or Self Care,2017,118,Phlebitis; thrombophlebitis and thromboembolism,000,NO PROC,197,Peripheral & other vascular disorders,05,Diseases and Disorders of the Circulatory System,2,Moderate,Minor,Medical,Medicaid,Medicaid,,,N,Y,9239.53,5957.17
New York City,Manhattan,7002001,001438,Bellevue Hospital Center,50 to 69,113,M,Black/African American,Not Span/Hispanic,1,Emergency,Home or Self Care,2017,115,Aortic; peripheral; and visceral artery aneurysms,000,NO PROC,197,Peripheral & other vascular disorders,05,Diseases and Disorders of the Circulatory System,2,Moderate,Moderate,Medical,Medicare,Medicare,,,N,Y,7004.91,4516.40
New York City,Manhattan,7002001,001438,Bellevue Hospital Center,30 to 49,113,M,Black/African American,Not Span/Hispanic,2,Emergency,Home or Self Care,2017,118,Phlebitis; thrombophlebitis and thromboembolism,000,NO PROC,197,Peripheral & other vascular disorders,05,Diseases and Disorders of the Circulatory System,2,Moderate,Minor,Medical,Department of Corrections,,,,N,Y,13805.56,8901.11
New York City,Manhattan,7002001,001438,Bellevue Hospital Center,50 to 69,113,M,Other Race,Spanish/Hispanic,2,Emergency,Home or Self Care,2017,121,Other diseases of veins and lymphatics,231,OTHER THERAPEUTIC PRCS,197,Peripheral & other vascular disorders,05,Diseases and Disorders of the Circulatory System,1,Minor,Minor,Medical,Self-Pay,,,,N,Y,17098.41,11024.17
New York City,Manhattan,7002001,001438,Bellevue Hospital Center,50 to 69,100,M,Black/African American,Not Span/Hispanic,1,Emergency,Left Against Medical Advice,2017,118,Phlebitis; thrombophlebitis and thromboembolism,063,OT NON-OR THER CARDIO,197,Peripheral & other vascular disorders,05,Diseases and Disorders of the Circulatory System,2,Moderate,Minor,Medical,Medicaid,Medicaid,,,N,Y,8801.48,5674.74
New York City,Manhattan,7002001,001438,Bellevue Hospital Center,70 or Older,100,M,Black/African American,Not Span/Hispanic,38,Emergency,Home or Self Care,2017,118,Phlebitis; thrombophlebitis and thromboembolism,004,DIAGNOSTIC SPINAL TAP,197,Peripheral & other vascular disorders,05,Diseases and Disorders of the Circulatory System,2,Moderate,Moderate,Medical,Self-Pay,,,,N,Y,189214.61,121995.74
New York City,Manhattan,7002001,001438,Bellevue Hospital Center,30 to 49,100,M,Other Race,Spanish/Hispanic,8,Emergency,Home or Self Care,2017,050,Diabetes mellitus with complications,190,ARTERIO FEMORAL/LOW ART,197,Peripheral & other vascular disorders,05,Diseases and Disorders of the Circulatory System,3,Major,Moderate,Medical,Medicaid,,,,N,Y,43448.48,28013.32
New York City,Manhattan,7002001,001438,Bellevue Hospital Center,30 to 49,100,M,White,Not Span/Hispanic,7,Emergency,Home or Self Care,2017,118,Phlebitis; thrombophlebitis and thromboembolism,197,OTHER DX ULTRASOUND,197,Peripheral & other vascular disorders,05,Diseases and Disorders of the Circulatory System,2,Moderate,Moderate,Medical,Medicaid,,,,N,Y,38246.21,24659.17
New York City,Manhattan,7002001,001438,Bellevue Hospital Center,50 to 69,112,M,White,Not Span/Hispanic,5,Emergency,Home or Self Care,2017,114,Peripheral and visceral atherosclerosis,070,UP GASTRO ENDOSC/BIOPSY,197,Peripheral & other vascular disorders,05,Diseases and Disorders of the Circulatory System,2,Moderate,Moderate,Medical,Medicaid,,,,N,Y,33728.81,21746.58
New York City,Manhattan,7002001,001438,Bellevue Hospital Center,50 to 69,112,F,Other Race,Spanish/Hispanic,2,Emergency,Expired,2017,050,Diabetes mellitus with complications,189,CONTRAST AORTOGRAM,197,Peripheral & other vascular disorders,05,Diseases and Disorders of the Circulatory System,3,Major,Major,Medical,Medicaid,,,,N,Y,18740.20,12082.71
New York City,Manhattan,7002001,001438,Bellevue Hospital Center,70 or Older,112,M,Other Race,Not Span/Hispanic,4,Emergency,Skilled Nursing Home,2017,115,Aortic; peripheral; and visceral artery aneurysms,000,NO PROC,197,Peripheral & other vascular disorders,05,Diseases and Disorders of the Circulatory System,2,Moderate,Moderate,Medical,Medicare,Medicaid,,,N,N,24503.55,15798.61
New York City,Manhattan,7002001,001438,Bellevue Hospital Center,30 to 49,100,M,Black/African American,Not Span/Hispanic,4,Emergency,Home or Self Care,2017,248,Gangrene,000,NO PROC,197,Peripheral & other vascular disorders,05,Diseases and Disorders of the Circulatory System,2,Moderate,Moderate,Medical,Medicaid,,,,N,Y,24006.11,15477.89
New York City,Manhattan,7002001,001438,Bellevue Hospital Center,30 to 49,104,F,Other Race,Not Span/Hispanic,2,Emergency,Home or Self Care,2017,118,Phlebitis; thrombophlebitis and thromboembolism,000,NO PROC,197,Peripheral & other vascular disorders,05,Diseases and Disorders of the Circulatory System,2,Moderate,Minor,Medical,Private Health Insurance,,,,N,Y,14628.93,9431.97
New York City,Manhattan,7002001,001438,Bellevue Hospital Center,50 to 69,113,M,Other Race,Spanish/Hispanic,2,Emergency,Home or Self Care,2017,050,Diabetes mellitus with complications,000,NO PROC,197,Peripheral & other vascular disorders,05,Diseases and Disorders of the Circulatory System,2,Moderate,Minor,Medical,Department of Corrections,,,,N,Y,14118.12,9102.63
New York City,Manhattan,7002001,001438,Bellevue Hospital Center,70 or Older,112,F,Other Race,Not Span/Hispanic,3,Emergency,Home or Self Care,2017,118,Phlebitis; thrombophlebitis and thromboembolism,177,COMP AXIAL TOMOGR (CT),197,Peripheral & other vascular disorders,05,Diseases and Disorders of the Circulatory System,1,Minor,Minor,Medical,Medicaid,,,,N,Y,28876.51,18618.07
New York City,Manhattan,7002001,001438,Bellevue Hospital Center,70 or Older,112,F,Other Race,Spanish/Hispanic,4,Emergency,Home or Self Care,2017,118,Phlebitis; thrombophlebitis and thromboembolism,180,OTHER CT SCAN,197,Peripheral & other vascular disorders,05,Diseases and Disorders of the Circulatory System,2,Moderate,Moderate,Medical,Medicare,Medicare,Medicaid,,N,Y,33726.18,21744.89
New York City,Manhattan,7002001,001438,Bellevue Hospital Center,50 to 69,113,M,Other Race,Not Span/Hispanic,2,Emergency,Home or Self Care,2017,115,Aortic; peripheral; and visceral artery aneurysms,178,CT SCAN CHEST,197,Peripheral & other vascular disorders,05,Diseases and Disorders of the Circulatory System,2,Moderate,Minor,Medical,Department of Corrections,,,,N,N,15409.25,9935.08
New York City,Manhattan,7002001,001438,Bellevue Hospital Center,50 to 69,100,M,White,Not Span/Hispanic,8,Emergency,Home or Self Care,2017,121,Other diseases of veins and lymphatics,000,NO PROC,197,Peripheral & other vascular disorders,05,Diseases and Disorders of the Circulatory System,1,Minor,Moderate,Medical,Medicare,Private Health Insurance,,,N,Y,54200.68,34945.78
New York City,Manhattan,7002001,001438,Bellevue Hospital Center,30 to 49,112,M,Other Race,Not Span/Hispanic,7,Emergency,Home or Self Care,2017,115,Aortic; peripheral; and visceral artery aneurysms,000,NO PROC,197,Peripheral & other vascular disorders,05,Diseases and Disorders of the Circulatory System,3,Major,Major,Medical,Blue Cross/Blue Shield,,,,N,N,43600.33,28111.23
New York City,Manhattan,7002001,001438,Bellevue Hospital Center,50 to 69,113,M,Other Race,Not Span/Hispanic,1,Emergency,Home or Self Care,2017,121,Other diseases of veins and lymphatics,197,OTHER DX ULTRASOUND,197,Peripheral & other vascular disorders,05,Diseases and Disorders of the Circulatory System,1,Minor,Minor,Medical,Self-Pay,,,,N,N,8282.13,5339.89
New York City,Manhattan,7002001,001438,Bellevue Hospital Center,30 to 49,113,M,Other Race,Not Span/Hispanic,6,Emergency,Home or Self Care,2017,115,Aortic; peripheral; and visceral artery aneurysms,180,OTHER CT SCAN,197,Peripheral & other vascular disorders,05,Diseases and Disorders of the Circulatory System,2,Moderate,Major,Medical,Private Health Insurance,Medicaid,,,N,N,50590.91,32618.39
New York City,Manhattan,7002001,001438,Bellevue Hospital Center,30 to 49,112,F,Other Race,Spanish/Hispanic,1,Emergency,Home or Self Care,2017,115,Aortic; peripheral; and visceral artery aneurysms,222,BLOOD TRANSFUSION,197,Peripheral & other vascular disorders,05,Diseases and Disorders of the Circulatory System,1,Minor,Moderate,Medical,Medicaid,Medicaid,,,N,Y,9737.27,6278.09
New York City,Manhattan,7002001,001438,Bellevue Hospital Center,50 to 69,104,M,Other Race,Spanish/Hispanic,1,Emergency,Home or Self Care,2017,118,Phlebitis; thrombophlebitis and thromboembolism,000,NO PROC,197,Peripheral & other vascular disorders,05,Diseases and Disorders of the Circulatory System,3,Major,Moderate,Medical,Medicare,Medicare,,,N,Y,10502.04,6771.17
New York City,Manhattan,7002001,001438,Bellevue Hospital Center,50 to 69,100,M,Black/African American,Not Span/Hispanic,4,Emergency,Home or Self Care,2017,118,Phlebitis; thrombophlebitis and thromboembolism,092,OTHER BOWEL DX PRCS,197,Peripheral & other vascular disorders,05,Diseases and Disorders of the Circulatory System,3,Major,Moderate,Medical,Medicaid,,,,N,Y,29150.71,18794.86
New York City,Manhattan,7002001,001438,Bellevue Hospital Center,50 to 69,112,F,Black/African American,Not Span/Hispanic,5,Emergency,Home or Self Care,2017,213,Cardiac and circulatory congenital anomalies,070,UP GASTRO ENDOSC/BIOPSY,197,Peripheral & other vascular disorders,05,Diseases and Disorders of the Circulatory System,3,Major,Minor,Medical,Medicaid,,,,N,Y,35647.25,22983.49
New York City,Manhattan,7002001,001438,Bellevue Hospital Center,70 or Older,104,M,Black/African American,Not Span/Hispanic,15,Emergency,Home or Self Care,2017,118,Phlebitis; thrombophlebitis and thromboembolism,222,BLOOD TRANSFUSION,197,Peripheral & other vascular disorders,05,Diseases and Disorders of the Circulatory System,3,Major,Moderate,Medical,Medicaid,,,,N,Y,80523.02,51917.06
New York City,Manhattan,7002001,001438,Bellevue Hospital Center,18 to 29,104,M,Black/African American,Not Span/Hispanic,9,Emergency,Home or Self Care,2017,118,Phlebitis; thrombophlebitis and thromboembolism,061,OT OR PRCS VES NOT HEAD,197,Peripheral & other vascular disorders,05,Diseases and Disorders of the Circulatory System,1,Minor,Minor,Medical,Self-Pay,,,,N,N,44230.19,28517.33
New York City,Manhattan,7002001,001438,Bellevue Hospital Center,50 to 69,OOS,M,White,Not Span/Hispanic,3,Emergency,Expired,2017,115,Aortic; peripheral; and visceral artery aneurysms,216,RESP INTUB/MECH VENTIL,197,Peripheral & other vascular disorders,05,Diseases and Disorders of the Circulatory System,4,Extreme,Extreme,Medical,Blue Cross/Blue Shield,,,,N,N,31393.69,20241.02
New York City,Manhattan,7002001,001438,Bellevue Hospital Center,70 or Older,100,M,White,Not Span/Hispanic,1,Emergency,Home w/ Home Health Services,2017,121,Other diseases of veins and lymphatics,231,OTHER THERAPEUTIC PRCS,197,Peripheral & other vascular disorders,05,Diseases and Disorders of the Circulatory System,3,Major,Moderate,Medical,Medicare,Medicare,Medicaid,,N,Y,7665.43,4942.27
New York City,Manhattan,7002001,001438,Bellevue Hospital Center,50 to 69,112,M,Black/African American,Not Span/Hispanic,2,Emergency,Short-term Hospital,2017,115,Aortic; peripheral; and visceral artery aneurysms,193,DX ULTRASOUND HEART,197,Peripheral & other vascular disorders,05,Diseases and Disorders of the Circulatory System,3,Major,Major,Medical,Medicare,Medicare,,,N,N,16375.29,10557.94
New York City,Manhattan,7002001,001438,Bellevue Hospital Center,70 or Older,112,F,Black/African American,Not Span/Hispanic,1,Emergency,Home or Self Care,2017,115,Aortic; peripheral; and visceral artery aneurysms,222,BLOOD TRANSFUSION,197,Peripheral & other vascular disorders,05,Diseases and Disorders of the Circulatory System,2,Moderate,Moderate,Medical,Medicaid,,,,N,Y,7051.37,4546.36
New York City,Manhattan,7002001,001438,Bellevue Hospital Center,50 to 69,100,M,Other Race,Not Span/Hispanic,11,Emergency,Skilled Nursing Home,2017,118,Phlebitis; thrombophlebitis and thromboembolism,061,OT OR PRCS VES NOT HEAD,197,Peripheral & other vascular disorders,05,Diseases and Disorders of the Circulatory System,3,Major,Moderate,Medical,Miscellaneous/Other,Medicaid,,,N,Y,64816.10,41790.05
New York City,Manhattan,7002001,001438,Bellevue Hospital Center,30 to 49,114,M,Other Race,Spanish/Hispanic,2,Emergency,Home or Self Care,2017,115,Aortic; peripheral; and visceral artery aneurysms,179,CT SCAN ABDOMEN,197,Peripheral & other vascular disorders,05,Diseases and Disorders of the Circulatory System,3,Major,Minor,Medical,Private Health Insurance,,,,N,Y,15184.91,9790.44
New York City,Manhattan,7002001,001438,Bellevue Hospital Center,70 or Older,112,F,Black/African American,Not Span/Hispanic,2,Emergency,Home w/ Home Health Services,2017,115,Aortic; peripheral; and visceral artery aneurysms,193,DX ULTRASOUND HEART,197,Peripheral & other vascular disorders,05,Diseases and Disorders of the Circulatory System,2,Moderate,Major,Medical,Medicare,Medicare,,,N,N,14927.24,9624.31
New York City,Manhattan,7002001,001438,Bellevue Hospital Center,70 or Older,100,F,Black/African American,Not Span/Hispanic,1,Emergency,Home or Self Care,2017,118,Phlebitis; thrombophlebitis and thromboembolism,197,OTHER DX ULTRASOUND,197,Peripheral & other vascular disorders,05,Diseases and Disorders of the Circulatory System,2,Moderate,Minor,Medical,Self-Pay,,,,N,Y,8293.62,5347.29
New York City,Manhattan,7002001,001438,Bellevue Hospital Center,50 to 69,112,F,Other Race,Not Span/Hispanic,4,Emergency,Home or Self Care,2017,118,Phlebitis; thrombophlebitis and thromboembolism,058,HEMODIALYSIS,197,Peripheral & other vascular disorders,05,Diseases and Disorders of the Circulatory System,3,Major,Moderate,Medical,Medicare,Medicaid,,,N,Y,26833.43,17300.80
New York City,Manhattan,7002001,001438,Bellevue Hospital Center,70 or Older,112,F,Other Race,Spanish/Hispanic,3,Emergency,Home or Self Care,2017,118,Phlebitis; thrombophlebitis and thromboembolism,222,BLOOD TRANSFUSION,197,Peripheral & other vascular disorders,05,Diseases and Disorders of the Circulatory System,3,Major,Major,Medical,Medicare,,,,N,Y,26568.98,17130.30
New York City,Manhattan,7002001,001438,Bellevue Hospital Center,30 to 49,111,F,White,Spanish/Hispanic,2,Emergency,Home or Self Care,2017,118,Phlebitis; thrombophlebitis and thromboembolism,061,OT OR PRCS VES NOT HEAD,197,Peripheral & other vascular disorders,05,Diseases and Disorders of the Circulatory System,2,Moderate,Minor,Medical,Medicaid,,,,N,Y,15302.44,9866.22
New York City,Manhattan,7002001,001438,Bellevue Hospital Center,50 to 69,100,M,Other Race,Not Span/Hispanic,6,Emergency,Skilled Nursing Home,2017,118,Phlebitis; thrombophlebitis and thromboembolism,222,BLOOD TRANSFUSION,197,Peripheral & other vascular disorders,05,Diseases and Disorders of the Circulatory System,2,Moderate,Major,Medical,Medicare,Medicaid,,,N,Y,33849.05,21824.11
New York City,Manhattan,7002001,001438,Bellevue Hospital Center,50 to 69,100,M,Black/African American,Not Span/Hispanic,3,Emergency,Home or Self Care,2017,118,Phlebitis; thrombophlebitis and thromboembolism,197,OTHER DX ULTRASOUND,197,Peripheral & other vascular disorders,05,Diseases and Disorders of the Circulatory System,1,Minor,Minor,Medical,Medicaid,Medicaid,,,N,Y,20985.95,13530.65
New York City,Manhattan,7002001,001438,Bellevue Hospital Center,70 or Older,100,M,White,Not Span/Hispanic,1,Emergency,Expired,2017,115,Aortic; peripheral; and visceral artery aneurysms,180,OTHER CT SCAN,197,Peripheral & other vascular disorders,05,Diseases and Disorders of the Circulatory System,3,Major,Extreme,Medical,Medicare,Private Health Insurance,,,N,Y,12002.21,7738.40
New York City,Manhattan,7002001,001438,Bellevue Hospital Center,70 or Older,112,M,Black/African American,Not Span/Hispanic,2,Emergency,Home or Self Care,2017,118,Phlebitis; thrombophlebitis and thromboembolism,058,HEMODIALYSIS,197,Peripheral & other vascular disorders,05,Diseases and Disorders of the Circulatory System,2,Moderate,Moderate,Medical,Medicare,Medicaid,,,N,Y,16781.06,10819.55
New York City,Manhattan,7002001,001438,Bellevue Hospital Center,50 to 69,100,M,Black/African American,Not Span/Hispanic,8,Emergency,Psychiatric Hospital or Unit of Hosp,2017,115,Aortic; peripheral; and visceral artery aneurysms,231,OTHER THERAPEUTIC PRCS,197,Peripheral & other vascular disorders,05,Diseases and Disorders of the Circulatory System,3,Major,Major,Medical,Medicaid,,,,N,Y,66036.97,42577.20
New York City,Manhattan,7002001,001438,Bellevue Hospital Center,50 to 69,112,M,Other Race,Not Span/Hispanic,2,Emergency,Home or Self Care,2017,050,Diabetes mellitus with complications,063,OT NON-OR THER CARDIO,197,Peripheral & other vascular disorders,05,Diseases and Disorders of the Circulatory System,2,Moderate,Moderate,Medical,Medicare,,,,N,Y,14821.70,9556.26
New York City,Manhattan,7002001,001438,Bellevue Hospital Center,50 to 69,112,F,Other Race,Not Span/Hispanic,1,Emergency,Another Type Not Listed,2017,115,Aortic; peripheral; and visceral artery aneurysms,193,DX ULTRASOUND HEART,197,Peripheral & other vascular disorders,05,Diseases and Disorders of the Circulatory System,3,Major,Major,Medical,Medicare,Medicare,,,N,N,10312.10,6648.71
New York City,Manhattan,7002001,001438,Bellevue Hospital Center,50 to 69,112,M,Black/African American,Not Span/Hispanic,2,Emergency,Home or Self Care,2017,118,Phlebitis; thrombophlebitis and thromboembolism,231,OTHER THERAPEUTIC PRCS,197,Peripheral & other vascular disorders,05,Diseases and Disorders of the Circulatory System,2,Moderate,Moderate,Medical,Medicaid,Medicaid,,,N,Y,14577.96,9399.11
New York City,Manhattan,7002001,001438,Bellevue Hospital Center,30 to 49,112,F,Other Race,Not Span/Hispanic,1,Emergency,Home or Self Care,2017,118,Phlebitis; thrombophlebitis and thromboembolism,231,OTHER THERAPEUTIC PRCS,197,Peripheral & other vascular disorders,05,Diseases and Disorders of the Circulatory System,2,Moderate,Minor,Medical,Medicaid,Medicaid,,,N,Y,9135.86,5890.33
New York City,Manhattan,7002001,001438,Bellevue Hospital Center,30 to 49,104,M,Other Race,Not Span/Hispanic,2,Emergency,Home or Self Care,2017,115,Aortic; peripheral; and visceral artery aneurysms,198,MAG RESONANCE IMAGING,197,Peripheral & other vascular disorders,05,Diseases and Disorders of the Circulatory System,1,Minor,Minor,Medical,"Managed Care, Unspecified",Medicaid,,,N,Y,24256.81,15639.53
New York City,Manhattan,7002001,001438,Bellevue Hospital Center,30 to 49,100,M,Other Race,Spanish/Hispanic,25,Emergency,Home or Self Care,2017,118,Phlebitis; thrombophlebitis and thromboembolism,197,OTHER DX ULTRASOUND,197,Peripheral & other vascular disorders,05,Diseases and Disorders of the Circulatory System,4,Extreme,Major,Medical,Medicaid,,,,N,Y,131355.50,84691.20
New York City,Manhattan,7002001,001438,Bellevue Hospital Center,50 to 69,100,M,Other Race,Spanish/Hispanic,5,Emergency,Home or Self Care,2017,118,Phlebitis; thrombophlebitis and thromboembolism,000,NO PROC,197,Peripheral & other vascular disorders,05,Diseases and Disorders of the Circulatory System,3,Major,Moderate,Medical,Medicare,Medicare,Medicaid,,N,Y,37739.01,24332.15
New York City,Manhattan,7002001,001438,Bellevue Hospital Center,18 to 29,100,M,Other Race,Spanish/Hispanic,2,Emergency,Home or Self Care,2017,118,Phlebitis; thrombophlebitis and thromboembolism,000,NO PROC,197,Peripheral & other vascular disorders,05,Diseases and Disorders of the Circulatory System,1,Minor,Minor,Medical,Self-Pay,,,,N,Y,13137.93,8470.65
New York City,Manhattan,7002001,001438,Bellevue Hospital Center,30 to 49,OOS,F,White,Not Span/Hispanic,1,Emergency,Home or Self Care,2017,115,Aortic; peripheral; and visceral artery aneurysms,193,DX ULTRASOUND HEART,197,Peripheral & other vascular disorders,05,Diseases and Disorders of the Circulatory System,2,Moderate,Moderate,Medical,Medicaid,,,,N,N,10175.34,6560.53
New York City,Manhattan,7002001,001438,Bellevue Hospital Center,30 to 49,113,F,Other Race,Not Span/Hispanic,2,Emergency,Home or Self Care,2017,118,Phlebitis; thrombophlebitis and thromboembolism,231,OTHER THERAPEUTIC PRCS,197,Peripheral & other vascular disorders,05,Diseases and Disorders of the Circulatory System,2,Moderate,Minor,Medical,Blue Cross/Blue Shield,,,,N,Y,14884.58,9596.80