Hospital Service Area,Hospital County,Operating Certificate Number,Permanent Facility Id,Facility Name,Age Group,Zip Code - 3 digits,Gender,Race,Ethnicity,Length of Stay,Type of Admission,Patient Disposition,Discharge Year,CCS Diagnosis Code,CCS Diagnosis Description,CCS Procedure Code,CCS Procedure Description,APR DRG Code,APR DRG Description,APR MDC Code,APR MDC Description,APR Severity of Illness Code,APR Severity of Illness Description,APR Risk of Mortality,APR Medical Surgical Description,Payment Typology 1,Payment Typology 2,Payment Typology 3,Birth Weight,Abortion Edit Indicator,Emergency Department Indicator,Total Charges,Total Costs
New York City,Kings,7002053,001304,NYU Langone Hospital-Brooklyn,50 to 69,112,F,White,Not Span/Hispanic,4,Emergency,Home or Self Care,2019,CIR033,ACUTE PHLEBITIS; THROMBOPHLEBITIS AND THROMBOEMBOLISM,SUD002,PHARMACOTHERAPY FOR SUBSTANCE USE,197,PERIPHERAL & OTHER VASCULAR DISORDERS,05,DISEASES AND DISORDERS OF THE CIRCULATORY SYSTEM,3,Major,Major,Medical,Medicare,Medicaid,,,,true,49497.23,16529.42
New York City,Kings,7002053,001304,NYU Langone Hospital-Brooklyn,70 or Older,112,F,Black/African American,Not Span/Hispanic,1,Emergency,Home or Self Care,2019,CIR034,CHRONIC PHLEBITIS; THROMBOPHLEBITIS AND THROMBOEMBOLISM,IMG002,FLUOROSCOPIC ANGIOGRAPHY (EXCLUDING CORONARY),197,PERIPHERAL & OTHER VASCULAR DISORDERS,05,DISEASES AND DISORDERS OF THE CIRCULATORY SYSTEM,2,Moderate,Moderate,Medical,Medicaid,,,,,true,56866.48,10776.95
New York City,Kings,7002053,001304,NYU Langone Hospital-Brooklyn,70 or Older,112,F,White,Not Span/Hispanic,4,Emergency,Skilled Nursing Home,2019,CIR033,ACUTE PHLEBITIS; THROMBOPHLEBITIS AND THROMBOEMBOLISM,,,197,PERIPHERAL & OTHER VASCULAR DISORDERS,05,DISEASES AND DISORDERS OF THE CIRCULATORY SYSTEM,2,Moderate,Moderate,Medical,Medicare,Medicare,,,,true,42760.79,15435.83
New York City,Kings,7002053,001304,NYU Langone Hospital-Brooklyn,50 to 69,112,M,Other Race,Not Span/Hispanic,6,Emergency,Home or Self Care,2019,CIR036,POSTTHROMBOTIC SYNDROME AND VENOUS INSUFFICIENCY/HYPERTENSION,OTR004,ISOLATION PROCEDURES,197,PERIPHERAL & OTHER VASCULAR DISORDERS,05,DISEASES AND DISORDERS OF THE CIRCULATORY SYSTEM,2,Moderate,Minor,Medical,Medicaid,,,,,true,68120.49,21790.29
New York City,Kings,7002053,001304,NYU Langone Hospital-Brooklyn,30 to 49,112,M,Other Race,Spanish/Hispanic,9,Emergency,Home or Self Care,2019,END003,DIABETES MELLITUS WITH COMPLICATION,,,197,PERIPHERAL & OTHER VASCULAR DISORDERS,05,DISEASES AND DISORDERS OF THE CIRCULATORY SYSTEM,2,Moderate,Minor,Medical,Medicaid,,,,,true,102625.83,32391.91
New York City,Kings,7002053,001304,NYU Langone Hospital-Brooklyn,50 to 69,112,M,White,Unknown,1,Emergency,Home or Self Care,2019,CIR033,ACUTE PHLEBITIS; THROMBOPHLEBITIS AND THROMBOEMBOLISM,,,197,PERIPHERAL & OTHER VASCULAR DISORDERS,05,DISEASES AND DISORDERS OF THE CIRCULATORY SYSTEM,3,Major,Major,Medical,Private Health Insurance,,,,,true,26176.88,6352.17
New York City,Kings,7002053,001304,NYU Langone Hospital-Brooklyn,70 or Older,112,M,White,Not Span/Hispanic,4,Emergency,Skilled Nursing Home,2019,CIR035,VARICOSE VEINS OF LOWER EXTREMITY,SKB008,SKIN EXCISION AND DEBRIDEMENT,197,PERIPHERAL & OTHER VASCULAR DISORDERS,05,DISEASES AND DISORDERS OF THE CIRCULATORY SYSTEM,2,Moderate,Moderate,Medical,Medicare,Blue Cross/Blue Shield,,,,true,73435.62,18733.93
New York City,Kings,7002053,001304,NYU Langone Hospital-Brooklyn,30 to 49,112,M,Other Race,Spanish/Hispanic,6,Emergency,Home or Self Care,2019,END003,DIABETES MELLITUS WITH COMPLICATION,,,197,PERIPHERAL & OTHER VASCULAR DISORDERS,05,DISEASES AND DISORDERS OF THE CIRCULATORY SYSTEM,3,Major,Minor,Medical,Medicaid,,,,,true,72619.12,21232.07
New York City,Kings,7002053,001304,NYU Langone Hospital-Brooklyn,50 to 69,112,M,White,Not Span/Hispanic,17,Emergency,Skilled Nursing Home,2019,END003,DIABETES MELLITUS WITH COMPLICATION,MST020,SUBCUTANEOUS TISSUE AND FASCIA EXCISION,197,PERIPHERAL & OTHER VASCULAR DISORDERS,05,DISEASES AND DISORDERS OF THE CIRCULATORY SYSTEM,3,Major,Moderate,Medical,Medicare,Medicaid,,,,true,191138.36,61893.02
New York City,Kings,7002053,001304,NYU Langone Hospital-Brooklyn,50 to 69,112,F,White,Not Span/Hispanic,2,Emergency,Home or Self Care,2019,CIR033,ACUTE PHLEBITIS; THROMBOPHLEBITIS AND THROMBOEMBOLISM,ADM021,"ADMINISTRATION OF THERAPEUTIC SUBSTANCES, NEC",197,PERIPHERAL & OTHER VASCULAR DISORDERS,05,DISEASES AND DISORDERS OF THE CIRCULATORY SYSTEM,3,Major,Major,Medical,Private Health Insurance,,,,,true,58040.19,15151.93
New York City,Kings,7002053,001304,NYU Langone Hospital-Brooklyn,30 to 49,112,M,Other Race,Spanish/Hispanic,1,Emergency,Home or Self Care,2019,CIR033,ACUTE PHLEBITIS; THROMBOPHLEBITIS AND THROMBOEMBOLISM,,,197,PERIPHERAL & OTHER VASCULAR DISORDERS,05,DISEASES AND DISORDERS OF THE CIRCULATORY SYSTEM,2,Moderate,Moderate,Medical,Medicare,,,,,true,30011.42,6988.42
New York City,Kings,7002053,001304,NYU Langone Hospital-Brooklyn,70 or Older,103,M,White,Not Span/Hispanic,1,Emergency,Home or Self Care,2019,CIR033,ACUTE PHLEBITIS; THROMBOPHLEBITIS AND THROMBOEMBOLISM,,,197,PERIPHERAL & OTHER VASCULAR DISORDERS,05,DISEASES AND DISORDERS OF THE CIRCULATORY SYSTEM,2,Moderate,Major,Medical,Medicare,Private Health Insurance,,,,true,15089.62,4496.58
New York City,Kings,7002053,001304,NYU Langone Hospital-Brooklyn,70 or Older,112,M,White,Not Span/Hispanic,2,Emergency,Home or Self Care,2019,CIR029,AORTIC; PERIPHERAL; AND VISCERAL ARTERY ANEURYSMS,,,197,PERIPHERAL & OTHER VASCULAR DISORDERS,05,DISEASES AND DISORDERS OF THE CIRCULATORY SYSTEM,2,Moderate,Moderate,Medical,Blue Cross/Blue Shield,,,,,true,50058.53,11533.45
New York City,Kings,7002053,001304,NYU Langone Hospital-Brooklyn,70 or Older,112,F,Black/African American,Not Span/Hispanic,3,Emergency,Home w/ Home Health Services,2019,END003,DIABETES MELLITUS WITH COMPLICATION,IMG003,FLUOROSCOPIC GUIDANCE FOR CIRCULATORY SYSTEM PROCEDURES,197,PERIPHERAL & OTHER VASCULAR DISORDERS,05,DISEASES AND DISORDERS OF THE CIRCULATORY SYSTEM,3,Major,Moderate,Medical,Medicare,Medicaid,,,,true,82490.63,19203.04
New York City,Kings,7002053,001304,NYU Langone Hospital-Brooklyn,50 to 69,112,M,White,Not Span/Hispanic,4,Emergency,Home or Self Care,2019,CIR033,ACUTE PHLEBITIS; THROMBOPHLEBITIS AND THROMBOEMBOLISM,,,197,PERIPHERAL & OTHER VASCULAR DISORDERS,05,DISEASES AND DISORDERS OF THE CIRCULATORY SYSTEM,2,Moderate,Moderate,Medical,Private Health Insurance,Medicaid,,,,true,50500.06,15345.97
New York City,Kings,7002053,001304,NYU Langone Hospital-Brooklyn,70 or Older,112,M,White,Unknown,3,Emergency,Skilled Nursing Home,2019,CIR033,ACUTE PHLEBITIS; THROMBOPHLEBITIS AND THROMBOEMBOLISM,ADM015,ADMINISTRATION OF ANTIBIOTICS,197,PERIPHERAL & OTHER VASCULAR DISORDERS,05,DISEASES AND DISORDERS OF THE CIRCULATORY SYSTEM,2,Moderate,Minor,Medical,Medicare,Medicaid,,,,true,35467.42,12005.18
New York City,Kings,7002053,001304,NYU Langone Hospital-Brooklyn,50 to 69,112,M,White,Not Span/Hispanic,4,Emergency,Home or Self Care,2019,CIR036,POSTTHROMBOTIC SYNDROME AND VENOUS INSUFFICIENCY/HYPERTENSION,,,197,PERIPHERAL & OTHER VASCULAR DISORDERS,05,DISEASES AND DISORDERS OF THE CIRCULATORY SYSTEM,3,Major,Minor,Medical,Private Health Insurance,,,,,true,41133.55,13933.56
New York City,Kings,7002053,001304,NYU Langone Hospital-Brooklyn,30 to 49,112,M,Black/African American,Not Span/Hispanic,1,Emergency,Home or Self Care,2019,CIR033,ACUTE PHLEBITIS; THROMBOPHLEBITIS AND THROMBOEMBOLISM,,,197,PERIPHERAL & OTHER VASCULAR DISORDERS,05,DISEASES AND DISORDERS OF THE CIRCULATORY SYSTEM,3,Major,Major,Medical,Blue Cross/Blue Shield,,,,,true,29297.06,6908.9
New York City,Kings,7002053,001304,NYU Langone Hospital-Brooklyn,50 to 69,112,F,Black/African American,Not Span/Hispanic,2,Emergency,Home or Self Care,2019,CIR033,ACUTE PHLEBITIS; THROMBOPHLEBITIS AND THROMBOEMBOLISM,ADM001,TRANSFUSION OF BLOOD AND BLOOD PRODUCTS,197,PERIPHERAL & OTHER VASCULAR DISORDERS,05,DISEASES AND DISORDERS OF THE CIRCULATORY SYSTEM,2,Moderate,Minor,Medical,Private Health Insurance,,,,,true,40710.14,13624.09
New York City,Kings,7002053,001304,NYU Langone Hospital-Brooklyn,50 to 69,112,M,Other Race,Spanish/Hispanic,5,Emergency,Home or Self Care,2019,CIR036,POSTTHROMBOTIC SYNDROME AND VENOUS INSUFFICIENCY/HYPERTENSION,,,197,PERIPHERAL & OTHER VASCULAR DISORDERS,05,DISEASES AND DISORDERS OF THE CIRCULATORY SYSTEM,3,Major,Moderate,Medical,Medicare,,,,,true,57509.23,18133.87
New York City,Kings,7002053,001304,NYU Langone Hospital-Brooklyn,50 to 69,112,F,Other Race,Spanish/Hispanic,1,Emergency,Home or Self Care,2019,CIR033,ACUTE PHLEBITIS; THROMBOPHLEBITIS AND THROMBOEMBOLISM,ADM021,"ADMINISTRATION OF THERAPEUTIC SUBSTANCES, NEC",197,PERIPHERAL & OTHER VASCULAR DISORDERS,05,DISEASES AND DISORDERS OF THE CIRCULATORY SYSTEM,2,Moderate,Moderate,Medical,Private Health Insurance,,,,,true,16144.96,4689.86
New York City,Kings,7002053,001304,NYU Langone Hospital-Brooklyn,70 or Older,112,F,White,Spanish/Hispanic,6,Emergency,Home w/ Home Health Services,2019,CIR036,POSTTHROMBOTIC SYNDROME AND VENOUS INSUFFICIENCY/HYPERTENSION,,,197,PERIPHERAL & OTHER VASCULAR DISORDERS,05,DISEASES AND DISORDERS OF THE CIRCULATORY SYSTEM,3,Major,Major,Medical,Medicare,,,,,true,60015.8,21269.5
New York City,Kings,7002053,001304,NYU Langone Hospital-Brooklyn,70 or Older,112,F,White,Not Span/Hispanic,14,Emergency,Skilled Nursing Home,2019,CIR033,ACUTE PHLEBITIS; THROMBOPHLEBITIS AND THROMBOEMBOLISM,CAR028,INFERIOR VENA CAVA (IVC) FILTER PROCEDURES,197,PERIPHERAL & OTHER VASCULAR DISORDERS,05,DISEASES AND DISORDERS OF THE CIRCULATORY SYSTEM,4,Extreme,Extreme,Medical,Medicare,Medicare,,,,true,199601.15,59957.3
New York City,Kings,7002053,001304,NYU Langone Hospital-Brooklyn,70 or Older,112,F,Other Race,Spanish/Hispanic,1,Emergency,Home w/ Home Health Services,2019,END003,DIABETES MELLITUS WITH COMPLICATION,,,197,PERIPHERAL & OTHER VASCULAR DISORDERS,05,DISEASES AND DISORDERS OF THE CIRCULATORY SYSTEM,2,Moderate,Minor,Medical,Medicare,,,,,true,39270.97,7020.45
New York City,Kings,7002053,001304,NYU Langone Hospital-Brooklyn,50 to 69,112,M,White,Not Span/Hispanic,2,Emergency,Home or Self Care,2019,CIR033,ACUTE PHLEBITIS; THROMBOPHLEBITIS AND THROMBOEMBOLISM,IMG006,COMPUTERIZED TOMOGRAPHY (CT) WITH CONTRAST,197,PERIPHERAL & OTHER VASCULAR DISORDERS,05,DISEASES AND DISORDERS OF THE CIRCULATORY SYSTEM,3,Major,Extreme,Medical,Medicaid,,,,,true,45768.79,14196.52
New York City,Kings,7002053,001304,NYU Langone Hospital-Brooklyn,50 to 69,112,M,Other Race,Spanish/Hispanic,6,Emergency,Home or Self Care,2019,CIR036,POSTTHROMBOTIC SYNDROME AND VENOUS INSUFFICIENCY/HYPERTENSION,,,197,PERIPHERAL & OTHER VASCULAR DISORDERS,05,DISEASES AND DISORDERS OF THE CIRCULATORY SYSTEM,3,Major,Moderate,Medical,Medicaid,,,,,true,98441.89,24336.08
New York City,Kings,7002053,001304,NYU Langone Hospital-Brooklyn,50 to 69,112,M,Other Race,Spanish/Hispanic,1,Emergency,Home w/ Home Health Services,2019,CIR033,ACUTE PHLEBITIS; THROMBOPHLEBITIS AND THROMBOEMBOLISM,IMG008,ULTRASONOGRAPHY,197,PERIPHERAL & OTHER VASCULAR DISORDERS,05,DISEASES AND DISORDERS OF THE CIRCULATORY SYSTEM,3,Major,Major,Medical,Medicaid,,,,,true,33574.15,6811.22
New York City,Kings,7002053,001304,NYU Langone Hospital-Brooklyn,50 to 69,112,F,Other Race,Not Span/Hispanic,2,Emergency,Home or Self Care,2019,INJ037,"COMPLICATION OF OTHER SURGICAL OR MEDICAL CARE, INJURY, INITIAL ENCOUNTER",IMG006,COMPUTERIZED TOMOGRAPHY (CT) WITH CONTRAST,197,PERIPHERAL & OTHER VASCULAR DISORDERS,05,DISEASES AND DISORDERS OF THE CIRCULATORY SYSTEM,3,Major,Major,Medical,Medicare,Private Health Insurance,,,,true,38099.9,10337.23
New York City,Kings,7002053,001304,NYU Langone Hospital-Brooklyn,50 to 69,112,M,Other Race,Not Span/Hispanic,3,Emergency,Home or Self Care,2019,CIR033,ACUTE PHLEBITIS; THROMBOPHLEBITIS AND THROMBOEMBOLISM,HEP001,LIVER BIOPSY,197,PERIPHERAL & OTHER VASCULAR DISORDERS,05,DISEASES AND DISORDERS OF THE CIRCULATORY SYSTEM,3,Major,Major,Medical,Blue Cross/Blue Shield,,,,,true,80066.41,17557.27
New York City,Kings,7002053,001304,NYU Langone Hospital-Brooklyn,70 or Older,112,F,White,Not Span/Hispanic,3,Emergency,Home w/ Home Health Services,2019,CIR033,ACUTE PHLEBITIS; THROMBOPHLEBITIS AND THROMBOEMBOLISM,,,197,PERIPHERAL & OTHER VASCULAR DISORDERS,05,DISEASES AND DISORDERS OF THE CIRCULATORY SYSTEM,3,Major,Moderate,Medical,Medicare,Medicare,,,,true,32375.24,11099.76
New York City,Kings,7002053,001304,NYU Langone Hospital-Brooklyn,50 to 69,112,M,Other Race,Spanish/Hispanic,2,Emergency,Home or Self Care,2019,CIR033,ACUTE PHLEBITIS; THROMBOPHLEBITIS AND THROMBOEMBOLISM,,,197,PERIPHERAL & OTHER VASCULAR DISORDERS,05,DISEASES AND DISORDERS OF THE CIRCULATORY SYSTEM,1,Minor,Minor,Medical,Medicaid,,,,,true,29757.12,8760.35
New York City,Kings,7002053,001304,NYU Langone Hospital-Brooklyn,70 or Older,112,M,Other Race,Not Span/Hispanic,3,Emergency,Skilled Nursing Home,2019,CIR036,POSTTHROMBOTIC SYNDROME AND VENOUS INSUFFICIENCY/HYPERTENSION,,,197,PERIPHERAL & OTHER VASCULAR DISORDERS,05,DISEASES AND DISORDERS OF THE CIRCULATORY SYSTEM,3,Major,Moderate,Medical,Medicare,,,,,true,43026.58,12481.08
New York City,Kings,7002053,001304,NYU Langone Hospital-Brooklyn,30 to 49,112,M,Other Race,Spanish/Hispanic,2,Emergency,Home or Self Care,2019,CIR039,OTHER SPECIFIED DISEASES OF VEINS AND LYMPHATICS,GIS004,GI SYSTEM ENDOSCOPY WITHOUT BIOPSY (DIAGNOSTIC),197,PERIPHERAL & OTHER VASCULAR DISORDERS,05,DISEASES AND DISORDERS OF THE CIRCULATORY SYSTEM,3,Major,Moderate,Medical,Medicaid,,,,,true,44735.12,11254.29
New York City,Kings,7002053,001304,NYU Langone Hospital-Brooklyn,70 or Older,112,M,Multi-racial,Not Span/Hispanic,1,Elective,Home or Self Care,2019,CIR029,AORTIC; PERIPHERAL; AND VISCERAL ARTERY ANEURYSMS,,,197,PERIPHERAL & OTHER VASCULAR DISORDERS,05,DISEASES AND DISORDERS OF THE CIRCULATORY SYSTEM,1,Minor,Moderate,Medical,Medicare,,,,,false,296373.99,48538.52
New York City,Kings,7002053,001304,NYU Langone Hospital-Brooklyn,50 to 69,112,F,White,Not Span/Hispanic,2,Emergency,Home or Self Care,2019,CIR033,ACUTE PHLEBITIS; THROMBOPHLEBITIS AND THROMBOEMBOLISM,IMG008,ULTRASONOGRAPHY,197,PERIPHERAL & OTHER VASCULAR DISORDERS,05,DISEASES AND DISORDERS OF THE CIRCULATORY SYSTEM,1,Minor,Minor,Medical,Medicare,Blue Cross/Blue Shield,,,,true,23866.43,7901.07
New York City,Kings,7002053,001304,NYU Langone Hospital-Brooklyn,70 or Older,112,F,Other Race,Spanish/Hispanic,8,Emergency,Skilled Nursing Home,2019,END003,DIABETES MELLITUS WITH COMPLICATION,,,197,PERIPHERAL & OTHER VASCULAR DISORDERS,05,DISEASES AND DISORDERS OF THE CIRCULATORY SYSTEM,4,Extreme,Major,Medical,Medicare,Medicaid,,,,true,113380.05,31822.01
New York City,Kings,7002053,001304,NYU Langone Hospital-Brooklyn,70 or Older,112,F,White,Not Span/Hispanic,2,Emergency,Home w/ Home Health Services,2019,CIR036,POSTTHROMBOTIC SYNDROME AND VENOUS INSUFFICIENCY/HYPERTENSION,,,197,PERIPHERAL & OTHER VASCULAR DISORDERS,05,DISEASES AND DISORDERS OF THE CIRCULATORY SYSTEM,1,Minor,Moderate,Medical,Medicare,,,,,true,37908.68,12349.02
New York City,Kings,7002053,001304,NYU Langone Hospital-Brooklyn,50 to 69,112,M,Other Race,Not Span/Hispanic,1,Emergency,Home or Self Care,2019,CIR036,POSTTHROMBOTIC SYNDROME AND VENOUS INSUFFICIENCY/HYPERTENSION,,,197,PERIPHERAL & OTHER VASCULAR DISORDERS,05,DISEASES AND DISORDERS OF THE CIRCULATORY SYSTEM,1,Minor,Minor,Medical,Private Health Insurance,,,,,true,20998.65,5142.08
New York City,Kings,7002053,001304,NYU Langone Hospital-Brooklyn,30 to 49,112,F,Black/African American,Unknown,4,Emergency,Home w/ Home Health Services,2019,CIR033,ACUTE PHLEBITIS; THROMBOPHLEBITIS AND THROMBOEMBOLISM,,,197,PERIPHERAL & OTHER VASCULAR DISORDERS,05,DISEASES AND DISORDERS OF THE CIRCULATORY SYSTEM,3,Major,Major,Medical,Medicaid,,,,,true,56008.69,15683.75
New York City,Kings,7002053,001304,NYU Langone Hospital-Brooklyn,30 to 49,112,M,Black/African American,Not Span/Hispanic,1,Emergency,Home or Self Care,2019,INJ037,"COMPLICATION OF OTHER SURGICAL OR MEDICAL CARE, INJURY, INITIAL ENCOUNTER",IMG006,COMPUTERIZED TOMOGRAPHY (CT) WITH CONTRAST,197,PERIPHERAL & OTHER VASCULAR DISORDERS,05,DISEASES AND DISORDERS OF THE CIRCULATORY SYSTEM,3,Major,Major,Medical,Medicaid,,,,,true,27074.28,6470.78
New York City,Kings,7002053,001304,NYU Langone Hospital-Brooklyn,70 or Older,112,F,Other Race,Spanish/Hispanic,4,Emergency,Home w/ Home Health Services,2019,CIR036,POSTTHROMBOTIC SYNDROME AND VENOUS INSUFFICIENCY/HYPERTENSION,,,197,PERIPHERAL & OTHER VASCULAR DISORDERS,05,DISEASES AND DISORDERS OF THE CIRCULATORY SYSTEM,1,Minor,Moderate,Medical,Medicare,Medicaid,,,,true,56518.19,15321.59
New York City,Kings,7002053,001304,NYU Langone Hospital-Brooklyn,70 or Older,112,F,White,Not Span/Hispanic,6,Emergency,Skilled Nursing Home,2019,CIR033,ACUTE PHLEBITIS; THROMBOPHLEBITIS AND THROMBOEMBOLISM,CAR028,INFERIOR VENA CAVA (IVC) FILTER PROCEDURES,197,PERIPHERAL & OTHER VASCULAR DISORDERS,05,DISEASES AND DISORDERS OF THE CIRCULATORY SYSTEM,3,Major,Moderate,Medical,Medicare,Medicare,,,,true,169358.25,45246.66
New York City,Kings,7002053,001304,NYU Langone Hospital-Brooklyn,70 or Older,112,F,White,Not Span/Hispanic,4,Emergency,Skilled Nursing Home,2019,CIR033,ACUTE PHLEBITIS; THROMBOPHLEBITIS AND THROMBOEMBOLISM,,,197,PERIPHERAL & OTHER VASCULAR DISORDERS,05,DISEASES AND DISORDERS OF THE CIRCULATORY SYSTEM,2,Moderate,Minor,Medical,Medicare,Blue Cross/Blue Shield,,,,true,35673.18,14111.37
New York City,Kings,7002053,001304,NYU Langone Hospital-Brooklyn,30 to 49,112,M,Black/African American,Unknown,2,Emergency,Home or Self Care,2019,CIR033,ACUTE PHLEBITIS; THROMBOPHLEBITIS AND THROMBOEMBOLISM,,,197,PERIPHERAL & OTHER VASCULAR DISORDERS,05,DISEASES AND DISORDERS OF THE CIRCULATORY SYSTEM,2,Moderate,Minor,Medical,Medicaid,,,,,true,27677.93,8897.7
New York City,Kings,7002053,001304,NYU Langone Hospital-Brooklyn,50 to 69,112,F,White,Not Span/Hispanic,1,Emergency,Home or Self Care,2019,CIR026,PERIPHERAL AND VISCERAL VASCULAR DISEASE,SUD002,PHARMACOTHERAPY FOR SUBSTANCE USE,197,PERIPHERAL & OTHER VASCULAR DISORDERS,05,DISEASES AND DISORDERS OF THE CIRCULATORY SYSTEM,2,Moderate,Minor,Medical,Blue Cross/Blue Shield,,,,,true,21867.33,5643.79
New York City,Kings,7002053,001304,NYU Langone Hospital-Brooklyn,50 to 69,112,M,Other Race,Spanish/Hispanic,3,Emergency,Home or Self Care,2019,CIR033,ACUTE PHLEBITIS; THROMBOPHLEBITIS AND THROMBOEMBOLISM,,,197,PERIPHERAL & OTHER VASCULAR DISORDERS,05,DISEASES AND DISORDERS OF THE CIRCULATORY SYSTEM,2,Moderate,Minor,Medical,Medicaid,,,,,true,29104.56,10886.99
New York City,Kings,7002053,001304,NYU Langone Hospital-Brooklyn,70 or Older,112,F,White,Not Span/Hispanic,6,Emergency,Home w/ Home Health Services,2019,CIR036,POSTTHROMBOTIC SYNDROME AND VENOUS INSUFFICIENCY/HYPERTENSION,SKB008,SKIN EXCISION AND DEBRIDEMENT,197,PERIPHERAL & OTHER VASCULAR DISORDERS,05,DISEASES AND DISORDERS OF THE CIRCULATORY SYSTEM,3,Major,Moderate,Medical,Medicaid,,,,,true,49842.47,20397.72
New York City,Kings,7002053,001304,NYU Langone Hospital-Brooklyn,50 to 69,112,M,Black/African American,Not Span/Hispanic,5,Emergency,Home or Self Care,2019,CIR033,ACUTE PHLEBITIS; THROMBOPHLEBITIS AND THROMBOEMBOLISM,GIS001,ESOPHAGOGASTRODUODENOSCOPY (EGD) WITH BIOPSY,197,PERIPHERAL & OTHER VASCULAR DISORDERS,05,DISEASES AND DISORDERS OF THE CIRCULATORY SYSTEM,3,Major,Moderate,Medical,Medicaid,,,,,true,96708.07,24309.35
New York City,Kings,7002053,001304,NYU Langone Hospital-Brooklyn,50 to 69,112,M,White,Not Span/Hispanic,6,Emergency,Skilled Nursing Home,2019,CIR036,POSTTHROMBOTIC SYNDROME AND VENOUS INSUFFICIENCY/HYPERTENSION,MST020,SUBCUTANEOUS TISSUE AND FASCIA EXCISION,197,PERIPHERAL & OTHER VASCULAR DISORDERS,05,DISEASES AND DISORDERS OF THE CIRCULATORY SYSTEM,3,Major,Moderate,Medical,Medicare,Medicaid,,,,true,98176.97,26577.32
New York City,Kings,7002053,001304,NYU Langone Hospital-Brooklyn,70 or Older,112,F,Other Race,Spanish/Hispanic,1,Emergency,Home or Self Care,2019,CIR033,ACUTE PHLEBITIS; THROMBOPHLEBITIS AND THROMBOEMBOLISM,,,197,PERIPHERAL & OTHER VASCULAR DISORDERS,05,DISEASES AND DISORDERS OF THE CIRCULATORY SYSTEM,3,Major,Major,Medical,Medicare,Medicaid,,,,true,30586.64,9548.9
New York City,Kings,7002053,001304,NYU Langone Hospital-Brooklyn,70 or Older,112,F,Other Race,Spanish/Hispanic,2,Emergency,Home or Self Care,2019,CIR033,ACUTE PHLEBITIS; THROMBOPHLEBITIS AND THROMBOEMBOLISM,,,197,PERIPHERAL & OTHER VASCULAR DISORDERS,05,DISEASES AND DISORDERS OF THE CIRCULATORY SYSTEM,4,Extreme,Extreme,Medical,Medicare,Medicaid,,,,true,38739.82,10242.24
New York City,Kings,7002053,001304,NYU Langone Hospital-Brooklyn,30 to 49,112,M,Other Race,Spanish/Hispanic,5,Emergency,Home w/ Home Health Services,2019,END003,DIABETES MELLITUS WITH COMPLICATION,IMG002,FLUOROSCOPIC ANGIOGRAPHY (EXCLUDING CORONARY),197,PERIPHERAL & OTHER VASCULAR DISORDERS,05,DISEASES AND DISORDERS OF THE CIRCULATORY SYSTEM,3,Major,Moderate,Medical,Medicaid,,,,,true,102169.45,24915.73
New York City,Kings,7002053,001304,NYU Langone Hospital-Brooklyn,70 or Older,112,F,White,Not Span/Hispanic,3,Emergency,Skilled Nursing Home,2019,CIR033,ACUTE PHLEBITIS; THROMBOPHLEBITIS AND THROMBOEMBOLISM,,,197,PERIPHERAL & OTHER VASCULAR DISORDERS,05,DISEASES AND DISORDERS OF THE CIRCULATORY SYSTEM,2,Moderate,Minor,Medical,Medicare,Medicare,,,,true,59581.08,19721.55
New York City,Kings,7002053,001304,NYU Langone Hospital-Brooklyn,70 or Older,103,F,White,Not Span/Hispanic,3,Emergency,Home w/ Home Health Services,2019,CIR033,ACUTE PHLEBITIS; THROMBOPHLEBITIS AND THROMBOEMBOLISM,,,197,PERIPHERAL & OTHER VASCULAR DISORDERS,05,DISEASES AND DISORDERS OF THE CIRCULATORY SYSTEM,3,Major,Major,Medical,Medicare,Medicaid,,,,true,67101.19,14365.3
New York City,Kings,7002053,001304,NYU Langone Hospital-Brooklyn,70 or Older,112,F,Other Race,Not Span/Hispanic,3,Emergency,Home or Self Care,2019,CIR033,ACUTE PHLEBITIS; THROMBOPHLEBITIS AND THROMBOEMBOLISM,ADM015,ADMINISTRATION OF ANTIBIOTICS,197,PERIPHERAL & OTHER VASCULAR DISORDERS,05,DISEASES AND DISORDERS OF THE CIRCULATORY SYSTEM,2,Moderate,Moderate,Medical,Medicare,,,,,true,29076.84,10866.61
New York City,Kings,7002053,001304,NYU Langone Hospital-Brooklyn,50 to 69,100,M,Other Race,Spanish/Hispanic,2,Emergency,Home or Self Care,2019,CIR036,POSTTHROMBOTIC SYNDROME AND VENOUS INSUFFICIENCY/HYPERTENSION,ADM015,ADMINISTRATION OF ANTIBIOTICS,197,PERIPHERAL & OTHER VASCULAR DISORDERS,05,DISEASES AND DISORDERS OF THE CIRCULATORY SYSTEM,1,Minor,Minor,Medical,Medicaid,,,,,true,25859,8200.57
New York City,Kings,7002053,001304,NYU Langone Hospital-Brooklyn,50 to 69,112,M,Other Race,Not Span/Hispanic,2,Emergency,Home w/ Home Health Services,2019,CIR027,ARTERIAL DISSECTIONS,URN006,BLADDER CATHETERIZATION AND DRAINAGE,197,PERIPHERAL & OTHER VASCULAR DISORDERS,05,DISEASES AND DISORDERS OF THE CIRCULATORY SYSTEM,3,Major,Major,Medical,Medicare,Medicaid,,,,true,86588.03,20120.12
New York City,Kings,7002053,001304,NYU Langone Hospital-Brooklyn,50 to 69,112,M,Other Race,Spanish/Hispanic,1,Emergency,Skilled Nursing Home,2019,CIR036,POSTTHROMBOTIC SYNDROME AND VENOUS INSUFFICIENCY/HYPERTENSION,,,197,PERIPHERAL & OTHER VASCULAR DISORDERS,05,DISEASES AND DISORDERS OF THE CIRCULATORY SYSTEM,1,Minor,Moderate,Medical,Medicare,,,,,true,24240.14,5654.81
New York City,Kings,7002053,001304,NYU Langone Hospital-Brooklyn,70 or Older,112,M,White,Not Span/Hispanic,2,Emergency,Home or Self Care,2019,CIR033,ACUTE PHLEBITIS; THROMBOPHLEBITIS AND THROMBOEMBOLISM,,,197,PERIPHERAL & OTHER VASCULAR DISORDERS,05,DISEASES AND DISORDERS OF THE CIRCULATORY SYSTEM,3,Major,Extreme,Medical,Medicare,,,,,true,34526.58,9679.89