Hospital Service Area,Hospital County,Operating Certificate Number,Permanent Facility Id,Facility Name,Age Group,Zip Code - 3 digits,Gender,Race,Ethnicity,Length of Stay,Type of Admission,Patient Disposition,Discharge Year,CCS Diagnosis Code,CCS Diagnosis Description,CCS Procedure Code,CCS Procedure Description,APR DRG Code,APR DRG Description,APR MDC Code,APR MDC Description,APR Severity of Illness Code,APR Severity of Illness Description,APR Risk of Mortality,APR Medical Surgical Description,Payment Typology 1,Payment Typology 2,Payment Typology 3,Birth Weight,Abortion Edit Indicator,Emergency Department Indicator,Total Charges,Total Costs
Long Island,Suffolk,5123000,000885,Long Island Community Hospital,70 or Older,117,F,White,Not Span/Hispanic,17,Emergency,Home w/ Home Health Services,2019,CIR033,ACUTE PHLEBITIS; THROMBOPHLEBITIS AND THROMBOEMBOLISM,PLC001,IMMOBILIZATION BY SPLINT OR OTHER EXTERNAL DEVICE,197,PERIPHERAL & OTHER VASCULAR DISORDERS,05,DISEASES AND DISORDERS OF THE CIRCULATORY SYSTEM,2,Moderate,Moderate,Medical,Medicare,Medicare,Medicaid,,,true,108490.4,22375.51
Long Island,Suffolk,5123000,000885,Long Island Community Hospital,70 or Older,117,F,White,Not Span/Hispanic,6,Emergency,Skilled Nursing Home,2019,CIR036,POSTTHROMBOTIC SYNDROME AND VENOUS INSUFFICIENCY/HYPERTENSION,,,197,PERIPHERAL & OTHER VASCULAR DISORDERS,05,DISEASES AND DISORDERS OF THE CIRCULATORY SYSTEM,2,Moderate,Major,Medical,Medicare,Medicare,Private Health Insurance,,,true,44250.74,8477.03
Long Island,Suffolk,5123000,000885,Long Island Community Hospital,30 to 49,119,M,Black/African American,Not Span/Hispanic,1,Emergency,Short-term Hospital,2019,CIR027,ARTERIAL DISSECTIONS,MAM002,PERIPHERAL ARTERIAL PRESSURE MONITORING,197,PERIPHERAL & OTHER VASCULAR DISORDERS,05,DISEASES AND DISORDERS OF THE CIRCULATORY SYSTEM,3,Major,Major,Medical,Private Health Insurance,Medicaid,,,,true,38813.08,3186.98
Long Island,Suffolk,5123000,000885,Long Island Community Hospital,70 or Older,117,F,White,Not Span/Hispanic,8,Emergency,Home or Self Care,2019,CIR033,ACUTE PHLEBITIS; THROMBOPHLEBITIS AND THROMBOEMBOLISM,,,197,PERIPHERAL & OTHER VASCULAR DISORDERS,05,DISEASES AND DISORDERS OF THE CIRCULATORY SYSTEM,2,Moderate,Moderate,Medical,Medicare,Medicare,Private Health Insurance,,,true,47505.59,10797.2
Long Island,Suffolk,5123000,000885,Long Island Community Hospital,50 to 69,117,M,White,Not Span/Hispanic,2,Emergency,Short-term Hospital,2019,CIR039,OTHER SPECIFIED DISEASES OF VEINS AND LYMPHATICS,GNR004,ENDOSCOPIC CONTROL OF BLEEDING,197,PERIPHERAL & OTHER VASCULAR DISORDERS,05,DISEASES AND DISORDERS OF THE CIRCULATORY SYSTEM,3,Major,Major,Medical,Blue Cross/Blue Shield,,,,,true,55516.9,9717.14
Long Island,Suffolk,5123000,000885,Long Island Community Hospital,70 or Older,117,M,White,Not Span/Hispanic,17,Emergency,Home w/ Home Health Services,2019,CIR033,ACUTE PHLEBITIS; THROMBOPHLEBITIS AND THROMBOEMBOLISM,MST020,SUBCUTANEOUS TISSUE AND FASCIA EXCISION,197,PERIPHERAL & OTHER VASCULAR DISORDERS,05,DISEASES AND DISORDERS OF THE CIRCULATORY SYSTEM,2,Moderate,Moderate,Medical,Medicare,Medicare,Blue Cross/Blue Shield,,,true,117686.84,27521.03
Long Island,Suffolk,5123000,000885,Long Island Community Hospital,50 to 69,117,M,White,Not Span/Hispanic,4,Emergency,Home or Self Care,2019,END003,DIABETES MELLITUS WITH COMPLICATION,MST020,SUBCUTANEOUS TISSUE AND FASCIA EXCISION,197,PERIPHERAL & OTHER VASCULAR DISORDERS,05,DISEASES AND DISORDERS OF THE CIRCULATORY SYSTEM,2,Moderate,Moderate,Medical,Blue Cross/Blue Shield,,,,,true,39946.73,7763.28
Long Island,Suffolk,5123000,000885,Long Island Community Hospital,30 to 49,117,M,White,Not Span/Hispanic,4,Emergency,Home or Self Care,2019,CIR033,ACUTE PHLEBITIS; THROMBOPHLEBITIS AND THROMBOEMBOLISM,,,197,PERIPHERAL & OTHER VASCULAR DISORDERS,05,DISEASES AND DISORDERS OF THE CIRCULATORY SYSTEM,2,Moderate,Minor,Medical,Blue Cross/Blue Shield,,,,,true,36835.72,7233.18
Long Island,Suffolk,5123000,000885,Long Island Community Hospital,70 or Older,117,F,White,Not Span/Hispanic,6,Emergency,Home or Self Care,2019,CIR033,ACUTE PHLEBITIS; THROMBOPHLEBITIS AND THROMBOEMBOLISM,CAR028,INFERIOR VENA CAVA (IVC) FILTER PROCEDURES,197,PERIPHERAL & OTHER VASCULAR DISORDERS,05,DISEASES AND DISORDERS OF THE CIRCULATORY SYSTEM,4,Extreme,Extreme,Medical,Medicare,Medicare,Blue Cross/Blue Shield,,,true,64766.17,11447.94
Long Island,Suffolk,5123000,000885,Long Island Community Hospital,50 to 69,117,M,Black/African American,Not Span/Hispanic,8,Emergency,Home w/ Home Health Services,2019,END003,DIABETES MELLITUS WITH COMPLICATION,SKB008,SKIN EXCISION AND DEBRIDEMENT,197,PERIPHERAL & OTHER VASCULAR DISORDERS,05,DISEASES AND DISORDERS OF THE CIRCULATORY SYSTEM,3,Major,Moderate,Medical,Private Health Insurance,,,,,true,74237.01,14014.92
Long Island,Suffolk,5123000,000885,Long Island Community Hospital,70 or Older,117,M,White,Not Span/Hispanic,5,Emergency,Home or Self Care,2019,CIR033,ACUTE PHLEBITIS; THROMBOPHLEBITIS AND THROMBOEMBOLISM,,,197,PERIPHERAL & OTHER VASCULAR DISORDERS,05,DISEASES AND DISORDERS OF THE CIRCULATORY SYSTEM,3,Major,Major,Medical,Medicare,Medicare,Blue Cross/Blue Shield,,,true,46973.25,8028.38
Long Island,Suffolk,5123000,000885,Long Island Community Hospital,70 or Older,117,F,White,Not Span/Hispanic,11,Emergency,Skilled Nursing Home,2019,CIR033,ACUTE PHLEBITIS; THROMBOPHLEBITIS AND THROMBOEMBOLISM,MST028,"SUBCUTANEOUS TISSUE AND FASCIA PROCEDURES, NEC",197,PERIPHERAL & OTHER VASCULAR DISORDERS,05,DISEASES AND DISORDERS OF THE CIRCULATORY SYSTEM,2,Moderate,Moderate,Medical,Medicare,Medicare,Medicaid,,,true,166715.66,28152
Long Island,Suffolk,5123000,000885,Long Island Community Hospital,70 or Older,117,F,White,Not Span/Hispanic,10,Emergency,Skilled Nursing Home,2019,END003,DIABETES MELLITUS WITH COMPLICATION,,,197,PERIPHERAL & OTHER VASCULAR DISORDERS,05,DISEASES AND DISORDERS OF THE CIRCULATORY SYSTEM,3,Major,Major,Medical,Medicare,Medicare,Blue Cross/Blue Shield,,,true,72147.83,18260.34
Long Island,Suffolk,5123000,000885,Long Island Community Hospital,70 or Older,117,F,Other Race,Not Span/Hispanic,2,Emergency,Home w/ Home Health Services,2019,CIR033,ACUTE PHLEBITIS; THROMBOPHLEBITIS AND THROMBOEMBOLISM,,,197,PERIPHERAL & OTHER VASCULAR DISORDERS,05,DISEASES AND DISORDERS OF THE CIRCULATORY SYSTEM,1,Minor,Minor,Medical,Medicare,,,,,true,25798.31,4033.8
Long Island,Suffolk,5123000,000885,Long Island Community Hospital,70 or Older,119,M,White,Not Span/Hispanic,2,Emergency,Home or Self Care,2019,CIR033,ACUTE PHLEBITIS; THROMBOPHLEBITIS AND THROMBOEMBOLISM,,,197,PERIPHERAL & OTHER VASCULAR DISORDERS,05,DISEASES AND DISORDERS OF THE CIRCULATORY SYSTEM,3,Major,Major,Medical,Medicare,Medicare,Blue Cross/Blue Shield,,,true,44321.81,6524.66
Long Island,Suffolk,5123000,000885,Long Island Community Hospital,70 or Older,119,M,Other Race,Not Span/Hispanic,16,Emergency,Skilled Nursing Home,2019,END003,DIABETES MELLITUS WITH COMPLICATION,RES003,THORACENTESIS (DIAGNOSTIC),197,PERIPHERAL & OTHER VASCULAR DISORDERS,05,DISEASES AND DISORDERS OF THE CIRCULATORY SYSTEM,3,Major,Major,Medical,Medicare,Medicare,Private Health Insurance,,,true,111292.34,22418.73
Long Island,Suffolk,5123000,000885,Long Island Community Hospital,70 or Older,119,M,White,Not Span/Hispanic,5,Emergency,Home or Self Care,2019,END003,DIABETES MELLITUS WITH COMPLICATION,,,197,PERIPHERAL & OTHER VASCULAR DISORDERS,05,DISEASES AND DISORDERS OF THE CIRCULATORY SYSTEM,2,Moderate,Minor,Medical,Medicare,Medicare,,,,true,33752.49,7035.61
Long Island,Suffolk,5123000,000885,Long Island Community Hospital,50 to 69,119,M,White,Not Span/Hispanic,5,Emergency,Home w/ Home Health Services,2019,END003,DIABETES MELLITUS WITH COMPLICATION,MST020,SUBCUTANEOUS TISSUE AND FASCIA EXCISION,197,PERIPHERAL & OTHER VASCULAR DISORDERS,05,DISEASES AND DISORDERS OF THE CIRCULATORY SYSTEM,3,Major,Moderate,Medical,Private Health Insurance,,,,,true,49876.51,10161.79
Long Island,Suffolk,5123000,000885,Long Island Community Hospital,50 to 69,117,M,Black/African American,Not Span/Hispanic,1,Urgent,Home or Self Care,2019,END003,DIABETES MELLITUS WITH COMPLICATION,IMG002,FLUOROSCOPIC ANGIOGRAPHY (EXCLUDING CORONARY),197,PERIPHERAL & OTHER VASCULAR DISORDERS,05,DISEASES AND DISORDERS OF THE CIRCULATORY SYSTEM,3,Major,Major,Medical,Medicare,Medicare,,,,false,18920.52,4313.62
Long Island,Suffolk,5123000,000885,Long Island Community Hospital,50 to 69,117,M,White,Not Span/Hispanic,6,Emergency,Left Against Medical Advice,2019,CIR026,PERIPHERAL AND VISCERAL VASCULAR DISEASE,SUD001,SUBSTANCE USE DETOXIFICATION,197,PERIPHERAL & OTHER VASCULAR DISORDERS,05,DISEASES AND DISORDERS OF THE CIRCULATORY SYSTEM,3,Major,Major,Medical,Private Health Insurance,Medicaid,,,,true,46901.23,9565.16
Long Island,Suffolk,5123000,000885,Long Island Community Hospital,70 or Older,117,M,White,Not Span/Hispanic,1,Emergency,Home or Self Care,2019,CIR030,AORTIC AND PERIPHERAL ARTERIAL EMBOLISM OR THROMBOSIS,MAM006,PACEMAKER AND DEFIBRILLATOR INTERROGATION,197,PERIPHERAL & OTHER VASCULAR DISORDERS,05,DISEASES AND DISORDERS OF THE CIRCULATORY SYSTEM,3,Major,Major,Medical,Medicare,Medicare,Medicaid,,,true,38716.8,3520.34
Long Island,Suffolk,5123000,000885,Long Island Community Hospital,30 to 49,119,F,Other Race,Not Span/Hispanic,2,Emergency,Home or Self Care,2019,CIR033,ACUTE PHLEBITIS; THROMBOPHLEBITIS AND THROMBOEMBOLISM,,,197,PERIPHERAL & OTHER VASCULAR DISORDERS,05,DISEASES AND DISORDERS OF THE CIRCULATORY SYSTEM,2,Moderate,Minor,Medical,Private Health Insurance,Medicaid,,,,true,26105.69,4643.77
Long Island,Suffolk,5123000,000885,Long Island Community Hospital,50 to 69,117,M,White,Not Span/Hispanic,4,Emergency,Home or Self Care,2019,CIR027,ARTERIAL DISSECTIONS,,,197,PERIPHERAL & OTHER VASCULAR DISORDERS,05,DISEASES AND DISORDERS OF THE CIRCULATORY SYSTEM,2,Moderate,Major,Medical,Private Health Insurance,,,,,true,41218.43,8123.29
Long Island,Suffolk,5123000,000885,Long Island Community Hospital,70 or Older,119,F,White,Not Span/Hispanic,6,Emergency,Home w/ Home Health Services,2019,END003,DIABETES MELLITUS WITH COMPLICATION,ADM001,TRANSFUSION OF BLOOD AND BLOOD PRODUCTS,197,PERIPHERAL & OTHER VASCULAR DISORDERS,05,DISEASES AND DISORDERS OF THE CIRCULATORY SYSTEM,3,Major,Major,Medical,Medicare,,,,,true,66991.32,13453.86
Long Island,Suffolk,5123000,000885,Long Island Community Hospital,70 or Older,119,M,Other Race,Not Span/Hispanic,6,Emergency,Home w/ Home Health Services,2019,END003,DIABETES MELLITUS WITH COMPLICATION,CAR024,VENOUS AND ARTERIAL CATHETER PLACEMENT,197,PERIPHERAL & OTHER VASCULAR DISORDERS,05,DISEASES AND DISORDERS OF THE CIRCULATORY SYSTEM,3,Major,Moderate,Medical,Medicare,Medicare,Private Health Insurance,,,true,54023.43,11244.63
Long Island,Suffolk,5123000,000885,Long Island Community Hospital,70 or Older,117,F,White,Not Span/Hispanic,5,Emergency,Home w/ Home Health Services,2019,CIR033,ACUTE PHLEBITIS; THROMBOPHLEBITIS AND THROMBOEMBOLISM,,,197,PERIPHERAL & OTHER VASCULAR DISORDERS,05,DISEASES AND DISORDERS OF THE CIRCULATORY SYSTEM,3,Major,Moderate,Medical,Medicare,Medicare,Blue Cross/Blue Shield,,,true,33799.64,7041.99
Long Island,Suffolk,5123000,000885,Long Island Community Hospital,50 to 69,119,M,White,Not Span/Hispanic,2,Emergency,Home or Self Care,2019,CIR033,ACUTE PHLEBITIS; THROMBOPHLEBITIS AND THROMBOEMBOLISM,,,197,PERIPHERAL & OTHER VASCULAR DISORDERS,05,DISEASES AND DISORDERS OF THE CIRCULATORY SYSTEM,3,Major,Major,Medical,Blue Cross/Blue Shield,,,,,true,23720.95,3641.83
Long Island,Suffolk,5123000,000885,Long Island Community Hospital,50 to 69,117,M,White,Not Span/Hispanic,1,Emergency,Home or Self Care,2019,CIR033,ACUTE PHLEBITIS; THROMBOPHLEBITIS AND THROMBOEMBOLISM,,,197,PERIPHERAL & OTHER VASCULAR DISORDERS,05,DISEASES AND DISORDERS OF THE CIRCULATORY SYSTEM,2,Moderate,Minor,Medical,Medicare,Medicare,Private Health Insurance,,,true,18997.66,2450.43
Long Island,Suffolk,5123000,000885,Long Island Community Hospital,70 or Older,119,F,White,Not Span/Hispanic,2,Emergency,Home or Self Care,2019,CIR033,ACUTE PHLEBITIS; THROMBOPHLEBITIS AND THROMBOEMBOLISM,,,197,PERIPHERAL & OTHER VASCULAR DISORDERS,05,DISEASES AND DISORDERS OF THE CIRCULATORY SYSTEM,1,Minor,Minor,Medical,Medicare,Medicare,,,,true,18255.33,3414.3
Long Island,Suffolk,5123000,000885,Long Island Community Hospital,70 or Older,117,M,White,Not Span/Hispanic,10,Emergency,Home w/ Home Health Services,2019,END003,DIABETES MELLITUS WITH COMPLICATION,GIS002,COLONOSCOPY AND PROCTOSCOPY WITH BIOPSY,197,PERIPHERAL & OTHER VASCULAR DISORDERS,05,DISEASES AND DISORDERS OF THE CIRCULATORY SYSTEM,3,Major,Major,Medical,Medicare,Medicare,Private Health Insurance,,,true,83516.47,17427.31
Long Island,Suffolk,5123000,000885,Long Island Community Hospital,70 or Older,119,M,White,Not Span/Hispanic,6,Emergency,Home w/ Home Health Services,2019,CIR033,ACUTE PHLEBITIS; THROMBOPHLEBITIS AND THROMBOEMBOLISM,URN006,BLADDER CATHETERIZATION AND DRAINAGE,197,PERIPHERAL & OTHER VASCULAR DISORDERS,05,DISEASES AND DISORDERS OF THE CIRCULATORY SYSTEM,3,Major,Major,Medical,Medicare,Medicare,,,,true,62053.25,10687.75
Long Island,Suffolk,5123000,000885,Long Island Community Hospital,50 to 69,117,F,Black/African American,Not Span/Hispanic,6,Emergency,Home or Self Care,2019,CIR033,ACUTE PHLEBITIS; THROMBOPHLEBITIS AND THROMBOEMBOLISM,SKB001,SKIN BIOPSY AND DIAGNOSTIC DRAINAGE,197,PERIPHERAL & OTHER VASCULAR DISORDERS,05,DISEASES AND DISORDERS OF THE CIRCULATORY SYSTEM,2,Moderate,Moderate,Medical,Medicare,Medicare,Private Health Insurance,,,true,56144.05,10318.35
Long Island,Suffolk,5123000,000885,Long Island Community Hospital,70 or Older,119,M,White,Not Span/Hispanic,3,Emergency,Home w/ Home Health Services,2019,CIR033,ACUTE PHLEBITIS; THROMBOPHLEBITIS AND THROMBOEMBOLISM,,,197,PERIPHERAL & OTHER VASCULAR DISORDERS,05,DISEASES AND DISORDERS OF THE CIRCULATORY SYSTEM,3,Major,Major,Medical,Medicare,,,,,true,53094.9,7046.29
Long Island,Suffolk,5123000,000885,Long Island Community Hospital,70 or Older,117,M,White,Not Span/Hispanic,5,Emergency,Skilled Nursing Home,2019,CIR033,ACUTE PHLEBITIS; THROMBOPHLEBITIS AND THROMBOEMBOLISM,IMG002,FLUOROSCOPIC ANGIOGRAPHY (EXCLUDING CORONARY),197,PERIPHERAL & OTHER VASCULAR DISORDERS,05,DISEASES AND DISORDERS OF THE CIRCULATORY SYSTEM,2,Moderate,Moderate,Medical,Medicare,Blue Cross/Blue Shield,,,,true,42868.18,9737.9
Long Island,Suffolk,5123000,000885,Long Island Community Hospital,70 or Older,117,F,White,Not Span/Hispanic,5,Emergency,Home w/ Home Health Services,2019,CIR035,VARICOSE VEINS OF LOWER EXTREMITY,,,197,PERIPHERAL & OTHER VASCULAR DISORDERS,05,DISEASES AND DISORDERS OF THE CIRCULATORY SYSTEM,2,Moderate,Moderate,Medical,Medicare,Medicare,Private Health Insurance,,,true,37306.94,7927.76
Long Island,Suffolk,5123000,000885,Long Island Community Hospital,70 or Older,117,F,White,Not Span/Hispanic,3,Emergency,Skilled Nursing Home,2019,CIR033,ACUTE PHLEBITIS; THROMBOPHLEBITIS AND THROMBOEMBOLISM,,,197,PERIPHERAL & OTHER VASCULAR DISORDERS,05,DISEASES AND DISORDERS OF THE CIRCULATORY SYSTEM,2,Moderate,Minor,Medical,Medicare,Medicare,,,,true,34769.05,5020.32
Long Island,Suffolk,5123000,000885,Long Island Community Hospital,50 to 69,119,F,White,Not Span/Hispanic,6,Emergency,Skilled Nursing Home,2019,CIR033,ACUTE PHLEBITIS; THROMBOPHLEBITIS AND THROMBOEMBOLISM,GIS001,ESOPHAGOGASTRODUODENOSCOPY (EGD) WITH BIOPSY,197,PERIPHERAL & OTHER VASCULAR DISORDERS,05,DISEASES AND DISORDERS OF THE CIRCULATORY SYSTEM,3,Major,Moderate,Medical,Medicare,Medicare,Blue Cross/Blue Shield,,,true,50479.85,11124.74
Long Island,Suffolk,5123000,000885,Long Island Community Hospital,70 or Older,119,F,White,Not Span/Hispanic,5,Emergency,Skilled Nursing Home,2019,CIR033,ACUTE PHLEBITIS; THROMBOPHLEBITIS AND THROMBOEMBOLISM,CAR028,INFERIOR VENA CAVA (IVC) FILTER PROCEDURES,197,PERIPHERAL & OTHER VASCULAR DISORDERS,05,DISEASES AND DISORDERS OF THE CIRCULATORY SYSTEM,3,Major,Major,Medical,Medicare,Medicare,Private Health Insurance,,,true,63943.14,10593.13
Long Island,Suffolk,5123000,000885,Long Island Community Hospital,70 or Older,117,F,White,Not Span/Hispanic,4,Emergency,Home w/ Home Health Services,2019,CIR033,ACUTE PHLEBITIS; THROMBOPHLEBITIS AND THROMBOEMBOLISM,ADM001,TRANSFUSION OF BLOOD AND BLOOD PRODUCTS,197,PERIPHERAL & OTHER VASCULAR DISORDERS,05,DISEASES AND DISORDERS OF THE CIRCULATORY SYSTEM,3,Major,Major,Medical,Medicare,Medicare,Blue Cross/Blue Shield,,,true,36212.32,6965.66
Long Island,Suffolk,5123000,000885,Long Island Community Hospital,70 or Older,117,M,White,Not Span/Hispanic,13,Emergency,Expired,2019,END003,DIABETES MELLITUS WITH COMPLICATION,ESA001,HEMODIALYSIS,197,PERIPHERAL & OTHER VASCULAR DISORDERS,05,DISEASES AND DISORDERS OF THE CIRCULATORY SYSTEM,4,Extreme,Major,Medical,Medicare,Medicare,Private Health Insurance,,,true,102308.41,20395.13
Long Island,Suffolk,5123000,000885,Long Island Community Hospital,70 or Older,119,F,White,Not Span/Hispanic,3,Emergency,Home or Self Care,2019,CIR033,ACUTE PHLEBITIS; THROMBOPHLEBITIS AND THROMBOEMBOLISM,CAR028,INFERIOR VENA CAVA (IVC) FILTER PROCEDURES,197,PERIPHERAL & OTHER VASCULAR DISORDERS,05,DISEASES AND DISORDERS OF THE CIRCULATORY SYSTEM,2,Moderate,Moderate,Medical,Medicare,Medicare,Blue Cross/Blue Shield,,,true,55546.29,8820.11
Long Island,Suffolk,5123000,000885,Long Island Community Hospital,50 to 69,117,M,White,Not Span/Hispanic,1,Emergency,Short-term Hospital,2019,CIR030,AORTIC AND PERIPHERAL ARTERIAL EMBOLISM OR THROMBOSIS,SUD002,PHARMACOTHERAPY FOR SUBSTANCE USE,197,PERIPHERAL & OTHER VASCULAR DISORDERS,05,DISEASES AND DISORDERS OF THE CIRCULATORY SYSTEM,3,Major,Minor,Medical,Private Health Insurance,Medicaid,,,,true,8287.97,1640.12
Long Island,Suffolk,5123000,000885,Long Island Community Hospital,70 or Older,117,F,White,Not Span/Hispanic,6,Emergency,Expired,2019,CIR033,ACUTE PHLEBITIS; THROMBOPHLEBITIS AND THROMBOEMBOLISM,,,197,PERIPHERAL & OTHER VASCULAR DISORDERS,05,DISEASES AND DISORDERS OF THE CIRCULATORY SYSTEM,3,Major,Major,Medical,Medicare,Medicare,Blue Cross/Blue Shield,,,true,41438.11,8793.5
Long Island,Suffolk,5123000,000885,Long Island Community Hospital,50 to 69,117,F,Black/African American,Not Span/Hispanic,11,Emergency,Home or Self Care,2019,CIR033,ACUTE PHLEBITIS; THROMBOPHLEBITIS AND THROMBOEMBOLISM,ESA004,NON-INVASIVE VENTILATION,197,PERIPHERAL & OTHER VASCULAR DISORDERS,05,DISEASES AND DISORDERS OF THE CIRCULATORY SYSTEM,4,Extreme,Major,Medical,Medicare,Medicare,Private Health Insurance,,,true,95565.85,16970.21
Long Island,Suffolk,5123000,000885,Long Island Community Hospital,50 to 69,117,M,White,Not Span/Hispanic,5,Emergency,Home or Self Care,2019,CIR036,POSTTHROMBOTIC SYNDROME AND VENOUS INSUFFICIENCY/HYPERTENSION,,,197,PERIPHERAL & OTHER VASCULAR DISORDERS,05,DISEASES AND DISORDERS OF THE CIRCULATORY SYSTEM,2,Moderate,Moderate,Medical,Medicare,Medicare,Medicaid,,,true,34177.53,7317.71
Long Island,Suffolk,5123000,000885,Long Island Community Hospital,70 or Older,117,F,Other Race,Not Span/Hispanic,7,Emergency,Home w/ Home Health Services,2019,CIR028,GANGRENE,,,197,PERIPHERAL & OTHER VASCULAR DISORDERS,05,DISEASES AND DISORDERS OF THE CIRCULATORY SYSTEM,2,Moderate,Major,Medical,Medicare,Medicare,Private Health Insurance,,,true,43058.91,10034.74
Long Island,Suffolk,5123000,000885,Long Island Community Hospital,30 to 49,117,F,Black/African American,Not Span/Hispanic,5,Emergency,Home w/ Home Health Services,2019,CIR033,ACUTE PHLEBITIS; THROMBOPHLEBITIS AND THROMBOEMBOLISM,ADM001,TRANSFUSION OF BLOOD AND BLOOD PRODUCTS,197,PERIPHERAL & OTHER VASCULAR DISORDERS,05,DISEASES AND DISORDERS OF THE CIRCULATORY SYSTEM,2,Moderate,Minor,Medical,Private Health Insurance,,,,,true,45180.55,8123.78
Long Island,Suffolk,5123000,000885,Long Island Community Hospital,30 to 49,,M,Black/African American,Not Span/Hispanic,2,Emergency,Home or Self Care,2019,CIR033,ACUTE PHLEBITIS; THROMBOPHLEBITIS AND THROMBOEMBOLISM,,,197,PERIPHERAL & OTHER VASCULAR DISORDERS,05,DISEASES AND DISORDERS OF THE CIRCULATORY SYSTEM,2,Moderate,Minor,Medical,Private Health Insurance,Medicaid,,,,true,18513.26,3517.14
Long Island,Suffolk,5123000,000885,Long Island Community Hospital,70 or Older,119,F,White,Not Span/Hispanic,6,Emergency,Skilled Nursing Home,2019,CIR033,ACUTE PHLEBITIS; THROMBOPHLEBITIS AND THROMBOEMBOLISM,,,197,PERIPHERAL & OTHER VASCULAR DISORDERS,05,DISEASES AND DISORDERS OF THE CIRCULATORY SYSTEM,2,Moderate,Moderate,Medical,Medicare,Medicare,,,,true,48222.66,9813.48
Long Island,Suffolk,5123000,000885,Long Island Community Hospital,50 to 69,117,F,Other Race,Not Span/Hispanic,5,Emergency,Home or Self Care,2019,CIR029,AORTIC; PERIPHERAL; AND VISCERAL ARTERY ANEURYSMS,SUD001,SUBSTANCE USE DETOXIFICATION,197,PERIPHERAL & OTHER VASCULAR DISORDERS,05,DISEASES AND DISORDERS OF THE CIRCULATORY SYSTEM,3,Major,Major,Medical,Self-Pay,,,,,true,96557.18,16944.95
Long Island,Suffolk,5123000,000885,Long Island Community Hospital,70 or Older,117,F,White,Not Span/Hispanic,1,Emergency,Expired,2019,CIR030,AORTIC AND PERIPHERAL ARTERIAL EMBOLISM OR THROMBOSIS,,,197,PERIPHERAL & OTHER VASCULAR DISORDERS,05,DISEASES AND DISORDERS OF THE CIRCULATORY SYSTEM,4,Extreme,Extreme,Medical,Medicare,,,,,true,31703.93,2124.01
Long Island,Suffolk,5123000,000885,Long Island Community Hospital,50 to 69,119,F,White,Not Span/Hispanic,6,Emergency,Home or Self Care,2019,CIR033,ACUTE PHLEBITIS; THROMBOPHLEBITIS AND THROMBOEMBOLISM,,,197,PERIPHERAL & OTHER VASCULAR DISORDERS,05,DISEASES AND DISORDERS OF THE CIRCULATORY SYSTEM,2,Moderate,Minor,Medical,Blue Cross/Blue Shield,,,,,true,33045.13,7663.94
Long Island,Suffolk,5123000,000885,Long Island Community Hospital,30 to 49,119,M,Black/African American,Not Span/Hispanic,1,Emergency,Short-term Hospital,2019,CIR035,VARICOSE VEINS OF LOWER EXTREMITY,ADM001,TRANSFUSION OF BLOOD AND BLOOD PRODUCTS,197,PERIPHERAL & OTHER VASCULAR DISORDERS,05,DISEASES AND DISORDERS OF THE CIRCULATORY SYSTEM,3,Major,Major,Medical,Medicaid,,,,,true,26065.83,3676.01
Long Island,Suffolk,5123000,000885,Long Island Community Hospital,30 to 49,119,M,White,Not Span/Hispanic,3,Emergency,Home or Self Care,2019,CIR039,OTHER SPECIFIED DISEASES OF VEINS AND LYMPHATICS,GIS001,ESOPHAGOGASTRODUODENOSCOPY (EGD) WITH BIOPSY,197,PERIPHERAL & OTHER VASCULAR DISORDERS,05,DISEASES AND DISORDERS OF THE CIRCULATORY SYSTEM,3,Major,Moderate,Medical,Private Health Insurance,Medicaid,,,,true,46809.68,8063.53
Long Island,Suffolk,5123000,000885,Long Island Community Hospital,70 or Older,117,M,White,Not Span/Hispanic,3,Emergency,Home or Self Care,2019,INJ037,"COMPLICATION OF OTHER SURGICAL OR MEDICAL CARE, INJURY, INITIAL ENCOUNTER",,,197,PERIPHERAL & OTHER VASCULAR DISORDERS,05,DISEASES AND DISORDERS OF THE CIRCULATORY SYSTEM,3,Major,Extreme,Medical,Medicare,Medicare,Blue Cross/Blue Shield,,,true,40598.33,6380.26
Long Island,Suffolk,5123000,000885,Long Island Community Hospital,70 or Older,117,F,White,Not Span/Hispanic,12,Emergency,Home w/ Home Health Services,2019,CIR033,ACUTE PHLEBITIS; THROMBOPHLEBITIS AND THROMBOEMBOLISM,CAR028,INFERIOR VENA CAVA (IVC) FILTER PROCEDURES,197,PERIPHERAL & OTHER VASCULAR DISORDERS,05,DISEASES AND DISORDERS OF THE CIRCULATORY SYSTEM,4,Extreme,Extreme,Medical,Medicare,Medicare,,,,true,123156.8,26152.44
Long Island,Suffolk,5123000,000885,Long Island Community Hospital,30 to 49,119,M,White,Not Span/Hispanic,15,Emergency,Home or Self Care,2019,CIR033,ACUTE PHLEBITIS; THROMBOPHLEBITIS AND THROMBOEMBOLISM,ESA004,NON-INVASIVE VENTILATION,197,PERIPHERAL & OTHER VASCULAR DISORDERS,05,DISEASES AND DISORDERS OF THE CIRCULATORY SYSTEM,2,Moderate,Minor,Medical,Private Health Insurance,,,,,true,101676.98,21031.19