Hospital Service Area,Hospital County,Operating Certificate Number,Permanent Facility Id,Facility Name,Age Group,Zip Code - 3 digits,Gender,Race,Ethnicity,Length of Stay,Type of Admission,Patient Disposition,Discharge Year,CCS Diagnosis Code,CCS Diagnosis Description,CCS Procedure Code,CCS Procedure Description,APR DRG Code,APR DRG Description,APR MDC Code,APR MDC Description,APR Severity of Illness Code,APR Severity of Illness Description,APR Risk of Mortality,APR Medical Surgical Description,Payment Typology 1,Payment Typology 2,Payment Typology 3,Birth Weight,Abortion Edit Indicator,Emergency Department Indicator,Total Charges,Total Costs
New York City,Bronx,7000006,001169,Montefiore Medical Center - Henry & Lucy Moses Div,70 or Older,104,F,Black/African American,Not Span/Hispanic,3,Emergency,Home or Self Care,2020,CIR033,ACUTE PHLEBITIS; THROMBOPHLEBITIS AND THROMBOEMBOLISM,,,197,PERIPHERAL & OTHER VASCULAR DISORDERS,05,DISEASES AND DISORDERS OF THE CIRCULATORY SYSTEM,2,Moderate,Minor,Medical,Medicare,Private Health Insurance,,,,Y,40049.88,7498.26
New York City,Bronx,7000006,003058,Montefiore Med Center - Jack D Weiler Hosp of A Einstein College Div,50 to 69,105,M,Other Race,Spanish/Hispanic,5,Emergency,Medicaid Cert Nursing Facility,2020,CIR036,POSTTHROMBOTIC SYNDROME AND VENOUS INSUFFICIENCY/HYPERTENSION,ADM017,ADMINISTRATION OF NUTRITIONAL AND ELECTROLYTIC SUBSTANCES,197,PERIPHERAL & OTHER VASCULAR DISORDERS,05,DISEASES AND DISORDERS OF THE CIRCULATORY SYSTEM,3,Major,Major,Medical,Medicare,Medicaid,,,,Y,57876.82,10156.69
New York City,Bronx,7000006,003058,Montefiore Med Center - Jack D Weiler Hosp of A Einstein College Div,18 to 29,104,F,Black/African American,Not Span/Hispanic,4,Emergency,Home or Self Care,2020,CIR033,ACUTE PHLEBITIS; THROMBOPHLEBITIS AND THROMBOEMBOLISM,OTR004,ISOLATION PROCEDURES,197,PERIPHERAL & OTHER VASCULAR DISORDERS,05,DISEASES AND DISORDERS OF THE CIRCULATORY SYSTEM,3,Major,Major,Medical,Medicaid,,,,,Y,45311.25,7624.6
New York City,Bronx,7000006,003058,Montefiore Med Center - Jack D Weiler Hosp of A Einstein College Div,50 to 69,104,F,White,Not Span/Hispanic,27,Emergency,Home or Self Care,2020,CIR035,VARICOSE VEINS OF LOWER EXTREMITY,ADM015,ADMINISTRATION OF ANTIBIOTICS,197,PERIPHERAL & OTHER VASCULAR DISORDERS,05,DISEASES AND DISORDERS OF THE CIRCULATORY SYSTEM,2,Moderate,Minor,Medical,Private Health Insurance,,,,,Y,258177.55,51181.29
New York City,Bronx,7000006,003058,Montefiore Med Center - Jack D Weiler Hosp of A Einstein College Div,70 or Older,104,F,Black/African American,Not Span/Hispanic,1,Emergency,Short-term Hospital,2020,CIR026,PERIPHERAL AND VISCERAL VASCULAR DISEASE,ADM001,TRANSFUSION OF BLOOD AND BLOOD PRODUCTS,197,PERIPHERAL & OTHER VASCULAR DISORDERS,05,DISEASES AND DISORDERS OF THE CIRCULATORY SYSTEM,2,Moderate,Moderate,Medical,Medicare,,,,,Y,31279.05,4566.38
New York City,Bronx,7000006,001168,Montefiore Medical Center-Wakefield Hospital,50 to 69,104,M,Black/African American,Not Span/Hispanic,2,Emergency,Home or Self Care,2020,CIR033,ACUTE PHLEBITIS; THROMBOPHLEBITIS AND THROMBOEMBOLISM,,,197,PERIPHERAL & OTHER VASCULAR DISORDERS,05,DISEASES AND DISORDERS OF THE CIRCULATORY SYSTEM,2,Moderate,Minor,Medical,Medicaid,,,,,Y,29488.11,5053.5
New York City,Bronx,7000006,001169,Montefiore Medical Center - Henry & Lucy Moses Div,70 or Older,104,F,Other Race,Spanish/Hispanic,5,Emergency,Home w/ Home Health Services,2020,CIR026,PERIPHERAL AND VISCERAL VASCULAR DISEASE,ADM021,"ADMINISTRATION OF THERAPEUTIC SUBSTANCES, NEC",197,PERIPHERAL & OTHER VASCULAR DISORDERS,05,DISEASES AND DISORDERS OF THE CIRCULATORY SYSTEM,3,Major,Moderate,Medical,Medicare,,,,,Y,49845.67,9741.05
New York City,Bronx,7000006,001169,Montefiore Medical Center - Henry & Lucy Moses Div,50 to 69,104,M,Black/African American,Not Span/Hispanic,2,Emergency,Home or Self Care,2020,CIR033,ACUTE PHLEBITIS; THROMBOPHLEBITIS AND THROMBOEMBOLISM,ADM021,"ADMINISTRATION OF THERAPEUTIC SUBSTANCES, NEC",197,PERIPHERAL & OTHER VASCULAR DISORDERS,05,DISEASES AND DISORDERS OF THE CIRCULATORY SYSTEM,3,Major,Major,Medical,Private Health Insurance,,,,,Y,24373.86,4150.6
New York City,Bronx,7000006,001169,Montefiore Medical Center - Henry & Lucy Moses Div,50 to 69,104,F,Black/African American,Not Span/Hispanic,2,Emergency,Home or Self Care,2020,CIR026,PERIPHERAL AND VISCERAL VASCULAR DISEASE,IMG008,ULTRASONOGRAPHY,197,PERIPHERAL & OTHER VASCULAR DISORDERS,05,DISEASES AND DISORDERS OF THE CIRCULATORY SYSTEM,1,Minor,Minor,Medical,Medicaid,,,,,Y,29355.49,4894.67
New York City,Bronx,7000006,001169,Montefiore Medical Center - Henry & Lucy Moses Div,70 or Older,104,M,Black/African American,Not Span/Hispanic,8,Emergency,Skilled Nursing Home,2020,END003,DIABETES MELLITUS WITH COMPLICATION,IMG008,ULTRASONOGRAPHY,197,PERIPHERAL & OTHER VASCULAR DISORDERS,05,DISEASES AND DISORDERS OF THE CIRCULATORY SYSTEM,2,Moderate,Moderate,Medical,Medicare,Medicaid,,,,Y,149489.98,28051.26
New York City,Bronx,7000006,001169,Montefiore Medical Center - Henry & Lucy Moses Div,50 to 69,104,F,Other Race,Not Span/Hispanic,4,Emergency,Home w/ Home Health Services,2020,CIR033,ACUTE PHLEBITIS; THROMBOPHLEBITIS AND THROMBOEMBOLISM,,,197,PERIPHERAL & OTHER VASCULAR DISORDERS,05,DISEASES AND DISORDERS OF THE CIRCULATORY SYSTEM,1,Minor,Moderate,Medical,Medicare,Private Health Insurance,,,,Y,73159.9,11354.51
New York City,Bronx,7000006,001168,Montefiore Medical Center-Wakefield Hospital,70 or Older,104,F,Other Race,Spanish/Hispanic,14,Emergency,Hospice - Medical Facility,2020,CIR026,PERIPHERAL AND VISCERAL VASCULAR DISEASE,ADM014,REGIONAL ANESTHESIA,197,PERIPHERAL & OTHER VASCULAR DISORDERS,05,DISEASES AND DISORDERS OF THE CIRCULATORY SYSTEM,2,Moderate,Major,Medical,Medicare,Medicaid,,,,Y,140797.12,27908.1
New York City,Bronx,7000006,001169,Montefiore Medical Center - Henry & Lucy Moses Div,50 to 69,104,M,Other Race,Spanish/Hispanic,2,Emergency,Home w/ Home Health Services,2020,END003,DIABETES MELLITUS WITH COMPLICATION,,,197,PERIPHERAL & OTHER VASCULAR DISORDERS,05,DISEASES AND DISORDERS OF THE CIRCULATORY SYSTEM,3,Major,Moderate,Medical,Private Health Insurance,,,,,Y,33038.63,5842.58
New York City,Bronx,7000006,001169,Montefiore Medical Center - Henry & Lucy Moses Div,70 or Older,104,M,Other Race,Spanish/Hispanic,1,Emergency,Home or Self Care,2020,CIR036,POSTTHROMBOTIC SYNDROME AND VENOUS INSUFFICIENCY/HYPERTENSION,ADM015,ADMINISTRATION OF ANTIBIOTICS,197,PERIPHERAL & OTHER VASCULAR DISORDERS,05,DISEASES AND DISORDERS OF THE CIRCULATORY SYSTEM,2,Moderate,Minor,Medical,Medicare,Medicaid,,,,Y,7896.31,1095.05
New York City,Bronx,7000006,001169,Montefiore Medical Center - Henry & Lucy Moses Div,70 or Older,104,F,Black/African American,Not Span/Hispanic,1,Emergency,Home or Self Care,2020,CIR033,ACUTE PHLEBITIS; THROMBOPHLEBITIS AND THROMBOEMBOLISM,ADM021,"ADMINISTRATION OF THERAPEUTIC SUBSTANCES, NEC",197,PERIPHERAL & OTHER VASCULAR DISORDERS,05,DISEASES AND DISORDERS OF THE CIRCULATORY SYSTEM,1,Minor,Minor,Medical,Medicare,Private Health Insurance,,,,Y,19961.7,3420.06
New York City,Bronx,7000006,003058,Montefiore Med Center - Jack D Weiler Hosp of A Einstein College Div,50 to 69,104,F,Black/African American,Not Span/Hispanic,9,Emergency,Home w/ Home Health Services,2020,CIR033,ACUTE PHLEBITIS; THROMBOPHLEBITIS AND THROMBOEMBOLISM,CAR028,INFERIOR VENA CAVA (IVC) FILTER PROCEDURES,197,PERIPHERAL & OTHER VASCULAR DISORDERS,05,DISEASES AND DISORDERS OF THE CIRCULATORY SYSTEM,3,Major,Major,Medical,Private Health Insurance,,,,,Y,124747.33,22297.72
New York City,Bronx,7000006,003058,Montefiore Med Center - Jack D Weiler Hosp of A Einstein College Div,70 or Older,104,F,White,Not Span/Hispanic,17,Emergency,Skilled Nursing Home,2020,CIR036,POSTTHROMBOTIC SYNDROME AND VENOUS INSUFFICIENCY/HYPERTENSION,ESA004,NON-INVASIVE VENTILATION,197,PERIPHERAL & OTHER VASCULAR DISORDERS,05,DISEASES AND DISORDERS OF THE CIRCULATORY SYSTEM,4,Extreme,Extreme,Medical,Medicare,Medicaid,,,,Y,215476.1,39296.26
New York City,Bronx,7000006,001168,Montefiore Medical Center-Wakefield Hospital,70 or Older,104,F,Black/African American,Not Span/Hispanic,8,Emergency,Skilled Nursing Home,2020,CIR033,ACUTE PHLEBITIS; THROMBOPHLEBITIS AND THROMBOEMBOLISM,IMG008,ULTRASONOGRAPHY,197,PERIPHERAL & OTHER VASCULAR DISORDERS,05,DISEASES AND DISORDERS OF THE CIRCULATORY SYSTEM,3,Major,Extreme,Medical,Medicare,,,,,Y,155508.51,27083.37
New York City,Bronx,7000006,003058,Montefiore Med Center - Jack D Weiler Hosp of A Einstein College Div,70 or Older,104,M,Black/African American,Not Span/Hispanic,3,Emergency,Home or Self Care,2020,CIR036,POSTTHROMBOTIC SYNDROME AND VENOUS INSUFFICIENCY/HYPERTENSION,IMG008,ULTRASONOGRAPHY,197,PERIPHERAL & OTHER VASCULAR DISORDERS,05,DISEASES AND DISORDERS OF THE CIRCULATORY SYSTEM,1,Minor,Minor,Medical,Medicare,,,,,Y,33345.53,5804.19
New York City,Manhattan,7002024,001456,Mount Sinai Hospital,70 or Older,104,F,Other Race,Spanish/Hispanic,6,Emergency,Skilled Nursing Home,2020,CIR033,ACUTE PHLEBITIS; THROMBOPHLEBITIS AND THROMBOEMBOLISM,GIS029,"LOWER GI THERAPEUTIC PROCEDURES, NEC (EXCLUDING OPEN AND LAPAROSCOPIC)",197,PERIPHERAL & OTHER VASCULAR DISORDERS,05,DISEASES AND DISORDERS OF THE CIRCULATORY SYSTEM,4,Extreme,Major,Medical,Medicare,Medicare,Medicaid,,,Y,79470.84,18810.4
New York City,Manhattan,7002024,001456,Mount Sinai Hospital,70 or Older,113,F,Other Race,Not Span/Hispanic,4,Urgent,Home w/ Home Health Services,2020,CIR033,ACUTE PHLEBITIS; THROMBOPHLEBITIS AND THROMBOEMBOLISM,ADM014,REGIONAL ANESTHESIA,197,PERIPHERAL & OTHER VASCULAR DISORDERS,05,DISEASES AND DISORDERS OF THE CIRCULATORY SYSTEM,2,Moderate,Minor,Medical,Medicare,Private Health Insurance,Self-Pay,,,N,43300.24,11736.2
New York City,Bronx,7000006,001169,Montefiore Medical Center - Henry & Lucy Moses Div,50 to 69,104,M,Other Race,Spanish/Hispanic,5,Emergency,Skilled Nursing Home,2020,END003,DIABETES MELLITUS WITH COMPLICATION,ADM021,"ADMINISTRATION OF THERAPEUTIC SUBSTANCES, NEC",197,PERIPHERAL & OTHER VASCULAR DISORDERS,05,DISEASES AND DISORDERS OF THE CIRCULATORY SYSTEM,2,Moderate,Minor,Medical,Medicare,Federal/State/Local/VA,,,,Y,65777.88,11849.7
New York City,Manhattan,7002024,001456,Mount Sinai Hospital,50 to 69,115,F,Other Race,Not Span/Hispanic,4,Urgent,Home w/ Home Health Services,2020,CIR033,ACUTE PHLEBITIS; THROMBOPHLEBITIS AND THROMBOEMBOLISM,IMG009,PLAIN RADIOGRAPHY,197,PERIPHERAL & OTHER VASCULAR DISORDERS,05,DISEASES AND DISORDERS OF THE CIRCULATORY SYSTEM,3,Major,Major,Medical,Medicare,Private Health Insurance,Self-Pay,,,N,51350.37,12967.51
New York City,Bronx,7000006,001169,Montefiore Medical Center - Henry & Lucy Moses Div,70 or Older,104,M,Black/African American,Unknown,2,Emergency,Home or Self Care,2020,CIR036,POSTTHROMBOTIC SYNDROME AND VENOUS INSUFFICIENCY/HYPERTENSION,ADM017,ADMINISTRATION OF NUTRITIONAL AND ELECTROLYTIC SUBSTANCES,197,PERIPHERAL & OTHER VASCULAR DISORDERS,05,DISEASES AND DISORDERS OF THE CIRCULATORY SYSTEM,1,Minor,Moderate,Medical,Medicare,,,,,Y,33182.35,5760.9
New York City,Bronx,7000006,003058,Montefiore Med Center - Jack D Weiler Hosp of A Einstein College Div,50 to 69,104,M,Other Race,Spanish/Hispanic,8,Emergency,Home or Self Care,2020,CIR033,ACUTE PHLEBITIS; THROMBOPHLEBITIS AND THROMBOEMBOLISM,IMG008,ULTRASONOGRAPHY,197,PERIPHERAL & OTHER VASCULAR DISORDERS,05,DISEASES AND DISORDERS OF THE CIRCULATORY SYSTEM,3,Major,Major,Medical,Private Health Insurance,,,,,Y,117777.39,23845.08
New York City,Bronx,7000006,001169,Montefiore Medical Center - Henry & Lucy Moses Div,50 to 69,104,M,Black/African American,Not Span/Hispanic,1,Emergency,Left Against Medical Advice,2020,CIR028,GANGRENE,,,197,PERIPHERAL & OTHER VASCULAR DISORDERS,05,DISEASES AND DISORDERS OF THE CIRCULATORY SYSTEM,2,Moderate,Moderate,Medical,Medicare,Medicaid,,,,N,9844,2068.74
New York City,Bronx,7000006,001168,Montefiore Medical Center-Wakefield Hospital,70 or Older,104,M,Black/African American,Not Span/Hispanic,1,Emergency,Home or Self Care,2020,CIR029,AORTIC; PERIPHERAL; AND VISCERAL ARTERY ANEURYSMS,,,197,PERIPHERAL & OTHER VASCULAR DISORDERS,05,DISEASES AND DISORDERS OF THE CIRCULATORY SYSTEM,2,Moderate,Moderate,Medical,Medicare,,,,,Y,31666.85,3876.05
New York City,Kings,7002002,001324,Mount Sinai Brooklyn,70 or Older,112,M,White,Not Span/Hispanic,4,Emergency,Home w/ Home Health Services,2020,END003,DIABETES MELLITUS WITH COMPLICATION,ADM015,ADMINISTRATION OF ANTIBIOTICS,197,PERIPHERAL & OTHER VASCULAR DISORDERS,05,DISEASES AND DISORDERS OF THE CIRCULATORY SYSTEM,2,Moderate,Major,Medical,Medicare,Medicaid,Self-Pay,,,Y,45973.08,7272.68
New York City,Kings,7002002,001324,Mount Sinai Brooklyn,50 to 69,112,M,Black/African American,Not Span/Hispanic,3,Emergency,Home or Self Care,2020,CIR033,ACUTE PHLEBITIS; THROMBOPHLEBITIS AND THROMBOEMBOLISM,,,197,PERIPHERAL & OTHER VASCULAR DISORDERS,05,DISEASES AND DISORDERS OF THE CIRCULATORY SYSTEM,3,Major,Major,Medical,Private Health Insurance,Medicaid,Self-Pay,,,Y,36421.16,4606.77
New York City,Kings,7002002,001324,Mount Sinai Brooklyn,70 or Older,112,M,White,Not Span/Hispanic,6,Emergency,Home w/ Home Health Services,2020,CIR033,ACUTE PHLEBITIS; THROMBOPHLEBITIS AND THROMBOEMBOLISM,IMG008,ULTRASONOGRAPHY,197,PERIPHERAL & OTHER VASCULAR DISORDERS,05,DISEASES AND DISORDERS OF THE CIRCULATORY SYSTEM,2,Moderate,Moderate,Medical,Medicare,Medicaid,Self-Pay,,,Y,65320.62,8830.18
New York City,Kings,7002002,001324,Mount Sinai Brooklyn,70 or Older,112,F,Black/African American,Not Span/Hispanic,6,Emergency,Home or Self Care,2020,CIR033,ACUTE PHLEBITIS; THROMBOPHLEBITIS AND THROMBOEMBOLISM,,,197,PERIPHERAL & OTHER VASCULAR DISORDERS,05,DISEASES AND DISORDERS OF THE CIRCULATORY SYSTEM,1,Minor,Minor,Medical,Medicare,Private Health Insurance,Self-Pay,,,Y,67176.7,10885.69
New York City,Manhattan,7002032,001469,Mount Sinai Morningside,30 to 49,100,F,Other Race,Spanish/Hispanic,1,Emergency,Home or Self Care,2020,CIR033,ACUTE PHLEBITIS; THROMBOPHLEBITIS AND THROMBOEMBOLISM,ADM021,"ADMINISTRATION OF THERAPEUTIC SUBSTANCES, NEC",197,PERIPHERAL & OTHER VASCULAR DISORDERS,05,DISEASES AND DISORDERS OF THE CIRCULATORY SYSTEM,2,Moderate,Moderate,Medical,Medicaid,Medicaid,Self-Pay,,,Y,24714.66,5018.94
New York City,Kings,7002002,001324,Mount Sinai Brooklyn,70 or Older,112,F,Black/African American,Not Span/Hispanic,3,Emergency,Home w/ Home Health Services,2020,CIR033,ACUTE PHLEBITIS; THROMBOPHLEBITIS AND THROMBOEMBOLISM,IMG008,ULTRASONOGRAPHY,197,PERIPHERAL & OTHER VASCULAR DISORDERS,05,DISEASES AND DISORDERS OF THE CIRCULATORY SYSTEM,2,Moderate,Moderate,Medical,Medicare,Medicaid,Self-Pay,,,Y,40215.94,5840.33
New York City,Manhattan,7002032,001469,Mount Sinai Morningside,30 to 49,112,M,Black/African American,Not Span/Hispanic,1,Emergency,Home or Self Care,2020,CIR027,ARTERIAL DISSECTIONS,IMG008,ULTRASONOGRAPHY,197,PERIPHERAL & OTHER VASCULAR DISORDERS,05,DISEASES AND DISORDERS OF THE CIRCULATORY SYSTEM,3,Major,Major,Medical,Medicaid,Medicaid,Self-Pay,,,N,25619.4,5877.56
New York City,Manhattan,7002032,001469,Mount Sinai Morningside,30 to 49,100,F,Other Race,Not Span/Hispanic,4,Urgent,Home or Self Care,2020,CIR033,ACUTE PHLEBITIS; THROMBOPHLEBITIS AND THROMBOEMBOLISM,ADM015,ADMINISTRATION OF ANTIBIOTICS,197,PERIPHERAL & OTHER VASCULAR DISORDERS,05,DISEASES AND DISORDERS OF THE CIRCULATORY SYSTEM,2,Moderate,Minor,Medical,Medicaid,Medicaid,Self-Pay,,,N,39214.85,8388.63
New York City,Kings,7002002,001324,Mount Sinai Brooklyn,70 or Older,112,F,Black/African American,Unknown,21,Emergency,Home w/ Home Health Services,2020,CIR033,ACUTE PHLEBITIS; THROMBOPHLEBITIS AND THROMBOEMBOLISM,ADM001,TRANSFUSION OF BLOOD AND BLOOD PRODUCTS,197,PERIPHERAL & OTHER VASCULAR DISORDERS,05,DISEASES AND DISORDERS OF THE CIRCULATORY SYSTEM,3,Major,Major,Medical,Medicare,Medicaid,Self-Pay,,,Y,247416.85,43069.66
New York City,Manhattan,7002032,001469,Mount Sinai Morningside,50 to 69,100,F,Black/African American,Not Span/Hispanic,4,Emergency,Home w/ Home Health Services,2020,CIR033,ACUTE PHLEBITIS; THROMBOPHLEBITIS AND THROMBOEMBOLISM,IMG008,ULTRASONOGRAPHY,197,PERIPHERAL & OTHER VASCULAR DISORDERS,05,DISEASES AND DISORDERS OF THE CIRCULATORY SYSTEM,3,Major,Major,Medical,Medicare,Medicare,Medicaid,,,Y,51196.4,10938.58
New York City,Manhattan,7002032,001469,Mount Sinai Morningside,50 to 69,104,M,Black/African American,Not Span/Hispanic,6,Urgent,Inpatient Rehabilitation Facility,2020,INJ037,"COMPLICATION OF OTHER SURGICAL OR MEDICAL CARE, INJURY, INITIAL ENCOUNTER",IMG008,ULTRASONOGRAPHY,197,PERIPHERAL & OTHER VASCULAR DISORDERS,05,DISEASES AND DISORDERS OF THE CIRCULATORY SYSTEM,4,Extreme,Extreme,Medical,Blue Cross/Blue Shield,Medicare,Self-Pay,,,N,88771.16,19973.02
New York City,Bronx,7000006,001169,Montefiore Medical Center - Henry & Lucy Moses Div,70 or Older,104,F,Other Race,Spanish/Hispanic,1,Emergency,Expired,2020,CIR027,ARTERIAL DISSECTIONS,,,197,PERIPHERAL & OTHER VASCULAR DISORDERS,05,DISEASES AND DISORDERS OF THE CIRCULATORY SYSTEM,4,Extreme,Extreme,Medical,Medicare,Medicaid,,,,Y,52429.32,5294.63
New York City,Manhattan,7002032,001466,Mount Sinai West,50 to 69,112,M,White,Not Span/Hispanic,1,Emergency,Home or Self Care,2020,CIR033,ACUTE PHLEBITIS; THROMBOPHLEBITIS AND THROMBOEMBOLISM,IMG008,ULTRASONOGRAPHY,197,PERIPHERAL & OTHER VASCULAR DISORDERS,05,DISEASES AND DISORDERS OF THE CIRCULATORY SYSTEM,3,Major,Major,Medical,Blue Cross/Blue Shield,Self-Pay,,,,Y,22193.5,4861.23
New York City,Manhattan,7002032,001466,Mount Sinai West,50 to 69,100,M,Black/African American,Not Span/Hispanic,4,Emergency,Skilled Nursing Home,2020,CIR033,ACUTE PHLEBITIS; THROMBOPHLEBITIS AND THROMBOEMBOLISM,IMG008,ULTRASONOGRAPHY,197,PERIPHERAL & OTHER VASCULAR DISORDERS,05,DISEASES AND DISORDERS OF THE CIRCULATORY SYSTEM,4,Extreme,Extreme,Medical,Medicare,Medicaid,Self-Pay,,,Y,58963.78,12858.68
New York City,Manhattan,7002032,001466,Mount Sinai West,50 to 69,100,M,Black/African American,Not Span/Hispanic,4,Emergency,Home w/ Home Health Services,2020,CIR036,POSTTHROMBOTIC SYNDROME AND VENOUS INSUFFICIENCY/HYPERTENSION,ADM021,"ADMINISTRATION OF THERAPEUTIC SUBSTANCES, NEC",197,PERIPHERAL & OTHER VASCULAR DISORDERS,05,DISEASES AND DISORDERS OF THE CIRCULATORY SYSTEM,1,Minor,Moderate,Medical,Medicaid,Medicaid,Self-Pay,,,Y,48903.05,10940.14
New York City,Manhattan,7002032,001466,Mount Sinai West,30 to 49,100,M,Other Race,Spanish/Hispanic,3,Emergency,Home or Self Care,2020,CIR033,ACUTE PHLEBITIS; THROMBOPHLEBITIS AND THROMBOEMBOLISM,ADM021,"ADMINISTRATION OF THERAPEUTIC SUBSTANCES, NEC",197,PERIPHERAL & OTHER VASCULAR DISORDERS,05,DISEASES AND DISORDERS OF THE CIRCULATORY SYSTEM,2,Moderate,Minor,Medical,Blue Cross/Blue Shield,Self-Pay,,,,Y,35620.1,7651.15
New York City,Manhattan,7002032,001466,Mount Sinai West,30 to 49,104,F,Black/African American,Not Span/Hispanic,2,Emergency,Home or Self Care,2020,CIR033,ACUTE PHLEBITIS; THROMBOPHLEBITIS AND THROMBOEMBOLISM,IMG008,ULTRASONOGRAPHY,197,PERIPHERAL & OTHER VASCULAR DISORDERS,05,DISEASES AND DISORDERS OF THE CIRCULATORY SYSTEM,4,Extreme,Extreme,Medical,Blue Cross/Blue Shield,Self-Pay,,,,Y,34061.24,7880.48
New York City,Manhattan,7002032,001466,Mount Sinai West,50 to 69,104,F,Black/African American,Not Span/Hispanic,1,Emergency,Home or Self Care,2020,CIR033,ACUTE PHLEBITIS; THROMBOPHLEBITIS AND THROMBOEMBOLISM,IMG008,ULTRASONOGRAPHY,197,PERIPHERAL & OTHER VASCULAR DISORDERS,05,DISEASES AND DISORDERS OF THE CIRCULATORY SYSTEM,2,Moderate,Moderate,Medical,Private Health Insurance,Self-Pay,,,,Y,14020.42,2900.01
New York City,Manhattan,7002032,001466,Mount Sinai West,70 or Older,OOS,M,White,Not Span/Hispanic,1,Elective,Home or Self Care,2020,CIR034,CHRONIC PHLEBITIS; THROMBOPHLEBITIS AND THROMBOEMBOLISM,IMG002,FLUOROSCOPIC ANGIOGRAPHY (EXCLUDING CORONARY),197,PERIPHERAL & OTHER VASCULAR DISORDERS,05,DISEASES AND DISORDERS OF THE CIRCULATORY SYSTEM,1,Minor,Minor,Medical,Medicare,Medicare,Self-Pay,,,N,35842.77,8357.15
New York City,Manhattan,7002002,001439,Mount Sinai Beth Israel,50 to 69,100,M,Other Race,Spanish/Hispanic,10,Emergency,Skilled Nursing Home,2020,CIR033,ACUTE PHLEBITIS; THROMBOPHLEBITIS AND THROMBOEMBOLISM,MST001,ARTHROCENTESIS,197,PERIPHERAL & OTHER VASCULAR DISORDERS,05,DISEASES AND DISORDERS OF THE CIRCULATORY SYSTEM,2,Moderate,Major,Medical,Medicare,Miscellaneous/Other,Self-Pay,,,Y,110104.52,25293.44
New York City,Bronx,7000006,003058,Montefiore Med Center - Jack D Weiler Hosp of A Einstein College Div,50 to 69,104,M,Black/African American,Not Span/Hispanic,1,Emergency,Home or Self Care,2020,CIR026,PERIPHERAL AND VISCERAL VASCULAR DISEASE,IMG008,ULTRASONOGRAPHY,197,PERIPHERAL & OTHER VASCULAR DISORDERS,05,DISEASES AND DISORDERS OF THE CIRCULATORY SYSTEM,3,Major,Major,Medical,Medicaid,,,,,Y,33261.46,4066.07
Hudson Valley,Westchester,5901000,001039,NewYork-Presbyterian/Hudson Valley Hospital,50 to 69,105,F,Other Race,Spanish/Hispanic,2,Emergency,Home or Self Care,2020,CIR036,POSTTHROMBOTIC SYNDROME AND VENOUS INSUFFICIENCY/HYPERTENSION,ADM015,ADMINISTRATION OF ANTIBIOTICS,197,PERIPHERAL & OTHER VASCULAR DISORDERS,05,DISEASES AND DISORDERS OF THE CIRCULATORY SYSTEM,3,Major,Minor,Medical,Medicaid,,,,,Y,18602.37,5618.1
New York City,Bronx,7000006,001169,Montefiore Medical Center - Henry & Lucy Moses Div,70 or Older,104,F,Other Race,Spanish/Hispanic,1,Emergency,Home or Self Care,2020,CIR033,ACUTE PHLEBITIS; THROMBOPHLEBITIS AND THROMBOEMBOLISM,,,197,PERIPHERAL & OTHER VASCULAR DISORDERS,05,DISEASES AND DISORDERS OF THE CIRCULATORY SYSTEM,1,Minor,Minor,Medical,Medicare,Medicaid,,,,Y,18030.04,2899.76
Hudson Valley,Westchester,5901000,001039,NewYork-Presbyterian/Hudson Valley Hospital,50 to 69,105,M,White,Not Span/Hispanic,1,Emergency,Short-term Hospital,2020,CIR033,ACUTE PHLEBITIS; THROMBOPHLEBITIS AND THROMBOEMBOLISM,ADM021,"ADMINISTRATION OF THERAPEUTIC SUBSTANCES, NEC",197,PERIPHERAL & OTHER VASCULAR DISORDERS,05,DISEASES AND DISORDERS OF THE CIRCULATORY SYSTEM,1,Minor,Minor,Medical,Medicare,Blue Cross/Blue Shield,,,,Y,11807.98,3123.56
New York City,Manhattan,7002024,001456,Mount Sinai Hospital,30 to 49,100,M,Other Race,Not Span/Hispanic,3,Emergency,Home or Self Care,2020,CIR027,ARTERIAL DISSECTIONS,CAR024,VENOUS AND ARTERIAL CATHETER PLACEMENT,197,PERIPHERAL & OTHER VASCULAR DISORDERS,05,DISEASES AND DISORDERS OF THE CIRCULATORY SYSTEM,3,Major,Moderate,Medical,Private Health Insurance,Self-Pay,,,,Y,89987.92,21895.75
New York City,Bronx,7000006,001169,Montefiore Medical Center - Henry & Lucy Moses Div,70 or Older,104,F,Other Race,Unknown,2,Emergency,Home or Self Care,2020,CIR033,ACUTE PHLEBITIS; THROMBOPHLEBITIS AND THROMBOEMBOLISM,,,197,PERIPHERAL & OTHER VASCULAR DISORDERS,05,DISEASES AND DISORDERS OF THE CIRCULATORY SYSTEM,3,Major,Major,Medical,Medicare,Private Health Insurance,,,,Y,39679.37,6534.64
New York City,Bronx,7000006,001169,Montefiore Medical Center - Henry & Lucy Moses Div,70 or Older,104,F,Other Race,Not Span/Hispanic,1,Emergency,Home or Self Care,2020,CIR033,ACUTE PHLEBITIS; THROMBOPHLEBITIS AND THROMBOEMBOLISM,,,197,PERIPHERAL & OTHER VASCULAR DISORDERS,05,DISEASES AND DISORDERS OF THE CIRCULATORY SYSTEM,1,Minor,Moderate,Medical,Medicare,,,,,Y,18905.72,3409.64
New York City,Bronx,7000006,001169,Montefiore Medical Center - Henry & Lucy Moses Div,70 or Older,113,F,Other Race,Unknown,5,Emergency,Skilled Nursing Home,2020,CIR033,ACUTE PHLEBITIS; THROMBOPHLEBITIS AND THROMBOEMBOLISM,,,197,PERIPHERAL & OTHER VASCULAR DISORDERS,05,DISEASES AND DISORDERS OF THE CIRCULATORY SYSTEM,3,Major,Extreme,Medical,Medicare,,,,,Y,88575.17,13573.89
New York City,Manhattan,7002024,001456,Mount Sinai Hospital,50 to 69,109,M,White,Not Span/Hispanic,2,Emergency,Home or Self Care,2020,END003,DIABETES MELLITUS WITH COMPLICATION,,,197,PERIPHERAL & OTHER VASCULAR DISORDERS,05,DISEASES AND DISORDERS OF THE CIRCULATORY SYSTEM,2,Moderate,Major,Medical,Medicaid,Medicaid,Self-Pay,,,Y,36809.1,9639.13