Hospital Service Area,Hospital County,Operating Certificate Number,Permanent Facility Id,Facility Name,Age Group,Zip Code - 3 digits,Gender,Race,Ethnicity,Length of Stay,Type of Admission,Patient Disposition,Discharge Year,CCS Diagnosis Code,CCS Diagnosis Description,CCS Procedure Code,CCS Procedure Description,APR DRG Code,APR DRG Description,APR MDC Code,APR MDC Description,APR Severity of Illness Code,APR Severity of Illness Description,APR Risk of Mortality,APR Medical Surgical Description,Payment Typology 1,Payment Typology 2,Payment Typology 3,Birth Weight,Abortion Edit Indicator,Emergency Department Indicator,Total Charges,Total Costs
New York City,Manhattan,7002001,001438,Bellevue Hospital Center,50 to 69,100,M,Other Race,Spanish/Hispanic,3,Emergency,Left Against Medical Advice,2020,CIR026,PERIPHERAL AND VISCERAL VASCULAR DISEASE,ADM010,VACCINATIONS,197,PERIPHERAL & OTHER VASCULAR DISORDERS,05,DISEASES AND DISORDERS OF THE CIRCULATORY SYSTEM,3,Major,Major,Medical,Medicare,,,,,Y,20441.79,11755.75
New York City,Manhattan,7002001,001438,Bellevue Hospital Center,50 to 69,111,F,Other Race,Spanish/Hispanic,3,Emergency,Home or Self Care,2020,END003,DIABETES MELLITUS WITH COMPLICATION,ADM001,TRANSFUSION OF BLOOD AND BLOOD PRODUCTS,197,PERIPHERAL & OTHER VASCULAR DISORDERS,05,DISEASES AND DISORDERS OF THE CIRCULATORY SYSTEM,3,Major,Major,Medical,Self-Pay,,,,,Y,27509.1,15820.04
New York City,Manhattan,7002001,001438,Bellevue Hospital Center,30 to 49,112,F,White,Not Span/Hispanic,1,Emergency,Home or Self Care,2020,CIR033,ACUTE PHLEBITIS; THROMBOPHLEBITIS AND THROMBOEMBOLISM,IMG008,ULTRASONOGRAPHY,197,PERIPHERAL & OTHER VASCULAR DISORDERS,05,DISEASES AND DISORDERS OF THE CIRCULATORY SYSTEM,1,Minor,Minor,Medical,Medicaid,,,,,Y,9978.73,5738.61
New York City,Manhattan,7002001,001438,Bellevue Hospital Center,50 to 69,112,M,Other Race,Spanish/Hispanic,2,Emergency,Home or Self Care,2020,CIR033,ACUTE PHLEBITIS; THROMBOPHLEBITIS AND THROMBOEMBOLISM,ADM015,ADMINISTRATION OF ANTIBIOTICS,197,PERIPHERAL & OTHER VASCULAR DISORDERS,05,DISEASES AND DISORDERS OF THE CIRCULATORY SYSTEM,2,Moderate,Moderate,Medical,Medicare,,,,,Y,20565.2,11826.72
New York City,Manhattan,7002001,001438,Bellevue Hospital Center,70 or Older,104,F,Black/African American,Not Span/Hispanic,7,Emergency,Home or Self Care,2020,CIR036,POSTTHROMBOTIC SYNDROME AND VENOUS INSUFFICIENCY/HYPERTENSION,ADM015,ADMINISTRATION OF ANTIBIOTICS,197,PERIPHERAL & OTHER VASCULAR DISORDERS,05,DISEASES AND DISORDERS OF THE CIRCULATORY SYSTEM,1,Minor,Minor,Medical,Medicare,,,,,Y,50010.3,28760.12
New York City,Manhattan,7002001,001438,Bellevue Hospital Center,70 or Older,104,F,Other Race,Spanish/Hispanic,22,Emergency,Skilled Nursing Home,2020,CIR035,VARICOSE VEINS OF LOWER EXTREMITY,ADM015,ADMINISTRATION OF ANTIBIOTICS,197,PERIPHERAL & OTHER VASCULAR DISORDERS,05,DISEASES AND DISORDERS OF THE CIRCULATORY SYSTEM,2,Moderate,Moderate,Medical,Medicare,,,,,Y,148192.8,85223.31
New York City,Manhattan,7002001,001438,Bellevue Hospital Center,70 or Older,100,F,Black/African American,Not Span/Hispanic,6,Urgent,Home or Self Care,2020,CIR029,AORTIC; PERIPHERAL; AND VISCERAL ARTERY ANEURYSMS,IMG009,PLAIN RADIOGRAPHY,197,PERIPHERAL & OTHER VASCULAR DISORDERS,05,DISEASES AND DISORDERS OF THE CIRCULATORY SYSTEM,2,Moderate,Moderate,Medical,Medicare,Medicaid,,,,N,49490.06,28460.94
New York City,Manhattan,7002001,001438,Bellevue Hospital Center,30 to 49,104,M,White,Not Span/Hispanic,5,Urgent,Home or Self Care,2020,CIR032,OTHER SPECIFIED AND UNSPECIFIED CIRCULATORY DISEASE,IMG008,ULTRASONOGRAPHY,197,PERIPHERAL & OTHER VASCULAR DISORDERS,05,DISEASES AND DISORDERS OF THE CIRCULATORY SYSTEM,2,Moderate,Minor,Medical,Private Health Insurance,,,,,N,38238.55,21990.38
New York City,Manhattan,7002001,001438,Bellevue Hospital Center,50 to 69,112,M,Other Race,Spanish/Hispanic,1,Emergency,Home or Self Care,2020,END003,DIABETES MELLITUS WITH COMPLICATION,ADM015,ADMINISTRATION OF ANTIBIOTICS,197,PERIPHERAL & OTHER VASCULAR DISORDERS,05,DISEASES AND DISORDERS OF THE CIRCULATORY SYSTEM,2,Moderate,Minor,Medical,Medicaid,,,,,Y,7938.64,4565.38
New York City,Manhattan,7002001,001438,Bellevue Hospital Center,30 to 49,100,F,White,Spanish/Hispanic,9,Emergency,Home or Self Care,2020,CIR034,CHRONIC PHLEBITIS; THROMBOPHLEBITIS AND THROMBOEMBOLISM,CAR021,"ARTERY, VEIN, AND GREAT VESSEL PROCEDURES, NEC",197,PERIPHERAL & OTHER VASCULAR DISORDERS,05,DISEASES AND DISORDERS OF THE CIRCULATORY SYSTEM,2,Moderate,Minor,Medical,Medicaid,,,,,Y,71712.13,41240.5
New York City,Manhattan,7002001,001438,Bellevue Hospital Center,50 to 69,104,F,White,Spanish/Hispanic,5,Emergency,Home or Self Care,2020,END003,DIABETES MELLITUS WITH COMPLICATION,MST020,SUBCUTANEOUS TISSUE AND FASCIA EXCISION,197,PERIPHERAL & OTHER VASCULAR DISORDERS,05,DISEASES AND DISORDERS OF THE CIRCULATORY SYSTEM,2,Moderate,Moderate,Medical,Medicare,Medicaid,,,,Y,40480.75,23279.83
New York City,Manhattan,7002001,001438,Bellevue Hospital Center,70 or Older,104,F,Other Race,Spanish/Hispanic,5,Urgent,Home w/ Home Health Services,2020,CIR027,ARTERIAL DISSECTIONS,ADM016,ADMINISTRATION OF ANTI-INFLAMMATORY AGENTS,197,PERIPHERAL & OTHER VASCULAR DISORDERS,05,DISEASES AND DISORDERS OF THE CIRCULATORY SYSTEM,2,Moderate,Major,Medical,Medicare,Medicaid,,,,N,53533.73,30786.39
New York City,Manhattan,7002001,001438,Bellevue Hospital Center,70 or Older,100,M,Multi-racial,Unknown,3,Emergency,Home or Self Care,2020,CIR026,PERIPHERAL AND VISCERAL VASCULAR DISEASE,IMG006,COMPUTERIZED TOMOGRAPHY (CT) WITH CONTRAST,197,PERIPHERAL & OTHER VASCULAR DISORDERS,05,DISEASES AND DISORDERS OF THE CIRCULATORY SYSTEM,2,Moderate,Major,Medical,Medicare,Medicaid,,,,Y,27841.1,16010.97
New York City,Manhattan,7002001,001438,Bellevue Hospital Center,70 or Older,100,M,Other Race,Spanish/Hispanic,10,Emergency,Home or Self Care,2020,END003,DIABETES MELLITUS WITH COMPLICATION,ESA001,HEMODIALYSIS,197,PERIPHERAL & OTHER VASCULAR DISORDERS,05,DISEASES AND DISORDERS OF THE CIRCULATORY SYSTEM,3,Major,Major,Medical,Medicare,Medicaid,,,,Y,65294.68,37549.93
New York City,Manhattan,7002001,001438,Bellevue Hospital Center,70 or Older,112,M,Black/African American,Not Span/Hispanic,4,Urgent,Home w/ Home Health Services,2020,CIR029,AORTIC; PERIPHERAL; AND VISCERAL ARTERY ANEURYSMS,,,197,PERIPHERAL & OTHER VASCULAR DISORDERS,05,DISEASES AND DISORDERS OF THE CIRCULATORY SYSTEM,2,Moderate,Moderate,Medical,Medicare,,,,,N,30319.95,17436.52
New York City,Manhattan,7002001,001438,Bellevue Hospital Center,50 to 69,100,M,Other Race,Unknown,3,Emergency,Home or Self Care,2020,END003,DIABETES MELLITUS WITH COMPLICATION,IMG009,PLAIN RADIOGRAPHY,197,PERIPHERAL & OTHER VASCULAR DISORDERS,05,DISEASES AND DISORDERS OF THE CIRCULATORY SYSTEM,2,Moderate,Minor,Medical,Self-Pay,,,,,Y,40986.07,23570.43
New York City,Manhattan,7002001,001438,Bellevue Hospital Center,30 to 49,100,M,Other Race,Unknown,2,Emergency,Home or Self Care,2020,CIR033,ACUTE PHLEBITIS; THROMBOPHLEBITIS AND THROMBOEMBOLISM,IMG009,PLAIN RADIOGRAPHY,197,PERIPHERAL & OTHER VASCULAR DISORDERS,05,DISEASES AND DISORDERS OF THE CIRCULATORY SYSTEM,2,Moderate,Moderate,Medical,Medicaid,,,,,Y,15727.37,9044.56
New York City,Manhattan,7002001,001438,Bellevue Hospital Center,50 to 69,112,M,White,Not Span/Hispanic,1,Emergency,Home or Self Care,2020,CIR036,POSTTHROMBOTIC SYNDROME AND VENOUS INSUFFICIENCY/HYPERTENSION,IMG009,PLAIN RADIOGRAPHY,197,PERIPHERAL & OTHER VASCULAR DISORDERS,05,DISEASES AND DISORDERS OF THE CIRCULATORY SYSTEM,2,Moderate,Minor,Medical,Medicaid,,,,,Y,8302.66,4774.73
New York City,Manhattan,7002001,001438,Bellevue Hospital Center,70 or Older,112,M,Black/African American,Not Span/Hispanic,1,Emergency,Home or Self Care,2020,CIR027,ARTERIAL DISSECTIONS,,,197,PERIPHERAL & OTHER VASCULAR DISORDERS,05,DISEASES AND DISORDERS OF THE CIRCULATORY SYSTEM,2,Moderate,Major,Medical,Medicare,,,,,Y,8780.45,5049.5
New York City,Manhattan,7002001,001438,Bellevue Hospital Center,50 to 69,113,M,Other Race,Spanish/Hispanic,5,Emergency,Home or Self Care,2020,CIR033,ACUTE PHLEBITIS; THROMBOPHLEBITIS AND THROMBOEMBOLISM,IMG006,COMPUTERIZED TOMOGRAPHY (CT) WITH CONTRAST,197,PERIPHERAL & OTHER VASCULAR DISORDERS,05,DISEASES AND DISORDERS OF THE CIRCULATORY SYSTEM,2,Moderate,Minor,Medical,Medicaid,,,,,Y,39682.95,22821.03
New York City,Manhattan,7002001,001438,Bellevue Hospital Center,50 to 69,112,F,Other Race,Unknown,2,Urgent,Home or Self Care,2020,CIR033,ACUTE PHLEBITIS; THROMBOPHLEBITIS AND THROMBOEMBOLISM,ADM021,"ADMINISTRATION OF THERAPEUTIC SUBSTANCES, NEC",197,PERIPHERAL & OTHER VASCULAR DISORDERS,05,DISEASES AND DISORDERS OF THE CIRCULATORY SYSTEM,2,Moderate,Minor,Medical,Medicaid,,,,,N,12643.82,7271.26
New York City,Manhattan,7002001,001438,Bellevue Hospital Center,50 to 69,112,F,Other Race,Not Span/Hispanic,2,Emergency,Home or Self Care,2020,CIR029,AORTIC; PERIPHERAL; AND VISCERAL ARTERY ANEURYSMS,IMG008,ULTRASONOGRAPHY,197,PERIPHERAL & OTHER VASCULAR DISORDERS,05,DISEASES AND DISORDERS OF THE CIRCULATORY SYSTEM,1,Minor,Minor,Medical,Medicaid,,,,,Y,18382.69,10571.59
New York City,Manhattan,7002001,001438,Bellevue Hospital Center,70 or Older,112,F,White,Unknown,7,Emergency,Home or Self Care,2020,CIR033,ACUTE PHLEBITIS; THROMBOPHLEBITIS AND THROMBOEMBOLISM,ADM021,"ADMINISTRATION OF THERAPEUTIC SUBSTANCES, NEC",197,PERIPHERAL & OTHER VASCULAR DISORDERS,05,DISEASES AND DISORDERS OF THE CIRCULATORY SYSTEM,2,Moderate,Minor,Medical,Medicaid,,,,,Y,57144.45,32862.86
New York City,Manhattan,7002001,001438,Bellevue Hospital Center,70 or Older,100,F,Other Race,Spanish/Hispanic,2,Emergency,Home w/ Home Health Services,2020,END003,DIABETES MELLITUS WITH COMPLICATION,ADM021,"ADMINISTRATION OF THERAPEUTIC SUBSTANCES, NEC",197,PERIPHERAL & OTHER VASCULAR DISORDERS,05,DISEASES AND DISORDERS OF THE CIRCULATORY SYSTEM,2,Moderate,Minor,Medical,Medicare,Medicaid,,,,Y,18516.4,10648.49
New York City,Manhattan,7002001,001438,Bellevue Hospital Center,50 to 69,104,F,Other Race,Spanish/Hispanic,5,Urgent,Home or Self Care,2020,CIR027,ARTERIAL DISSECTIONS,ADM021,"ADMINISTRATION OF THERAPEUTIC SUBSTANCES, NEC",197,PERIPHERAL & OTHER VASCULAR DISORDERS,05,DISEASES AND DISORDERS OF THE CIRCULATORY SYSTEM,3,Major,Major,Medical,Medicare,Medicaid,,,,N,59633.68,34294.38
New York City,Manhattan,7002001,001438,Bellevue Hospital Center,70 or Older,100,F,Black/African American,Not Span/Hispanic,2,Emergency,Home w/ Home Health Services,2020,CIR036,POSTTHROMBOTIC SYNDROME AND VENOUS INSUFFICIENCY/HYPERTENSION,MHT001,PHARMACOTHERAPY FOR MENTAL HEALTH (EXCLUDING SUBSTANCE USE),197,PERIPHERAL & OTHER VASCULAR DISORDERS,05,DISEASES AND DISORDERS OF THE CIRCULATORY SYSTEM,1,Minor,Moderate,Medical,Medicare,,,,,Y,22665.7,13034.68
New York City,Manhattan,7002001,001438,Bellevue Hospital Center,70 or Older,100,F,White,Not Span/Hispanic,6,Emergency,Home w/ Home Health Services,2020,CIR033,ACUTE PHLEBITIS; THROMBOPHLEBITIS AND THROMBOEMBOLISM,IMG008,ULTRASONOGRAPHY,197,PERIPHERAL & OTHER VASCULAR DISORDERS,05,DISEASES AND DISORDERS OF THE CIRCULATORY SYSTEM,2,Moderate,Moderate,Medical,Medicare,Medicaid,,,,Y,48227.25,27734.72
New York City,Manhattan,7002001,001438,Bellevue Hospital Center,50 to 69,112,M,Other Race,Not Span/Hispanic,2,Emergency,Home or Self Care,2020,CIR033,ACUTE PHLEBITIS; THROMBOPHLEBITIS AND THROMBOEMBOLISM,ADM021,"ADMINISTRATION OF THERAPEUTIC SUBSTANCES, NEC",197,PERIPHERAL & OTHER VASCULAR DISORDERS,05,DISEASES AND DISORDERS OF THE CIRCULATORY SYSTEM,2,Moderate,Moderate,Medical,Medicaid,,,,,Y,15364.51,8835.88
New York City,Manhattan,7002001,001438,Bellevue Hospital Center,30 to 49,OOS,M,Other Race,Unknown,2,Emergency,Home or Self Care,2020,CIR033,ACUTE PHLEBITIS; THROMBOPHLEBITIS AND THROMBOEMBOLISM,IMG006,COMPUTERIZED TOMOGRAPHY (CT) WITH CONTRAST,197,PERIPHERAL & OTHER VASCULAR DISORDERS,05,DISEASES AND DISORDERS OF THE CIRCULATORY SYSTEM,3,Major,Moderate,Medical,Private Health Insurance,,,,,Y,18029.89,10368.7
New York City,Manhattan,7002001,001438,Bellevue Hospital Center,50 to 69,100,M,Black/African American,Not Span/Hispanic,13,Emergency,Home or Self Care,2020,END003,DIABETES MELLITUS WITH COMPLICATION,MST020,SUBCUTANEOUS TISSUE AND FASCIA EXCISION,197,PERIPHERAL & OTHER VASCULAR DISORDERS,05,DISEASES AND DISORDERS OF THE CIRCULATORY SYSTEM,3,Major,Major,Medical,Medicaid,,,,,Y,102566.8,58984.53
New York City,Manhattan,7002001,001438,Bellevue Hospital Center,50 to 69,100,F,Other Race,Not Span/Hispanic,12,Emergency,Hospice - Medical Facility,2020,CIR033,ACUTE PHLEBITIS; THROMBOPHLEBITIS AND THROMBOEMBOLISM,IMG008,ULTRASONOGRAPHY,197,PERIPHERAL & OTHER VASCULAR DISORDERS,05,DISEASES AND DISORDERS OF THE CIRCULATORY SYSTEM,3,Major,Major,Medical,Medicaid,,,,,Y,93347.2,53682.48
New York City,Manhattan,7002001,001438,Bellevue Hospital Center,50 to 69,100,M,Black/African American,Not Span/Hispanic,2,Emergency,Home or Self Care,2020,CIR036,POSTTHROMBOTIC SYNDROME AND VENOUS INSUFFICIENCY/HYPERTENSION,ADM021,"ADMINISTRATION OF THERAPEUTIC SUBSTANCES, NEC",197,PERIPHERAL & OTHER VASCULAR DISORDERS,05,DISEASES AND DISORDERS OF THE CIRCULATORY SYSTEM,2,Moderate,Minor,Medical,Medicaid,,,,,Y,15705.37,9031.91
New York City,Manhattan,7002001,001438,Bellevue Hospital Center,50 to 69,100,M,Black/African American,Not Span/Hispanic,15,Emergency,Home or Self Care,2020,CIR033,ACUTE PHLEBITIS; THROMBOPHLEBITIS AND THROMBOEMBOLISM,IMG008,ULTRASONOGRAPHY,197,PERIPHERAL & OTHER VASCULAR DISORDERS,05,DISEASES AND DISORDERS OF THE CIRCULATORY SYSTEM,3,Major,Moderate,Medical,Medicaid,,,,,Y,124896.24,71825.83
New York City,Manhattan,7002001,001438,Bellevue Hospital Center,70 or Older,100,F,Other Race,Spanish/Hispanic,26,Emergency,Expired,2020,END003,DIABETES MELLITUS WITH COMPLICATION,CAR024,VENOUS AND ARTERIAL CATHETER PLACEMENT,197,PERIPHERAL & OTHER VASCULAR DISORDERS,05,DISEASES AND DISORDERS OF THE CIRCULATORY SYSTEM,3,Major,Major,Medical,Medicare,Medicaid,,,,Y,178641.22,102733.71
New York City,Manhattan,7002001,001438,Bellevue Hospital Center,70 or Older,112,F,Black/African American,Not Span/Hispanic,1,Urgent,Expired,2020,CIR027,ARTERIAL DISSECTIONS,RES007,AIRWAY INTUBATION,197,PERIPHERAL & OTHER VASCULAR DISORDERS,05,DISEASES AND DISORDERS OF THE CIRCULATORY SYSTEM,3,Major,Major,Medical,Medicare,Medicare,,,,N,10255.05,5897.52
New York City,Manhattan,7002001,001438,Bellevue Hospital Center,50 to 69,114,M,Black/African American,Not Span/Hispanic,2,Elective,Home or Self Care,2020,CIR029,AORTIC; PERIPHERAL; AND VISCERAL ARTERY ANEURYSMS,IMG007,COMPUTERIZED TOMOGRAPHY (CT) WITHOUT CONTRAST,197,PERIPHERAL & OTHER VASCULAR DISORDERS,05,DISEASES AND DISORDERS OF THE CIRCULATORY SYSTEM,2,Moderate,Moderate,Medical,Medicaid,,,,,Y,18594.21,10693.23
New York City,Manhattan,7002001,001438,Bellevue Hospital Center,70 or Older,104,M,Other Race,Spanish/Hispanic,97,Elective,Home or Self Care,2020,END003,DIABETES MELLITUS WITH COMPLICATION,MST020,SUBCUTANEOUS TISSUE AND FASCIA EXCISION,197,PERIPHERAL & OTHER VASCULAR DISORDERS,05,DISEASES AND DISORDERS OF THE CIRCULATORY SYSTEM,3,Major,Major,Medical,Medicare,,,,,N,611017.31,351386.28
New York City,Manhattan,7002001,001438,Bellevue Hospital Center,30 to 49,112,F,Black/African American,Not Span/Hispanic,2,Urgent,Home or Self Care,2020,CIR027,ARTERIAL DISSECTIONS,ADM021,"ADMINISTRATION OF THERAPEUTIC SUBSTANCES, NEC",197,PERIPHERAL & OTHER VASCULAR DISORDERS,05,DISEASES AND DISORDERS OF THE CIRCULATORY SYSTEM,2,Moderate,Major,Medical,Medicaid,,,,,N,18594.06,10693.15
New York City,Manhattan,7002001,001438,Bellevue Hospital Center,50 to 69,100,M,Other Race,Spanish/Hispanic,27,Elective,Medicaid Cert Nursing Facility,2020,END003,DIABETES MELLITUS WITH COMPLICATION,,,197,PERIPHERAL & OTHER VASCULAR DISORDERS,05,DISEASES AND DISORDERS OF THE CIRCULATORY SYSTEM,2,Moderate,Minor,Medical,Medicaid,,,,,N,175713.16,101049.83
New York City,Manhattan,7002001,001438,Bellevue Hospital Center,70 or Older,111,F,Other Race,Spanish/Hispanic,7,Emergency,Home or Self Care,2020,CIR026,PERIPHERAL AND VISCERAL VASCULAR DISEASE,CAR024,VENOUS AND ARTERIAL CATHETER PLACEMENT,197,PERIPHERAL & OTHER VASCULAR DISORDERS,05,DISEASES AND DISORDERS OF THE CIRCULATORY SYSTEM,3,Major,Moderate,Medical,Medicaid,,,,,Y,61143.2,35162.48
New York City,Manhattan,7002001,001438,Bellevue Hospital Center,50 to 69,112,M,Other Race,Spanish/Hispanic,3,Urgent,Home or Self Care,2020,CIR027,ARTERIAL DISSECTIONS,IMG008,ULTRASONOGRAPHY,197,PERIPHERAL & OTHER VASCULAR DISORDERS,05,DISEASES AND DISORDERS OF THE CIRCULATORY SYSTEM,3,Major,Major,Medical,Medicaid,,,,,N,39566.14,22753.85
New York City,Manhattan,7002001,001438,Bellevue Hospital Center,70 or Older,114,F,Black/African American,Not Span/Hispanic,14,Urgent,Home w/ Home Health Services,2020,CIR033,ACUTE PHLEBITIS; THROMBOPHLEBITIS AND THROMBOEMBOLISM,ADM021,"ADMINISTRATION OF THERAPEUTIC SUBSTANCES, NEC",197,PERIPHERAL & OTHER VASCULAR DISORDERS,05,DISEASES AND DISORDERS OF THE CIRCULATORY SYSTEM,3,Major,Major,Medical,Medicare,Medicaid,,,,N,118783.32,68310.39
New York City,Manhattan,7002001,001438,Bellevue Hospital Center,50 to 69,100,F,Other Race,Spanish/Hispanic,3,Emergency,Home or Self Care,2020,CIR034,CHRONIC PHLEBITIS; THROMBOPHLEBITIS AND THROMBOEMBOLISM,IMG008,ULTRASONOGRAPHY,197,PERIPHERAL & OTHER VASCULAR DISORDERS,05,DISEASES AND DISORDERS OF THE CIRCULATORY SYSTEM,2,Moderate,Minor,Medical,Medicare,Medicaid,,,,Y,24465.39,14069.65
New York City,Manhattan,7002001,001438,Bellevue Hospital Center,18 to 29,100,M,Other Race,Not Span/Hispanic,1,Emergency,Home or Self Care,2020,CIR036,POSTTHROMBOTIC SYNDROME AND VENOUS INSUFFICIENCY/HYPERTENSION,IMG006,COMPUTERIZED TOMOGRAPHY (CT) WITH CONTRAST,197,PERIPHERAL & OTHER VASCULAR DISORDERS,05,DISEASES AND DISORDERS OF THE CIRCULATORY SYSTEM,2,Moderate,Minor,Medical,Private Health Insurance,,,,,Y,17096.13,9831.71
New York City,Manhattan,7002001,001438,Bellevue Hospital Center,70 or Older,100,M,Black/African American,Not Span/Hispanic,8,Emergency,Inpatient Rehabilitation Facility,2020,CIR035,VARICOSE VEINS OF LOWER EXTREMITY,ADM021,"ADMINISTRATION OF THERAPEUTIC SUBSTANCES, NEC",197,PERIPHERAL & OTHER VASCULAR DISORDERS,05,DISEASES AND DISORDERS OF THE CIRCULATORY SYSTEM,2,Moderate,Minor,Medical,Medicare,Medicaid,,,,Y,53590.81,30819.22
New York City,Manhattan,7002001,001438,Bellevue Hospital Center,50 to 69,104,F,Black/African American,Spanish/Hispanic,4,Urgent,Home or Self Care,2020,CIR033,ACUTE PHLEBITIS; THROMBOPHLEBITIS AND THROMBOEMBOLISM,IMG008,ULTRASONOGRAPHY,197,PERIPHERAL & OTHER VASCULAR DISORDERS,05,DISEASES AND DISORDERS OF THE CIRCULATORY SYSTEM,3,Major,Major,Medical,Medicaid,,,,,N,34726.49,19970.65
New York City,Manhattan,7002001,001438,Bellevue Hospital Center,50 to 69,100,M,White,Not Span/Hispanic,4,Emergency,Home or Self Care,2020,CIR036,POSTTHROMBOTIC SYNDROME AND VENOUS INSUFFICIENCY/HYPERTENSION,IMG007,COMPUTERIZED TOMOGRAPHY (CT) WITHOUT CONTRAST,197,PERIPHERAL & OTHER VASCULAR DISORDERS,05,DISEASES AND DISORDERS OF THE CIRCULATORY SYSTEM,2,Moderate,Minor,Medical,Medicaid,,,,,Y,30902.8,17771.71
New York City,Manhattan,7002001,001438,Bellevue Hospital Center,50 to 69,113,M,Black/African American,Not Span/Hispanic,3,Emergency,Skilled Nursing Home,2020,CIR036,POSTTHROMBOTIC SYNDROME AND VENOUS INSUFFICIENCY/HYPERTENSION,IMG008,ULTRASONOGRAPHY,197,PERIPHERAL & OTHER VASCULAR DISORDERS,05,DISEASES AND DISORDERS OF THE CIRCULATORY SYSTEM,2,Moderate,Minor,Medical,Medicaid,,,,,Y,24722.07,14217.27
New York City,Manhattan,7002001,001438,Bellevue Hospital Center,30 to 49,104,M,Black/African American,Not Span/Hispanic,5,Emergency,Home or Self Care,2020,CIR033,ACUTE PHLEBITIS; THROMBOPHLEBITIS AND THROMBOEMBOLISM,CAR024,VENOUS AND ARTERIAL CATHETER PLACEMENT,197,PERIPHERAL & OTHER VASCULAR DISORDERS,05,DISEASES AND DISORDERS OF THE CIRCULATORY SYSTEM,3,Major,Extreme,Medical,Self-Pay,,,,,Y,77720.06,44695.56
New York City,Manhattan,7002001,001438,Bellevue Hospital Center,30 to 49,112,M,Black/African American,Not Span/Hispanic,2,Emergency,Expired,2020,CIR039,OTHER SPECIFIED DISEASES OF VEINS AND LYMPHATICS,CAR024,VENOUS AND ARTERIAL CATHETER PLACEMENT,197,PERIPHERAL & OTHER VASCULAR DISORDERS,05,DISEASES AND DISORDERS OF THE CIRCULATORY SYSTEM,4,Extreme,Extreme,Medical,Medicaid,,,,,Y,98712.05,56767.72
New York City,Manhattan,7002001,001438,Bellevue Hospital Center,30 to 49,113,F,Other Race,Spanish/Hispanic,5,Emergency,Home or Self Care,2020,END003,DIABETES MELLITUS WITH COMPLICATION,IMG006,COMPUTERIZED TOMOGRAPHY (CT) WITH CONTRAST,197,PERIPHERAL & OTHER VASCULAR DISORDERS,05,DISEASES AND DISORDERS OF THE CIRCULATORY SYSTEM,3,Major,Major,Medical,Medicaid,,,,,Y,38647.25,22225.42
New York City,Manhattan,7002001,001438,Bellevue Hospital Center,50 to 69,100,M,Black/African American,Not Span/Hispanic,16,Elective,Home or Self Care,2020,CIR027,ARTERIAL DISSECTIONS,ADM021,"ADMINISTRATION OF THERAPEUTIC SUBSTANCES, NEC",197,PERIPHERAL & OTHER VASCULAR DISORDERS,05,DISEASES AND DISORDERS OF THE CIRCULATORY SYSTEM,3,Major,Major,Medical,Medicaid,,,,,N,142837.98,82143.84
New York City,Manhattan,7002001,001438,Bellevue Hospital Center,70 or Older,112,F,Other Race,Spanish/Hispanic,37,Emergency,Home w/ Home Health Services,2020,CIR033,ACUTE PHLEBITIS; THROMBOPHLEBITIS AND THROMBOEMBOLISM,IMG007,COMPUTERIZED TOMOGRAPHY (CT) WITHOUT CONTRAST,197,PERIPHERAL & OTHER VASCULAR DISORDERS,05,DISEASES AND DISORDERS OF THE CIRCULATORY SYSTEM,2,Moderate,Minor,Medical,Medicare,Medicaid,,,,Y,238619.64,137226.34
New York City,Manhattan,7002001,001438,Bellevue Hospital Center,50 to 69,100,M,Multi-racial,Not Span/Hispanic,8,Emergency,Home or Self Care,2020,CIR027,ARTERIAL DISSECTIONS,IMG008,ULTRASONOGRAPHY,197,PERIPHERAL & OTHER VASCULAR DISORDERS,05,DISEASES AND DISORDERS OF THE CIRCULATORY SYSTEM,4,Extreme,Extreme,Medical,Medicaid,,,,,Y,108989.88,62678.34
New York City,Manhattan,7002001,001438,Bellevue Hospital Center,50 to 69,112,M,Black/African American,Not Span/Hispanic,10,Emergency,Skilled Nursing Home,2020,CIR036,POSTTHROMBOTIC SYNDROME AND VENOUS INSUFFICIENCY/HYPERTENSION,IMG008,ULTRASONOGRAPHY,197,PERIPHERAL & OTHER VASCULAR DISORDERS,05,DISEASES AND DISORDERS OF THE CIRCULATORY SYSTEM,2,Moderate,Minor,Medical,Medicaid,,,,,Y,72753.11,41839.15
New York City,Manhattan,7002001,001438,Bellevue Hospital Center,30 to 49,104,M,Other Race,Unknown,5,Urgent,Home or Self Care,2020,CIR032,OTHER SPECIFIED AND UNSPECIFIED CIRCULATORY DISEASE,IMG005,MAGNETIC RESONANCE IMAGING (MRI),197,PERIPHERAL & OTHER VASCULAR DISORDERS,05,DISEASES AND DISORDERS OF THE CIRCULATORY SYSTEM,3,Major,Moderate,Medical,Medicaid,,,,,N,38060.18,21887.8
New York City,Manhattan,7002001,001438,Bellevue Hospital Center,70 or Older,113,F,Other Race,Not Span/Hispanic,5,Emergency,Home or Self Care,2020,CIR033,ACUTE PHLEBITIS; THROMBOPHLEBITIS AND THROMBOEMBOLISM,CAR028,INFERIOR VENA CAVA (IVC) FILTER PROCEDURES,197,PERIPHERAL & OTHER VASCULAR DISORDERS,05,DISEASES AND DISORDERS OF THE CIRCULATORY SYSTEM,4,Extreme,Extreme,Medical,Medicaid,,,,,Y,49460.16,28443.75
New York City,Manhattan,7002001,001438,Bellevue Hospital Center,50 to 69,113,M,Other Race,Not Span/Hispanic,5,Urgent,Home or Self Care,2020,CIR029,AORTIC; PERIPHERAL; AND VISCERAL ARTERY ANEURYSMS,PLC002,PACKING AND DRESSING PROCEDURES,197,PERIPHERAL & OTHER VASCULAR DISORDERS,05,DISEASES AND DISORDERS OF THE CIRCULATORY SYSTEM,2,Moderate,Major,Medical,Medicaid,,,,,N,82381.31,47376.17
New York City,Manhattan,7002001,001438,Bellevue Hospital Center,50 to 69,100,M,Multi-racial,Not Span/Hispanic,1,Emergency,Left Against Medical Advice,2020,CIR027,ARTERIAL DISSECTIONS,ADM021,"ADMINISTRATION OF THERAPEUTIC SUBSTANCES, NEC",197,PERIPHERAL & OTHER VASCULAR DISORDERS,05,DISEASES AND DISORDERS OF THE CIRCULATORY SYSTEM,2,Moderate,Major,Medical,Medicaid,,,,,Y,22537.18,12960.77