Hospital Service Area,Hospital County,Operating Certificate Number,Permanent Facility Id,Facility Name,Age Group,Zip Code - 3 digits,Gender,Race,Ethnicity,Length of Stay,Type of Admission,Patient Disposition,Discharge Year,CCS Diagnosis Code,CCS Diagnosis Description,CCS Procedure Code,CCS Procedure Description,APR DRG Code,APR DRG Description,APR MDC Code,APR MDC Description,APR Severity of Illness Code,APR Severity of Illness Description,APR Risk of Mortality,APR Medical Surgical Description,Payment Typology 1,Payment Typology 2,Payment Typology 3,Birth Weight,Abortion Edit Indicator,Emergency Department Indicator,Total Charges,Total Costs
Long Island,Nassau,7003004,000518,Long Island Jewish Valley Stream,50 to 69,110,F,Other Race,Not Span/Hispanic,1,Emergency,Left Against Medical Advice,2018,CIR011,CORONARY ATHEROSCLEROSIS AND OTHER HEART DISEASE,,,198,ANGINA PECTORIS & CORONARY ATHEROSCLEROSIS,05,DISEASES AND DISORDERS OF THE CIRCULATORY SYSTEM,1,Minor,Minor,Medical,Medicaid,,,,,true,22750.07,4429.74
New York City,Manhattan,7002054,001458,New York-Presbyterian Hospital - New York Weill Cornell Center,70 or Older,125,F,White,Not Span/Hispanic,4,Emergency,Skilled Nursing Home,2018,CIR011,CORONARY ATHEROSCLEROSIS AND OTHER HEART DISEASE,,,198,ANGINA PECTORIS & CORONARY ATHEROSCLEROSIS,05,DISEASES AND DISORDERS OF THE CIRCULATORY SYSTEM,2,Moderate,Moderate,Medical,Medicare,Self-Pay,,,,true,74094.87,32444.6
Long Island,Nassau,7003004,000518,Long Island Jewish Valley Stream,70 or Older,114,F,Black/African American,Not Span/Hispanic,2,Emergency,Home or Self Care,2018,CIR011,CORONARY ATHEROSCLEROSIS AND OTHER HEART DISEASE,,,198,ANGINA PECTORIS & CORONARY ATHEROSCLEROSIS,05,DISEASES AND DISORDERS OF THE CIRCULATORY SYSTEM,1,Minor,Minor,Medical,Medicaid,,,,,true,37501.75,7096.84
New York City,Richmond,7004003,001740,Staten Island University Hosp-North,50 to 69,OOS,M,White,Not Span/Hispanic,1,Emergency,Home or Self Care,2018,CIR012,NONSPECIFIC CHEST PAIN,MAM004,CARDIAC STRESS TESTS,198,ANGINA PECTORIS & CORONARY ATHEROSCLEROSIS,05,DISEASES AND DISORDERS OF THE CIRCULATORY SYSTEM,1,Minor,Minor,Medical,Medicaid,,,,,true,18818.57,3825.28
New York City,Manhattan,7002053,001463,NYU Langone Hospitals,50 to 69,100,M,Other Race,Spanish/Hispanic,3,Emergency,Home or Self Care,2018,CIR012,NONSPECIFIC CHEST PAIN,,,198,ANGINA PECTORIS & CORONARY ATHEROSCLEROSIS,05,DISEASES AND DISORDERS OF THE CIRCULATORY SYSTEM,1,Minor,Minor,Medical,Medicare,,,,,true,53021.62,13709.79
Finger Lakes,Wayne,5820000,001028,Newark-Wayne Community Hospital,70 or Older,145,M,White,Not Span/Hispanic,4,Emergency,Home or Self Care,2018,CIR011,CORONARY ATHEROSCLEROSIS AND OTHER HEART DISEASE,,,198,ANGINA PECTORIS & CORONARY ATHEROSCLEROSIS,05,DISEASES AND DISORDERS OF THE CIRCULATORY SYSTEM,2,Moderate,Moderate,Medical,Medicare,,,,,true,20873.58,6562.18
Finger Lakes,Wayne,5820000,001028,Newark-Wayne Community Hospital,30 to 49,145,F,White,Not Span/Hispanic,2,Emergency,Left Against Medical Advice,2018,CIR012,NONSPECIFIC CHEST PAIN,,,198,ANGINA PECTORIS & CORONARY ATHEROSCLEROSIS,05,DISEASES AND DISORDERS OF THE CIRCULATORY SYSTEM,1,Minor,Minor,Medical,Medicare,Medicaid,,,,true,8973.02,2449.72
New York City,Manhattan,7002017,001450,Lenox Hill Hospital,70 or Older,OOS,M,White,Not Span/Hispanic,1,Emergency,Home or Self Care,2018,CIR012,NONSPECIFIC CHEST PAIN,,,198,ANGINA PECTORIS & CORONARY ATHEROSCLEROSIS,05,DISEASES AND DISORDERS OF THE CIRCULATORY SYSTEM,3,Major,Major,Medical,Blue Cross/Blue Shield,Medicare,,,,true,24772.79,5374.24
New York City,Queens,7003004,001638,Long Island Jewish Forest Hills,50 to 69,113,F,Other Race,Spanish/Hispanic,2,Emergency,Home or Self Care,2018,CIR012,NONSPECIFIC CHEST PAIN,,,198,ANGINA PECTORIS & CORONARY ATHEROSCLEROSIS,05,DISEASES AND DISORDERS OF THE CIRCULATORY SYSTEM,1,Minor,Minor,Medical,Medicaid,Medicaid,,,,true,28490.06,5596.35
Long Island,Suffolk,5155000,000938,Peconic Bay Medical Center,70 or Older,119,F,White,Spanish/Hispanic,1,Emergency,Home or Self Care,2018,CIR012,NONSPECIFIC CHEST PAIN,OST001,OSTEOPATHIC TREATMENT,198,ANGINA PECTORIS & CORONARY ATHEROSCLEROSIS,05,DISEASES AND DISORDERS OF THE CIRCULATORY SYSTEM,2,Moderate,Moderate,Medical,Medicare,Private Health Insurance,,,,true,19314.87,3351.94
New York City,Kings,7001016,001301,Kings County Hospital Center,70 or Older,112,M,Black/African American,Not Span/Hispanic,3,Emergency,Home or Self Care,2018,CIR012,NONSPECIFIC CHEST PAIN,ADM021,"ADMINISTRATION OF THERAPEUTIC SUBSTANCES, NEC",198,ANGINA PECTORIS & CORONARY ATHEROSCLEROSIS,05,DISEASES AND DISORDERS OF THE CIRCULATORY SYSTEM,2,Moderate,Moderate,Medical,Medicare,Medicaid,,,,true,18554.42,13180.34
Western NY,Erie,1401005,000210,Erie County Medical Center,70 or Older,142,F,Black/African American,Not Span/Hispanic,1,Emergency,Home or Self Care,2018,CIR011,CORONARY ATHEROSCLEROSIS AND OTHER HEART DISEASE,,,198,ANGINA PECTORIS & CORONARY ATHEROSCLEROSIS,05,DISEASES AND DISORDERS OF THE CIRCULATORY SYSTEM,3,Major,Major,Medical,Medicare,Medicaid,Medicare,,,true,12252.24,4059.76
Capital/Adirond,Schenectady,4601001,000829,Ellis Hospital,70 or Older,123,F,White,Not Span/Hispanic,3,Emergency,Skilled Nursing Home,2018,CIR012,NONSPECIFIC CHEST PAIN,,,198,ANGINA PECTORIS & CORONARY ATHEROSCLEROSIS,05,DISEASES AND DISORDERS OF THE CIRCULATORY SYSTEM,1,Minor,Moderate,Medical,Medicare,Medicare,Blue Cross/Blue Shield,,,true,9750.7,3399.94
New York City,Kings,7001009,001294,Coney Island Hospital,50 to 69,112,M,Other Race,Not Span/Hispanic,2,Emergency,Home w/ Home Health Services,2018,CIR011,CORONARY ATHEROSCLEROSIS AND OTHER HEART DISEASE,ADM021,"ADMINISTRATION OF THERAPEUTIC SUBSTANCES, NEC",198,ANGINA PECTORIS & CORONARY ATHEROSCLEROSIS,05,DISEASES AND DISORDERS OF THE CIRCULATORY SYSTEM,1,Minor,Minor,Medical,Private Health Insurance,Medicare,Medicaid,,,true,20550.81,11502.88
New York City,Kings,7001035,001318,Wyckoff Heights Medical Center,70 or Older,112,F,Other Race,Not Span/Hispanic,3,Emergency,Home w/ Home Health Services,2018,CIR012,NONSPECIFIC CHEST PAIN,,,198,ANGINA PECTORIS & CORONARY ATHEROSCLEROSIS,05,DISEASES AND DISORDERS OF THE CIRCULATORY SYSTEM,2,Moderate,Moderate,Medical,Medicare,Federal/State/Local/VA,,,,true,16591.71,6664.16
New York City,Bronx,7000001,001178,BronxCare Hospital Center,50 to 69,104,M,Black/African American,Not Span/Hispanic,3,Emergency,Home or Self Care,2018,CIR012,NONSPECIFIC CHEST PAIN,,,198,ANGINA PECTORIS & CORONARY ATHEROSCLEROSIS,05,DISEASES AND DISORDERS OF THE CIRCULATORY SYSTEM,2,Moderate,Moderate,Medical,Medicaid,Medicaid,,,,true,12910.32,14445.55
Western NY,Erie,1404000,000267,Kenmore Mercy Hospital,50 to 69,142,F,White,Not Span/Hispanic,3,Emergency,Short-term Hospital,2018,CIR011,CORONARY ATHEROSCLEROSIS AND OTHER HEART DISEASE,,,198,ANGINA PECTORIS & CORONARY ATHEROSCLEROSIS,05,DISEASES AND DISORDERS OF THE CIRCULATORY SYSTEM,1,Minor,Minor,Medical,Miscellaneous/Other,,,,,true,15580.92,4927.19
New York City,Queens,7002024,001639,Mount Sinai Hospital - Mount Sinai Hospital of Queens,50 to 69,111,M,Other Race,Not Span/Hispanic,1,Emergency,Home or Self Care,2018,CIR012,NONSPECIFIC CHEST PAIN,ADM021,"ADMINISTRATION OF THERAPEUTIC SUBSTANCES, NEC",198,ANGINA PECTORIS & CORONARY ATHEROSCLEROSIS,05,DISEASES AND DISORDERS OF THE CIRCULATORY SYSTEM,2,Moderate,Minor,Medical,Medicare,Medicaid,,,,true,5994.36,1424.84
Long Island,Nassau,2951001,000541,North Shore University Hospital,50 to 69,110,M,Other Race,Not Span/Hispanic,2,Emergency,Home or Self Care,2018,CIR012,NONSPECIFIC CHEST PAIN,,,198,ANGINA PECTORIS & CORONARY ATHEROSCLEROSIS,05,DISEASES AND DISORDERS OF THE CIRCULATORY SYSTEM,2,Moderate,Minor,Medical,Medicare,Private Health Insurance,,,,true,22560.32,3808.69
New York City,Queens,7003004,001638,Long Island Jewish Forest Hills,70 or Older,113,M,Other Race,Not Span/Hispanic,3,Emergency,Home w/ Home Health Services,2018,CIR012,NONSPECIFIC CHEST PAIN,ESA001,HEMODIALYSIS,198,ANGINA PECTORIS & CORONARY ATHEROSCLEROSIS,05,DISEASES AND DISORDERS OF THE CIRCULATORY SYSTEM,2,Moderate,Moderate,Medical,Medicare,Medicaid,,,,true,40759.6,7062.59
Long Island,Suffolk,5154000,000924,South Shore University Hospital,50 to 69,117,M,White,Not Span/Hispanic,1,Emergency,Home or Self Care,2018,CIR011,CORONARY ATHEROSCLEROSIS AND OTHER HEART DISEASE,CAR001,HEART BIOPSY,198,ANGINA PECTORIS & CORONARY ATHEROSCLEROSIS,05,DISEASES AND DISORDERS OF THE CIRCULATORY SYSTEM,2,Moderate,Minor,Medical,Private Health Insurance,,,,,false,23478.67,4924.71
New York City,Bronx,7000006,003058,Montefiore Med Center - Jack D Weiler Hosp of A Einstein College Div,70 or Older,104,F,Black/African American,Unknown,2,Emergency,Home w/ Home Health Services,2018,CIR012,NONSPECIFIC CHEST PAIN,ADM021,"ADMINISTRATION OF THERAPEUTIC SUBSTANCES, NEC",198,ANGINA PECTORIS & CORONARY ATHEROSCLEROSIS,05,DISEASES AND DISORDERS OF THE CIRCULATORY SYSTEM,2,Moderate,Moderate,Medical,Medicare,Medicaid,,,,true,27129.81,4303.77
Long Island,Nassau,2953000,000563,St. Francis Hospital & Heart Center,70 or Older,115,F,White,Not Span/Hispanic,2,Emergency,Skilled Nursing Home,2018,CIR011,CORONARY ATHEROSCLEROSIS AND OTHER HEART DISEASE,,,198,ANGINA PECTORIS & CORONARY ATHEROSCLEROSIS,05,DISEASES AND DISORDERS OF THE CIRCULATORY SYSTEM,2,Moderate,Moderate,Medical,Medicare,Private Health Insurance,,,,true,27072,5113.56
New York City,Queens,7003004,001638,Long Island Jewish Forest Hills,70 or Older,113,F,White,Not Span/Hispanic,2,Emergency,Home or Self Care,2018,CIR012,NONSPECIFIC CHEST PAIN,,,198,ANGINA PECTORIS & CORONARY ATHEROSCLEROSIS,05,DISEASES AND DISORDERS OF THE CIRCULATORY SYSTEM,2,Moderate,Moderate,Medical,Medicare,Medicaid,,,,true,34086.06,6584.94
Capital/Adirond,Albany,0101004,000005,St. Peter's Hospital,50 to 69,128,F,White,Not Span/Hispanic,1,Urgent,Home or Self Care,2018,CIR012,NONSPECIFIC CHEST PAIN,,,198,ANGINA PECTORIS & CORONARY ATHEROSCLEROSIS,05,DISEASES AND DISORDERS OF THE CIRCULATORY SYSTEM,1,Minor,Minor,Medical,Private Health Insurance,,,,,false,15402.1,3359.19
Hudson Valley,Westchester,5902001,001045,White Plains Hospital Center,70 or Older,106,F,Other Race,Not Span/Hispanic,1,Emergency,Home w/ Home Health Services,2018,CIR011,CORONARY ATHEROSCLEROSIS AND OTHER HEART DISEASE,,,198,ANGINA PECTORIS & CORONARY ATHEROSCLEROSIS,05,DISEASES AND DISORDERS OF THE CIRCULATORY SYSTEM,1,Minor,Moderate,Medical,Medicare,,,,,true,7562,2065.59
New York City,Bronx,7000001,001178,BronxCare Hospital Center,50 to 69,104,F,Other Race,Spanish/Hispanic,2,Emergency,Home or Self Care,2018,CIR012,NONSPECIFIC CHEST PAIN,,,198,ANGINA PECTORIS & CORONARY ATHEROSCLEROSIS,05,DISEASES AND DISORDERS OF THE CIRCULATORY SYSTEM,2,Moderate,Minor,Medical,Medicare,Medicare,Medicaid,,,true,14211.37,13675.66
Long Island,Nassau,2951001,000541,North Shore University Hospital,50 to 69,114,M,Black/African American,Not Span/Hispanic,5,Emergency,Home w/ Home Health Services,2018,CIR012,NONSPECIFIC CHEST PAIN,ESA004,NON-INVASIVE VENTILATION,198,ANGINA PECTORIS & CORONARY ATHEROSCLEROSIS,05,DISEASES AND DISORDERS OF THE CIRCULATORY SYSTEM,3,Major,Major,Medical,Medicare,Medicare,Medicaid,,,true,71545.13,18437.31
New York City,Kings,7002053,001304,NYU Langone Hospital-Brooklyn,50 to 69,112,M,White,Not Span/Hispanic,1,Emergency,Home or Self Care,2018,CIR011,CORONARY ATHEROSCLEROSIS AND OTHER HEART DISEASE,,,198,ANGINA PECTORIS & CORONARY ATHEROSCLEROSIS,05,DISEASES AND DISORDERS OF THE CIRCULATORY SYSTEM,1,Minor,Minor,Medical,Medicaid,,,,,true,19820.63,5140.32
New York City,Kings,7002002,001324,Mount Sinai Brooklyn,50 to 69,112,F,Black/African American,Unknown,2,Emergency,Home or Self Care,2018,CIR011,CORONARY ATHEROSCLEROSIS AND OTHER HEART DISEASE,MAM007,ELECTROCARDIOGRAM (ECG),198,ANGINA PECTORIS & CORONARY ATHEROSCLEROSIS,05,DISEASES AND DISORDERS OF THE CIRCULATORY SYSTEM,1,Minor,Minor,Medical,Private Health Insurance,Self-Pay,,,,false,21044.65,3316.83
Long Island,Nassau,2951001,000541,North Shore University Hospital,70 or Older,113,F,White,Not Span/Hispanic,4,Emergency,Skilled Nursing Home,2018,CIR011,CORONARY ATHEROSCLEROSIS AND OTHER HEART DISEASE,ENT001,LARYNGOSCOPY (DIAGNOSTIC),198,ANGINA PECTORIS & CORONARY ATHEROSCLEROSIS,05,DISEASES AND DISORDERS OF THE CIRCULATORY SYSTEM,3,Major,Moderate,Medical,Medicare,Private Health Insurance,,,,true,65121.09,10168.24
Western NY,Niagara,3101000,000565,Eastern Niagara Hospital - Lockport Division,70 or Older,140,M,Black/African American,Not Span/Hispanic,2,Emergency,Short-term Hospital,2018,CIR011,CORONARY ATHEROSCLEROSIS AND OTHER HEART DISEASE,,,198,ANGINA PECTORIS & CORONARY ATHEROSCLEROSIS,05,DISEASES AND DISORDERS OF THE CIRCULATORY SYSTEM,2,Moderate,Moderate,Medical,Medicare,Blue Cross/Blue Shield,,,,true,9511.06,2695.21
New York City,Manhattan,7002054,003975,New York Presbyterian Hospital - Allen Hospital,50 to 69,104,F,Other Race,Not Span/Hispanic,2,Emergency,Home or Self Care,2018,CIR012,NONSPECIFIC CHEST PAIN,,,198,ANGINA PECTORIS & CORONARY ATHEROSCLEROSIS,05,DISEASES AND DISORDERS OF THE CIRCULATORY SYSTEM,2,Moderate,Minor,Medical,Blue Cross/Blue Shield,Self-Pay,,,,true,33151.1,8026.68
New York City,Queens,7003010,001637,New York - Presbyterian/Queens,30 to 49,114,M,Black/African American,Not Span/Hispanic,1,Emergency,Home or Self Care,2018,CIR012,NONSPECIFIC CHEST PAIN,MAM006,PACEMAKER AND DEFIBRILLATOR INTERROGATION,198,ANGINA PECTORIS & CORONARY ATHEROSCLEROSIS,05,DISEASES AND DISORDERS OF THE CIRCULATORY SYSTEM,2,Moderate,Moderate,Medical,Blue Cross/Blue Shield,Self-Pay,,,,true,11438.72,3502.88
New York City,Kings,7001021,001306,New York - Presbyterian Brooklyn Methodist Hospital,50 to 69,112,M,Other Race,Not Span/Hispanic,2,Emergency,Home w/ Home Health Services,2018,CIR012,NONSPECIFIC CHEST PAIN,,,198,ANGINA PECTORIS & CORONARY ATHEROSCLEROSIS,05,DISEASES AND DISORDERS OF THE CIRCULATORY SYSTEM,2,Moderate,Minor,Medical,Medicare,Medicaid,Self-Pay,,,true,14373.39,3576.23
Long Island,Suffolk,5123000,000885,Long Island Community Hospital,50 to 69,119,F,White,Not Span/Hispanic,5,Emergency,Skilled Nursing Home,2018,CIR011,CORONARY ATHEROSCLEROSIS AND OTHER HEART DISEASE,MAM004,CARDIAC STRESS TESTS,198,ANGINA PECTORIS & CORONARY ATHEROSCLEROSIS,05,DISEASES AND DISORDERS OF THE CIRCULATORY SYSTEM,2,Moderate,Minor,Medical,Medicare,Medicaid,,,,true,38647.73,8444.53
Hudson Valley,Westchester,5922000,001122,New York - Presbyterian Hospital,50 to 69,107,M,Other Race,Not Span/Hispanic,2,Emergency,Home or Self Care,2018,CIR012,NONSPECIFIC CHEST PAIN,,,198,ANGINA PECTORIS & CORONARY ATHEROSCLEROSIS,05,DISEASES AND DISORDERS OF THE CIRCULATORY SYSTEM,1,Minor,Minor,Medical,Medicaid,,,,,true,16552,6871.64
New York City,Kings,7002002,001324,Mount Sinai Brooklyn,50 to 69,112,F,Black/African American,Unknown,3,Emergency,Home w/ Home Health Services,2018,CIR012,NONSPECIFIC CHEST PAIN,,,198,ANGINA PECTORIS & CORONARY ATHEROSCLEROSIS,05,DISEASES AND DISORDERS OF THE CIRCULATORY SYSTEM,1,Minor,Moderate,Medical,Medicare,Miscellaneous/Other,Self-Pay,,,true,36247.43,6605.85
Long Island,Nassau,2909000,000513,Mercy Hospital,70 or Older,115,F,Other Race,Spanish/Hispanic,2,Emergency,Home w/ Home Health Services,2018,CIR012,NONSPECIFIC CHEST PAIN,,,198,ANGINA PECTORIS & CORONARY ATHEROSCLEROSIS,05,DISEASES AND DISORDERS OF THE CIRCULATORY SYSTEM,1,Minor,Moderate,Medical,Medicaid,Medicaid,,,,true,28930,5896.64
New York City,Richmond,7004003,001740,Staten Island University Hosp-North,70 or Older,103,M,White,Not Span/Hispanic,1,Emergency,Home or Self Care,2018,CIR012,NONSPECIFIC CHEST PAIN,,,198,ANGINA PECTORIS & CORONARY ATHEROSCLEROSIS,05,DISEASES AND DISORDERS OF THE CIRCULATORY SYSTEM,2,Moderate,Moderate,Medical,Medicare,Medicare,,,,true,16499.99,3343.43
Long Island,Suffolk,5151001,000245,Stony Brook University Hospital,70 or Older,119,F,Multi-racial,Not Span/Hispanic,3,Emergency,Skilled Nursing Home,2018,CIR012,NONSPECIFIC CHEST PAIN,MAM004,CARDIAC STRESS TESTS,198,ANGINA PECTORIS & CORONARY ATHEROSCLEROSIS,05,DISEASES AND DISORDERS OF THE CIRCULATORY SYSTEM,2,Moderate,Moderate,Medical,Medicare,Private Health Insurance,,,,true,36519.74,10105.72
New York City,Richmond,7004003,001740,Staten Island University Hosp-North,50 to 69,103,M,White,Not Span/Hispanic,1,Emergency,Left Against Medical Advice,2018,CIR012,NONSPECIFIC CHEST PAIN,,,198,ANGINA PECTORIS & CORONARY ATHEROSCLEROSIS,05,DISEASES AND DISORDERS OF THE CIRCULATORY SYSTEM,1,Minor,Minor,Medical,Medicaid,Medicaid,,,,true,20427.84,4044.22
New York City,Manhattan,7002032,001469,Mount Sinai Morningside,30 to 49,101,M,Other Race,Not Span/Hispanic,5,Emergency,Home or Self Care,2018,CIR011,CORONARY ATHEROSCLEROSIS AND OTHER HEART DISEASE,IMG008,ULTRASONOGRAPHY,198,ANGINA PECTORIS & CORONARY ATHEROSCLEROSIS,05,DISEASES AND DISORDERS OF THE CIRCULATORY SYSTEM,3,Major,Moderate,Medical,Medicaid,Medicaid,Self-Pay,,,false,59771.94,14131.73
New York City,Manhattan,7002054,001464,New York-Presbyterian Hospital - Columbia Presbyterian Center,70 or Older,100,F,Multi-racial,Not Span/Hispanic,2,Emergency,Home w/ Home Health Services,2018,CIR011,CORONARY ATHEROSCLEROSIS AND OTHER HEART DISEASE,,,198,ANGINA PECTORIS & CORONARY ATHEROSCLEROSIS,05,DISEASES AND DISORDERS OF THE CIRCULATORY SYSTEM,2,Moderate,Moderate,Medical,Medicare,Medicaid,Self-Pay,,,true,24766.7,5602.06
Finger Lakes,Monroe,2701003,000411,Rochester General Hospital,70 or Older,145,M,White,Not Span/Hispanic,2,Emergency,Home or Self Care,2018,CIR012,NONSPECIFIC CHEST PAIN,ESA001,HEMODIALYSIS,198,ANGINA PECTORIS & CORONARY ATHEROSCLEROSIS,05,DISEASES AND DISORDERS OF THE CIRCULATORY SYSTEM,2,Moderate,Major,Medical,Medicare,Medicare,,,,true,19896.89,6819.23
Hudson Valley,Orange,3522000,000694,St Luke's Cornwall Hospital/Newburgh,70 or Older,125,M,Other Race,Spanish/Hispanic,2,Emergency,Home or Self Care,2018,CIR012,NONSPECIFIC CHEST PAIN,,,198,ANGINA PECTORIS & CORONARY ATHEROSCLEROSIS,05,DISEASES AND DISORDERS OF THE CIRCULATORY SYSTEM,3,Major,Moderate,Medical,Medicare,Private Health Insurance,,,,true,18618.47,3815.56
New York City,Kings,7001037,001320,University Hospital of Brooklyn,50 to 69,112,M,Black/African American,Not Span/Hispanic,1,Emergency,Home or Self Care,2018,CIR012,NONSPECIFIC CHEST PAIN,MAM008,CARDIAC MONITORING,198,ANGINA PECTORIS & CORONARY ATHEROSCLEROSIS,05,DISEASES AND DISORDERS OF THE CIRCULATORY SYSTEM,1,Minor,Minor,Medical,Medicaid,Self-Pay,,,,true,6901,3570.03
New York City,Richmond,7004003,001740,Staten Island University Hosp-North,50 to 69,103,M,Black/African American,Not Span/Hispanic,1,Emergency,Home or Self Care,2018,CIR011,CORONARY ATHEROSCLEROSIS AND OTHER HEART DISEASE,MAM004,CARDIAC STRESS TESTS,198,ANGINA PECTORIS & CORONARY ATHEROSCLEROSIS,05,DISEASES AND DISORDERS OF THE CIRCULATORY SYSTEM,2,Moderate,Moderate,Medical,Medicaid,Medicaid,,,,true,17012.35,3530.84
Finger Lakes,Monroe,2701003,000411,Rochester General Hospital,70 or Older,146,F,White,Not Span/Hispanic,2,Emergency,Home or Self Care,2018,CIR012,NONSPECIFIC CHEST PAIN,,,198,ANGINA PECTORIS & CORONARY ATHEROSCLEROSIS,05,DISEASES AND DISORDERS OF THE CIRCULATORY SYSTEM,2,Moderate,Moderate,Medical,Medicare,,,,,true,20176.45,6538.76
New York City,Richmond,7004003,001740,Staten Island University Hosp-North,70 or Older,103,F,White,Not Span/Hispanic,1,Emergency,Home w/ Home Health Services,2018,CIR012,NONSPECIFIC CHEST PAIN,MAM006,PACEMAKER AND DEFIBRILLATOR INTERROGATION,198,ANGINA PECTORIS & CORONARY ATHEROSCLEROSIS,05,DISEASES AND DISORDERS OF THE CIRCULATORY SYSTEM,3,Major,Major,Medical,Medicare,Medicare,,,,true,12268,3082.57
New York City,Manhattan,7002054,001464,New York-Presbyterian Hospital - Columbia Presbyterian Center,70 or Older,104,F,Black/African American,Not Span/Hispanic,1,Emergency,Home w/ Home Health Services,2018,CIR012,NONSPECIFIC CHEST PAIN,,,198,ANGINA PECTORIS & CORONARY ATHEROSCLEROSIS,05,DISEASES AND DISORDERS OF THE CIRCULATORY SYSTEM,2,Moderate,Major,Medical,Medicare,Medicaid,Self-Pay,,,true,17586.3,3805.25
New York City,Bronx,7000006,003058,Montefiore Med Center - Jack D Weiler Hosp of A Einstein College Div,70 or Older,104,F,White,Not Span/Hispanic,4,Emergency,Skilled Nursing Home,2018,CIR011,CORONARY ATHEROSCLEROSIS AND OTHER HEART DISEASE,IMG008,ULTRASONOGRAPHY,198,ANGINA PECTORIS & CORONARY ATHEROSCLEROSIS,05,DISEASES AND DISORDERS OF THE CIRCULATORY SYSTEM,2,Moderate,Major,Medical,Medicare,,,,,true,46257.23,8459.98
New York City,Bronx,7000008,001172,Lincoln Medical & Mental Health Center,50 to 69,104,F,Other Race,Spanish/Hispanic,1,Emergency,Home or Self Care,2018,CIR012,NONSPECIFIC CHEST PAIN,,,198,ANGINA PECTORIS & CORONARY ATHEROSCLEROSIS,05,DISEASES AND DISORDERS OF THE CIRCULATORY SYSTEM,2,Moderate,Minor,Medical,Medicaid,Medicaid,,,,true,6918.24,4085.62
New York City,Bronx,7000008,001172,Lincoln Medical & Mental Health Center,70 or Older,104,M,Other Race,Not Span/Hispanic,1,Emergency,Home or Self Care,2018,CIR012,NONSPECIFIC CHEST PAIN,,,198,ANGINA PECTORIS & CORONARY ATHEROSCLEROSIS,05,DISEASES AND DISORDERS OF THE CIRCULATORY SYSTEM,2,Moderate,Minor,Medical,Medicare,Medicare,,,,true,7325.07,4325.87
New York City,Queens,7003004,001630,Long Island Jewish Medical Center,50 to 69,114,F,White,Spanish/Hispanic,1,Emergency,Home or Self Care,2018,CIR012,NONSPECIFIC CHEST PAIN,,,198,ANGINA PECTORIS & CORONARY ATHEROSCLEROSIS,05,DISEASES AND DISORDERS OF THE CIRCULATORY SYSTEM,2,Moderate,Moderate,Medical,Medicaid,Medicaid,Self-Pay,,,false,8576,1554.12
Hudson Valley,Westchester,5904001,001072,Montefiore New Rochelle Hospital,70 or Older,108,F,White,Not Span/Hispanic,1,Emergency,Home or Self Care,2018,CIR011,CORONARY ATHEROSCLEROSIS AND OTHER HEART DISEASE,MAM007,ELECTROCARDIOGRAM (ECG),198,ANGINA PECTORIS & CORONARY ATHEROSCLEROSIS,05,DISEASES AND DISORDERS OF THE CIRCULATORY SYSTEM,1,Minor,Minor,Medical,Blue Cross/Blue Shield,Medicare,Self-Pay,,,true,9211,2461.5
New York City,Queens,7003004,001630,Long Island Jewish Medical Center,70 or Older,114,M,White,Not Span/Hispanic,4,Emergency,Home w/ Home Health Services,2018,CIR012,NONSPECIFIC CHEST PAIN,,,198,ANGINA PECTORIS & CORONARY ATHEROSCLEROSIS,05,DISEASES AND DISORDERS OF THE CIRCULATORY SYSTEM,2,Moderate,Major,Medical,Medicare,Private Health Insurance,Self-Pay,,,false,56830.7,9042.96
Hudson Valley,Rockland,4329000,000779,Good Samaritan Hospital of Suffern,70 or Older,109,M,White,Not Span/Hispanic,1,Emergency,Home or Self Care,2018,CIR012,NONSPECIFIC CHEST PAIN,,,198,ANGINA PECTORIS & CORONARY ATHEROSCLEROSIS,05,DISEASES AND DISORDERS OF THE CIRCULATORY SYSTEM,1,Minor,Minor,Medical,Medicare,Private Health Insurance,,,,true,24302.89,3061.46
Hudson Valley,Westchester,5903001,001061,Montefiore Mount Vernon Hospital,70 or Older,105,M,Black/African American,Not Span/Hispanic,1,Emergency,Short-term Hospital,2018,CIR011,CORONARY ATHEROSCLEROSIS AND OTHER HEART DISEASE,,,198,ANGINA PECTORIS & CORONARY ATHEROSCLEROSIS,05,DISEASES AND DISORDERS OF THE CIRCULATORY SYSTEM,3,Major,Major,Medical,Medicare,Medicare,Private Health Insurance,,,true,8307.68,2950.02
Western NY,Wyoming,6027000,001153,Wyoming County Community Hospital,50 to 69,,M,Black/African American,Not Span/Hispanic,1,Emergency,Short-term Hospital,2018,CIR011,CORONARY ATHEROSCLEROSIS AND OTHER HEART DISEASE,,,198,ANGINA PECTORIS & CORONARY ATHEROSCLEROSIS,05,DISEASES AND DISORDERS OF THE CIRCULATORY SYSTEM,1,Minor,Minor,Medical,Department of Corrections,,,,,true,6577.97,5581.31
New York City,Kings,7001021,001306,New York - Presbyterian Brooklyn Methodist Hospital,50 to 69,112,M,Other Race,Not Span/Hispanic,1,Emergency,Home or Self Care,2018,CIR012,NONSPECIFIC CHEST PAIN,,,198,ANGINA PECTORIS & CORONARY ATHEROSCLEROSIS,05,DISEASES AND DISORDERS OF THE CIRCULATORY SYSTEM,2,Moderate,Moderate,Medical,Medicare,Medicare,Medicaid,,,true,8738.96,2039.49