Hospital Service Area,Hospital County,Operating Certificate Number,Permanent Facility Id,Facility Name,Age Group,Zip Code - 3 digits,Gender,Race,Ethnicity,Length of Stay,Type of Admission,Patient Disposition,Discharge Year,CCS Diagnosis Code,CCS Diagnosis Description,CCS Procedure Code,CCS Procedure Description,APR DRG Code,APR DRG Description,APR MDC Code,APR MDC Description,APR Severity of Illness Code,APR Severity of Illness Description,APR Risk of Mortality,APR Medical Surgical Description,Payment Typology 1,Payment Typology 2,Payment Typology 3,Birth Weight,Abortion Edit Indicator,Emergency Department Indicator,Total Charges,Total Costs
Long Island,Nassau,2951001,000541,North Shore University Hospital,70 or Older,114,F,Black/African American,Not Span/Hispanic,2,Emergency,Home or Self Care,2019,CIR012,NONSPECIFIC CHEST PAIN,,,198,ANGINA PECTORIS & CORONARY ATHEROSCLEROSIS,05,DISEASES AND DISORDERS OF THE CIRCULATORY SYSTEM,2,Moderate,Moderate,Medical,Medicare,Private Health Insurance,,,,true,37094.92,4889.39
Hudson Valley,Orange,3522000,000694,St Luke's Cornwall Hospital/Newburgh,70 or Older,125,M,White,Not Span/Hispanic,2,Emergency,Home or Self Care,2019,CIR011,CORONARY ATHEROSCLEROSIS AND OTHER HEART DISEASE,,,198,ANGINA PECTORIS & CORONARY ATHEROSCLEROSIS,05,DISEASES AND DISORDERS OF THE CIRCULATORY SYSTEM,2,Moderate,Major,Medical,Medicare,Private Health Insurance,,,,true,28164.31,6380.26
New York City,Manhattan,7002017,001450,Lenox Hill Hospital,50 to 69,100,M,Other Race,Spanish/Hispanic,1,Emergency,Home or Self Care,2019,CIR011,CORONARY ATHEROSCLEROSIS AND OTHER HEART DISEASE,,,198,ANGINA PECTORIS & CORONARY ATHEROSCLEROSIS,05,DISEASES AND DISORDERS OF THE CIRCULATORY SYSTEM,1,Minor,Minor,Medical,Private Health Insurance,,,,,true,18252,4136.97
Long Island,Suffolk,5151001,000245,Stony Brook University Hospital,50 to 69,117,M,White,Not Span/Hispanic,2,Emergency,Home or Self Care,2019,CIR011,CORONARY ATHEROSCLEROSIS AND OTHER HEART DISEASE,,,198,ANGINA PECTORIS & CORONARY ATHEROSCLEROSIS,05,DISEASES AND DISORDERS OF THE CIRCULATORY SYSTEM,2,Moderate,Minor,Medical,Blue Cross/Blue Shield,,,,,true,40088.19,10375.88
New York City,Manhattan,7002054,001458,New York-Presbyterian Hospital - New York Weill Cornell Center,70 or Older,112,F,Black/African American,Not Span/Hispanic,7,Emergency,Home w/ Home Health Services,2019,CIR011,CORONARY ATHEROSCLEROSIS AND OTHER HEART DISEASE,,,198,ANGINA PECTORIS & CORONARY ATHEROSCLEROSIS,05,DISEASES AND DISORDERS OF THE CIRCULATORY SYSTEM,3,Major,Major,Medical,Medicare,Medicare,Medicaid,,,true,92335.62,20806.56
Long Island,Suffolk,5151001,000245,Stony Brook University Hospital,70 or Older,119,F,White,Not Span/Hispanic,1,Emergency,Home or Self Care,2019,CIR011,CORONARY ATHEROSCLEROSIS AND OTHER HEART DISEASE,,,198,ANGINA PECTORIS & CORONARY ATHEROSCLEROSIS,05,DISEASES AND DISORDERS OF THE CIRCULATORY SYSTEM,1,Minor,Minor,Medical,Medicare,Private Health Insurance,,,,true,26185.94,5772.39
Western NY,Erie,1401013,000292,Sisters of Charity Hospital - St. Joseph Campus,50 to 69,142,M,Black/African American,Not Span/Hispanic,4,Emergency,Short-term Hospital,2019,CIR011,CORONARY ATHEROSCLEROSIS AND OTHER HEART DISEASE,,,198,ANGINA PECTORIS & CORONARY ATHEROSCLEROSIS,05,DISEASES AND DISORDERS OF THE CIRCULATORY SYSTEM,2,Moderate,Minor,Medical,Federal/State/Local/VA,Medicare,Medicare,,,true,18058.98,7466.13
New York City,Kings,7001016,001301,Kings County Hospital Center,50 to 69,112,M,Black/African American,Not Span/Hispanic,1,Emergency,Home or Self Care,2019,CIR012,NONSPECIFIC CHEST PAIN,,,198,ANGINA PECTORIS & CORONARY ATHEROSCLEROSIS,05,DISEASES AND DISORDERS OF THE CIRCULATORY SYSTEM,2,Moderate,Minor,Medical,Self-Pay,,,,,true,9506.5,6753.05
Central NY,Onondaga,3301008,000636,Crouse Hospital,70 or Older,132,M,White,Not Span/Hispanic,1,Emergency,Home w/ Home Health Services,2019,CIR011,CORONARY ATHEROSCLEROSIS AND OTHER HEART DISEASE,,,198,ANGINA PECTORIS & CORONARY ATHEROSCLEROSIS,05,DISEASES AND DISORDERS OF THE CIRCULATORY SYSTEM,2,Moderate,Moderate,Medical,Medicare,Medicare,Private Health Insurance,,,true,5618.86,2174.92
Finger Lakes,Monroe,2701003,000411,Rochester General Hospital,70 or Older,146,M,Other Race,Spanish/Hispanic,1,Emergency,Home or Self Care,2019,CIR011,CORONARY ATHEROSCLEROSIS AND OTHER HEART DISEASE,,,198,ANGINA PECTORIS & CORONARY ATHEROSCLEROSIS,05,DISEASES AND DISORDERS OF THE CIRCULATORY SYSTEM,3,Major,Major,Medical,Medicare,,,,,true,7030.59,2575.12
Central NY,Oneida,3202003,000599,Faxton-St Lukes Healthcare St Lukes Division,70 or Older,135,F,White,Not Span/Hispanic,6,Emergency,Short-term Hospital,2019,CIR011,CORONARY ATHEROSCLEROSIS AND OTHER HEART DISEASE,,,198,ANGINA PECTORIS & CORONARY ATHEROSCLEROSIS,05,DISEASES AND DISORDERS OF THE CIRCULATORY SYSTEM,3,Major,Moderate,Medical,Medicare,Blue Cross/Blue Shield,,,,true,37155.75,7932.97
New York City,Kings,7001003,001288,Brooklyn Hospital Center - Downtown Campus,70 or Older,112,F,Multi-racial,Unknown,3,Emergency,Home w/ Home Health Services,2019,CIR011,CORONARY ATHEROSCLEROSIS AND OTHER HEART DISEASE,,,198,ANGINA PECTORIS & CORONARY ATHEROSCLEROSIS,05,DISEASES AND DISORDERS OF THE CIRCULATORY SYSTEM,3,Major,Major,Medical,Medicare,Medicaid,Self-Pay,,,true,42792.84,7938.61
New York City,Manhattan,7002054,001458,New York-Presbyterian Hospital - New York Weill Cornell Center,50 to 69,100,F,White,Not Span/Hispanic,2,Emergency,Home or Self Care,2019,CIR011,CORONARY ATHEROSCLEROSIS AND OTHER HEART DISEASE,,,198,ANGINA PECTORIS & CORONARY ATHEROSCLEROSIS,05,DISEASES AND DISORDERS OF THE CIRCULATORY SYSTEM,3,Major,Minor,Medical,Medicare,Medicare,Self-Pay,,,true,41351.02,9438.74
New York City,Manhattan,7002017,001450,Lenox Hill Hospital,70 or Older,100,F,Black/African American,Not Span/Hispanic,2,Emergency,Home w/ Home Health Services,2019,CIR012,NONSPECIFIC CHEST PAIN,,,198,ANGINA PECTORIS & CORONARY ATHEROSCLEROSIS,05,DISEASES AND DISORDERS OF THE CIRCULATORY SYSTEM,2,Moderate,Moderate,Medical,Medicare,Medicaid,,,,true,45139,10022.28
Long Island,Nassau,2908000,000511,NYU Langone Hospital-Long Island,70 or Older,115,F,Black/African American,Not Span/Hispanic,3,Emergency,Home w/ Home Health Services,2019,CIR012,NONSPECIFIC CHEST PAIN,MAM004,CARDIAC STRESS TESTS,198,ANGINA PECTORIS & CORONARY ATHEROSCLEROSIS,05,DISEASES AND DISORDERS OF THE CIRCULATORY SYSTEM,2,Moderate,Major,Medical,Medicare,Medicare,Private Health Insurance,,,true,68120.43,12304.02
New York City,Manhattan,7002054,001458,New York-Presbyterian Hospital - New York Weill Cornell Center,70 or Older,112,F,Other Race,Not Span/Hispanic,1,Emergency,Home w/ Home Health Services,2019,CIR011,CORONARY ATHEROSCLEROSIS AND OTHER HEART DISEASE,ADM021,"ADMINISTRATION OF THERAPEUTIC SUBSTANCES, NEC",198,ANGINA PECTORIS & CORONARY ATHEROSCLEROSIS,05,DISEASES AND DISORDERS OF THE CIRCULATORY SYSTEM,2,Moderate,Moderate,Medical,Medicaid,Self-Pay,,,,true,33028.86,11531.94
Central NY,Tompkins,5401001,000977,Cayuga Medical Center at Ithaca,50 to 69,148,F,White,Not Span/Hispanic,2,Emergency,Home or Self Care,2019,CIR012,NONSPECIFIC CHEST PAIN,MAM004,CARDIAC STRESS TESTS,198,ANGINA PECTORIS & CORONARY ATHEROSCLEROSIS,05,DISEASES AND DISORDERS OF THE CIRCULATORY SYSTEM,2,Moderate,Minor,Medical,Medicare,Medicaid,Self-Pay,,,true,8167.13,4523.75
New York City,Manhattan,7002001,001438,Bellevue Hospital Center,50 to 69,OOS,F,Black/African American,Not Span/Hispanic,1,Emergency,Home or Self Care,2019,CIR012,NONSPECIFIC CHEST PAIN,ADM007,INTRAVENOUS INDUCTION OF LABOR,198,ANGINA PECTORIS & CORONARY ATHEROSCLEROSIS,05,DISEASES AND DISORDERS OF THE CIRCULATORY SYSTEM,3,Major,Moderate,Medical,Medicaid,,,,,true,7461.75,4959.08
Western NY,Erie,1401005,000210,Erie County Medical Center,50 to 69,142,F,Black/African American,Not Span/Hispanic,3,Emergency,Home or Self Care,2019,CIR011,CORONARY ATHEROSCLEROSIS AND OTHER HEART DISEASE,,,198,ANGINA PECTORIS & CORONARY ATHEROSCLEROSIS,05,DISEASES AND DISORDERS OF THE CIRCULATORY SYSTEM,2,Moderate,Minor,Medical,Medicaid,Medicaid,,,,true,16021.49,7007.83
Hudson Valley,Westchester,5922000,001122,New York - Presbyterian Hospital,70 or Older,105,M,White,Not Span/Hispanic,1,Emergency,Home or Self Care,2019,CIR012,NONSPECIFIC CHEST PAIN,,,198,ANGINA PECTORIS & CORONARY ATHEROSCLEROSIS,05,DISEASES AND DISORDERS OF THE CIRCULATORY SYSTEM,1,Minor,Minor,Medical,Medicare,Medicare,Medicaid,,,true,17358.85,5487.63
New York City,Manhattan,7002001,001438,Bellevue Hospital Center,50 to 69,117,M,Black/African American,Not Span/Hispanic,1,Elective,Left Against Medical Advice,2019,CIR012,NONSPECIFIC CHEST PAIN,MAM007,ELECTROCARDIOGRAM (ECG),198,ANGINA PECTORIS & CORONARY ATHEROSCLEROSIS,05,DISEASES AND DISORDERS OF THE CIRCULATORY SYSTEM,2,Moderate,Minor,Medical,Medicaid,,,,,true,7364.55,4894.48
New York City,Manhattan,7002001,001438,Bellevue Hospital Center,50 to 69,117,M,Black/African American,Not Span/Hispanic,2,Emergency,Left Against Medical Advice,2019,CIR012,NONSPECIFIC CHEST PAIN,SUD001,SUBSTANCE USE DETOXIFICATION,198,ANGINA PECTORIS & CORONARY ATHEROSCLEROSIS,05,DISEASES AND DISORDERS OF THE CIRCULATORY SYSTEM,2,Moderate,Minor,Medical,Medicaid,,,,,true,16196.34,10764.09
New York City,Manhattan,7002001,001438,Bellevue Hospital Center,30 to 49,100,M,White,Not Span/Hispanic,4,Emergency,Home or Self Care,2019,CIR011,CORONARY ATHEROSCLEROSIS AND OTHER HEART DISEASE,MAM006,PACEMAKER AND DEFIBRILLATOR INTERROGATION,198,ANGINA PECTORIS & CORONARY ATHEROSCLEROSIS,05,DISEASES AND DISORDERS OF THE CIRCULATORY SYSTEM,3,Major,Moderate,Medical,Private Health Insurance,Medicaid,,,,true,23292.78,15480.38
Finger Lakes,Wayne,5820000,001028,Newark-Wayne Community Hospital,70 or Older,145,F,White,Not Span/Hispanic,4,Emergency,Short-term Hospital,2019,CIR012,NONSPECIFIC CHEST PAIN,,,198,ANGINA PECTORIS & CORONARY ATHEROSCLEROSIS,05,DISEASES AND DISORDERS OF THE CIRCULATORY SYSTEM,2,Moderate,Minor,Medical,Medicare,,,,,true,12465.97,3695.12
New York City,Bronx,7000006,001169,Montefiore Medical Center - Henry & Lucy Moses Div,50 to 69,104,F,Black/African American,Not Span/Hispanic,1,Emergency,Left Against Medical Advice,2019,CIR012,NONSPECIFIC CHEST PAIN,,,198,ANGINA PECTORIS & CORONARY ATHEROSCLEROSIS,05,DISEASES AND DISORDERS OF THE CIRCULATORY SYSTEM,2,Moderate,Moderate,Medical,Private Health Insurance,,,,,true,17823.74,2807.93
New York City,Kings,7001021,001306,New York - Presbyterian Brooklyn Methodist Hospital,50 to 69,112,M,White,Not Span/Hispanic,1,Emergency,Left Against Medical Advice,2019,CIR012,NONSPECIFIC CHEST PAIN,,,198,ANGINA PECTORIS & CORONARY ATHEROSCLEROSIS,05,DISEASES AND DISORDERS OF THE CIRCULATORY SYSTEM,2,Moderate,Moderate,Medical,Medicare,Self-Pay,,,,true,9540.64,2204.7
New York City,Bronx,7000006,001169,Montefiore Medical Center - Henry & Lucy Moses Div,50 to 69,104,F,Other Race,Spanish/Hispanic,1,Emergency,Home or Self Care,2019,CIR011,CORONARY ATHEROSCLEROSIS AND OTHER HEART DISEASE,,,198,ANGINA PECTORIS & CORONARY ATHEROSCLEROSIS,05,DISEASES AND DISORDERS OF THE CIRCULATORY SYSTEM,2,Moderate,Moderate,Medical,Private Health Insurance,,,,,true,21546.65,3813.09
Western NY,Erie,1401014,003067,Millard Fillmore Suburban Hospital,70 or Older,142,F,White,Not Span/Hispanic,2,Emergency,Home w/ Home Health Services,2019,CIR011,CORONARY ATHEROSCLEROSIS AND OTHER HEART DISEASE,,,198,ANGINA PECTORIS & CORONARY ATHEROSCLEROSIS,05,DISEASES AND DISORDERS OF THE CIRCULATORY SYSTEM,2,Moderate,Moderate,Medical,Blue Cross/Blue Shield,Self-Pay,,,,true,14959.13,5371.43
Hudson Valley,Ulster,5501001,000990,HealthAlliance Hospital Broadway Campus,50 to 69,124,F,White,Not Span/Hispanic,9,Emergency,Skilled Nursing Home,2019,CIR012,NONSPECIFIC CHEST PAIN,,,198,ANGINA PECTORIS & CORONARY ATHEROSCLEROSIS,05,DISEASES AND DISORDERS OF THE CIRCULATORY SYSTEM,3,Major,Moderate,Medical,Medicare,Medicare,,,,true,100233.32,15251.69
New York City,Manhattan,7002001,001438,Bellevue Hospital Center,70 or Older,112,F,Other Race,Not Span/Hispanic,1,Emergency,Home or Self Care,2019,CIR011,CORONARY ATHEROSCLEROSIS AND OTHER HEART DISEASE,IMG008,ULTRASONOGRAPHY,198,ANGINA PECTORIS & CORONARY ATHEROSCLEROSIS,05,DISEASES AND DISORDERS OF THE CIRCULATORY SYSTEM,1,Minor,Minor,Medical,Medicare,Medicare,Medicaid,,,false,12040.88,8002.37
New York City,Kings,7001021,001306,New York - Presbyterian Brooklyn Methodist Hospital,70 or Older,112,M,White,Not Span/Hispanic,2,Emergency,Home or Self Care,2019,CIR012,NONSPECIFIC CHEST PAIN,,,198,ANGINA PECTORIS & CORONARY ATHEROSCLEROSIS,05,DISEASES AND DISORDERS OF THE CIRCULATORY SYSTEM,2,Moderate,Moderate,Medical,Medicare,Private Health Insurance,Self-Pay,,,true,21960.8,4931.39
New York City,Kings,7002053,001304,NYU Langone Hospital-Brooklyn,50 to 69,112,F,Other Race,Not Span/Hispanic,1,Emergency,Home or Self Care,2019,CIR011,CORONARY ATHEROSCLEROSIS AND OTHER HEART DISEASE,MAM004,CARDIAC STRESS TESTS,198,ANGINA PECTORIS & CORONARY ATHEROSCLEROSIS,05,DISEASES AND DISORDERS OF THE CIRCULATORY SYSTEM,1,Minor,Minor,Medical,Medicaid,,,,,true,25741.36,5715.21
Capital/Adirond,Albany,0101000,000001,Albany Medical Center Hospital,70 or Older,121,M,White,Not Span/Hispanic,2,Emergency,Home or Self Care,2019,CIR012,NONSPECIFIC CHEST PAIN,,,198,ANGINA PECTORIS & CORONARY ATHEROSCLEROSIS,05,DISEASES AND DISORDERS OF THE CIRCULATORY SYSTEM,2,Moderate,Moderate,Medical,Medicare,Blue Cross/Blue Shield,,,,true,15098.54,3885.05
Hudson Valley,Westchester,5932000,001129,Phelps Hospital,50 to 69,105,M,White,Not Span/Hispanic,1,Emergency,Short-term Hospital,2019,CIR011,CORONARY ATHEROSCLEROSIS AND OTHER HEART DISEASE,,,198,ANGINA PECTORIS & CORONARY ATHEROSCLEROSIS,05,DISEASES AND DISORDERS OF THE CIRCULATORY SYSTEM,2,Moderate,Minor,Medical,Medicare,Federal/State/Local/VA,,,,true,17787.46,5083.63
New York City,Kings,7001002,001286,Brookdale Hospital Medical Center,50 to 69,112,M,Black/African American,Not Span/Hispanic,1,Emergency,Left Against Medical Advice,2019,CIR011,CORONARY ATHEROSCLEROSIS AND OTHER HEART DISEASE,,,198,ANGINA PECTORIS & CORONARY ATHEROSCLEROSIS,05,DISEASES AND DISORDERS OF THE CIRCULATORY SYSTEM,2,Moderate,Moderate,Medical,Medicaid,,,,,true,5116.19,2610.48
Capital/Adirond,Warren,5601000,001005,Glens Falls Hospital,30 to 49,128,M,White,Not Span/Hispanic,1,Emergency,Court/Law Enforcement,2019,CIR012,NONSPECIFIC CHEST PAIN,,,198,ANGINA PECTORIS & CORONARY ATHEROSCLEROSIS,05,DISEASES AND DISORDERS OF THE CIRCULATORY SYSTEM,3,Major,Moderate,Medical,Department of Corrections,Medicaid,,,,true,12577.53,4793.77
New York City,Manhattan,7002021,001454,Metropolitan Hospital Center,50 to 69,,M,Other Race,Not Span/Hispanic,2,Emergency,Home or Self Care,2019,CIR012,NONSPECIFIC CHEST PAIN,ADM021,"ADMINISTRATION OF THERAPEUTIC SUBSTANCES, NEC",198,ANGINA PECTORIS & CORONARY ATHEROSCLEROSIS,05,DISEASES AND DISORDERS OF THE CIRCULATORY SYSTEM,1,Minor,Minor,Medical,Medicaid,,,,,true,18525.17,14967.41
New York City,Manhattan,7002054,001458,New York-Presbyterian Hospital - New York Weill Cornell Center,50 to 69,112,M,Black/African American,Not Span/Hispanic,4,Emergency,Home or Self Care,2019,CIR011,CORONARY ATHEROSCLEROSIS AND OTHER HEART DISEASE,IMG008,ULTRASONOGRAPHY,198,ANGINA PECTORIS & CORONARY ATHEROSCLEROSIS,05,DISEASES AND DISORDERS OF THE CIRCULATORY SYSTEM,2,Moderate,Minor,Medical,Blue Cross/Blue Shield,Self-Pay,,,,true,58488.22,17809.15
Capital/Adirond,Columbia,1001000,000146,Columbia Memorial Hospital,70 or Older,120,M,White,Not Span/Hispanic,1,Elective,Another Type Not Listed,2019,CIR011,CORONARY ATHEROSCLEROSIS AND OTHER HEART DISEASE,,,198,ANGINA PECTORIS & CORONARY ATHEROSCLEROSIS,05,DISEASES AND DISORDERS OF THE CIRCULATORY SYSTEM,1,Minor,Moderate,Medical,Medicare,Blue Cross/Blue Shield,,,,true,12168.73,3070.53
New York City,Bronx,7000006,003058,Montefiore Med Center - Jack D Weiler Hosp of A Einstein College Div,30 to 49,104,F,Other Race,Spanish/Hispanic,1,Emergency,Home or Self Care,2019,CIR012,NONSPECIFIC CHEST PAIN,,,198,ANGINA PECTORIS & CORONARY ATHEROSCLEROSIS,05,DISEASES AND DISORDERS OF THE CIRCULATORY SYSTEM,2,Moderate,Minor,Medical,Medicaid,,,,,true,23351.87,3182.62
New York City,Bronx,7000002,001165,Jacobi Medical Center,50 to 69,104,M,Other Race,Not Span/Hispanic,1,Emergency,Short-term Hospital,2019,CIR011,CORONARY ATHEROSCLEROSIS AND OTHER HEART DISEASE,,,198,ANGINA PECTORIS & CORONARY ATHEROSCLEROSIS,05,DISEASES AND DISORDERS OF THE CIRCULATORY SYSTEM,3,Major,Moderate,Medical,Medicaid,Medicaid,,,,true,8320.85,4923.03
New York City,Bronx,7000006,003058,Montefiore Med Center - Jack D Weiler Hosp of A Einstein College Div,70 or Older,104,M,Black/African American,Spanish/Hispanic,3,Emergency,Home w/ Home Health Services,2019,CIR012,NONSPECIFIC CHEST PAIN,,,198,ANGINA PECTORIS & CORONARY ATHEROSCLEROSIS,05,DISEASES AND DISORDERS OF THE CIRCULATORY SYSTEM,1,Minor,Moderate,Medical,Medicare,Federal/State/Local/VA,,,,true,37766.48,7184.3
New York City,Kings,7001046,001309,Interfaith Medical Center,50 to 69,112,M,Black/African American,Not Span/Hispanic,3,Emergency,Home or Self Care,2019,CIR012,NONSPECIFIC CHEST PAIN,,,198,ANGINA PECTORIS & CORONARY ATHEROSCLEROSIS,05,DISEASES AND DISORDERS OF THE CIRCULATORY SYSTEM,1,Minor,Minor,Medical,Medicaid,Medicaid,,,,true,18204.15,7583.52
New York City,Kings,7001033,001315,Kingsbrook Jewish Medical Center,70 or Older,112,F,Black/African American,Not Span/Hispanic,1,Emergency,Short-term Hospital,2019,CIR011,CORONARY ATHEROSCLEROSIS AND OTHER HEART DISEASE,,,198,ANGINA PECTORIS & CORONARY ATHEROSCLEROSIS,05,DISEASES AND DISORDERS OF THE CIRCULATORY SYSTEM,2,Moderate,Moderate,Medical,Medicare,Self-Pay,,,,true,11836,3444.35
Western NY,Erie,1401014,003067,Millard Fillmore Suburban Hospital,70 or Older,140,F,White,Not Span/Hispanic,2,Emergency,Home or Self Care,2019,CIR011,CORONARY ATHEROSCLEROSIS AND OTHER HEART DISEASE,,,198,ANGINA PECTORIS & CORONARY ATHEROSCLEROSIS,05,DISEASES AND DISORDERS OF THE CIRCULATORY SYSTEM,1,Minor,Moderate,Medical,Medicare,Medicaid,Self-Pay,,,true,9080.06,2658.44
Western NY,Erie,1401014,003067,Millard Fillmore Suburban Hospital,70 or Older,140,M,White,Not Span/Hispanic,1,Emergency,Home or Self Care,2019,CIR012,NONSPECIFIC CHEST PAIN,,,198,ANGINA PECTORIS & CORONARY ATHEROSCLEROSIS,05,DISEASES AND DISORDERS OF THE CIRCULATORY SYSTEM,2,Moderate,Major,Medical,Medicare,Private Health Insurance,Self-Pay,,,true,13354.06,4081.15
New York City,Richmond,7004003,001737,Staten Island University Hospital Prince's Bay,30 to 49,103,M,White,Spanish/Hispanic,1,Emergency,Home or Self Care,2019,CIR012,NONSPECIFIC CHEST PAIN,,,198,ANGINA PECTORIS & CORONARY ATHEROSCLEROSIS,05,DISEASES AND DISORDERS OF THE CIRCULATORY SYSTEM,2,Moderate,Moderate,Medical,Blue Cross/Blue Shield,,,,,true,14662.16,3440.47
New York City,Richmond,7004003,001737,Staten Island University Hospital Prince's Bay,50 to 69,103,M,White,Not Span/Hispanic,1,Emergency,Home or Self Care,2019,CIR012,NONSPECIFIC CHEST PAIN,,,198,ANGINA PECTORIS & CORONARY ATHEROSCLEROSIS,05,DISEASES AND DISORDERS OF THE CIRCULATORY SYSTEM,1,Minor,Minor,Medical,Medicare,Blue Cross/Blue Shield,,,,false,9073.58,2431.09
New York City,Queens,7001024,001635,St Johns Episcopal Hospital So Shore,50 to 69,116,M,Other Race,Not Span/Hispanic,4,Emergency,Home or Self Care,2019,CIR011,CORONARY ATHEROSCLEROSIS AND OTHER HEART DISEASE,,,198,ANGINA PECTORIS & CORONARY ATHEROSCLEROSIS,05,DISEASES AND DISORDERS OF THE CIRCULATORY SYSTEM,1,Minor,Minor,Medical,Medicaid,,,,,true,29885.43,9206.21
New York City,Kings,7001021,001306,New York - Presbyterian Brooklyn Methodist Hospital,50 to 69,112,M,Black/African American,Not Span/Hispanic,2,Emergency,Home or Self Care,2019,CIR012,NONSPECIFIC CHEST PAIN,,,198,ANGINA PECTORIS & CORONARY ATHEROSCLEROSIS,05,DISEASES AND DISORDERS OF THE CIRCULATORY SYSTEM,1,Minor,Minor,Medical,Medicaid,Self-Pay,,,,true,19661.1,4503.46
New York City,Bronx,7000006,001169,Montefiore Medical Center - Henry & Lucy Moses Div,50 to 69,110,M,Black/African American,Not Span/Hispanic,8,Emergency,Home or Self Care,2019,CIR012,NONSPECIFIC CHEST PAIN,ADM021,"ADMINISTRATION OF THERAPEUTIC SUBSTANCES, NEC",198,ANGINA PECTORIS & CORONARY ATHEROSCLEROSIS,05,DISEASES AND DISORDERS OF THE CIRCULATORY SYSTEM,3,Major,Moderate,Medical,Medicaid,,,,,true,79021.77,15952.67
Long Island,Nassau,2950001,000527,Mount Sinai South Nassau,70 or Older,115,F,White,Not Span/Hispanic,1,Emergency,Home w/ Home Health Services,2019,CIR012,NONSPECIFIC CHEST PAIN,,,198,ANGINA PECTORIS & CORONARY ATHEROSCLEROSIS,05,DISEASES AND DISORDERS OF THE CIRCULATORY SYSTEM,1,Minor,Moderate,Medical,Medicare,Medicare,,,,true,16967.93,2554.1
Capital/Adirond,Albany,0101004,000005,St. Peter's Hospital,30 to 49,121,F,White,Not Span/Hispanic,1,Elective,Home or Self Care,2019,CIR012,NONSPECIFIC CHEST PAIN,,,198,ANGINA PECTORIS & CORONARY ATHEROSCLEROSIS,05,DISEASES AND DISORDERS OF THE CIRCULATORY SYSTEM,1,Minor,Minor,Medical,Medicare,Private Health Insurance,,,,false,12216.95,4013.45
Central NY,Tompkins,5401001,000977,Cayuga Medical Center at Ithaca,50 to 69,148,M,White,Not Span/Hispanic,1,Emergency,Home or Self Care,2019,CIR011,CORONARY ATHEROSCLEROSIS AND OTHER HEART DISEASE,,,198,ANGINA PECTORIS & CORONARY ATHEROSCLEROSIS,05,DISEASES AND DISORDERS OF THE CIRCULATORY SYSTEM,2,Moderate,Moderate,Medical,Medicaid,Self-Pay,Self-Pay,,,true,4390.16,3059.33
Capital/Adirond,Albany,0101004,000005,St. Peter's Hospital,50 to 69,121,M,White,Not Span/Hispanic,6,Emergency,Home or Self Care,2019,CIR012,NONSPECIFIC CHEST PAIN,IMG008,ULTRASONOGRAPHY,198,ANGINA PECTORIS & CORONARY ATHEROSCLEROSIS,05,DISEASES AND DISORDERS OF THE CIRCULATORY SYSTEM,4,Extreme,Major,Medical,Medicare,Medicare,,,,true,53528.72,17481.35
New York City,Kings,7001002,001286,Brookdale Hospital Medical Center,50 to 69,112,M,Black/African American,Not Span/Hispanic,1,Emergency,Left Against Medical Advice,2019,CIR011,CORONARY ATHEROSCLEROSIS AND OTHER HEART DISEASE,,,198,ANGINA PECTORIS & CORONARY ATHEROSCLEROSIS,05,DISEASES AND DISORDERS OF THE CIRCULATORY SYSTEM,2,Moderate,Moderate,Medical,Medicare,Self-Pay,,,,true,11940.74,5203.04
New York City,Kings,7001002,001286,Brookdale Hospital Medical Center,50 to 69,112,M,Other Race,Unknown,1,Emergency,Home or Self Care,2019,CIR011,CORONARY ATHEROSCLEROSIS AND OTHER HEART DISEASE,,,198,ANGINA PECTORIS & CORONARY ATHEROSCLEROSIS,05,DISEASES AND DISORDERS OF THE CIRCULATORY SYSTEM,1,Minor,Minor,Medical,Medicaid,,,,,true,12694.34,5518.38
New York City,Bronx,7000006,001169,Montefiore Medical Center - Henry & Lucy Moses Div,50 to 69,104,M,White,Not Span/Hispanic,1,Emergency,Home or Self Care,2019,CIR012,NONSPECIFIC CHEST PAIN,,,198,ANGINA PECTORIS & CORONARY ATHEROSCLEROSIS,05,DISEASES AND DISORDERS OF THE CIRCULATORY SYSTEM,2,Moderate,Moderate,Medical,Medicare,Medicaid,,,,true,27425.89,3773.91
New York City,Manhattan,7002001,001438,Bellevue Hospital Center,70 or Older,100,M,White,Not Span/Hispanic,71,Emergency,Skilled Nursing Home,2019,CIR011,CORONARY ATHEROSCLEROSIS AND OTHER HEART DISEASE,ADM021,"ADMINISTRATION OF THERAPEUTIC SUBSTANCES, NEC",198,ANGINA PECTORIS & CORONARY ATHEROSCLEROSIS,05,DISEASES AND DISORDERS OF THE CIRCULATORY SYSTEM,4,Extreme,Extreme,Medical,Medicare,Medicare,,,,true,351036.35,233298.76
New York City,Kings,7001021,001306,New York - Presbyterian Brooklyn Methodist Hospital,70 or Older,112,F,White,Not Span/Hispanic,1,Emergency,Home or Self Care,2019,CIR011,CORONARY ATHEROSCLEROSIS AND OTHER HEART DISEASE,,,198,ANGINA PECTORIS & CORONARY ATHEROSCLEROSIS,05,DISEASES AND DISORDERS OF THE CIRCULATORY SYSTEM,2,Moderate,Moderate,Medical,Medicare,Medicaid,Self-Pay,,,true,8227.15,2066.18