Hospital Service Area,Hospital County,Operating Certificate Number,Permanent Facility Id,Facility Name,Age Group,Zip Code - 3 digits,Gender,Race,Ethnicity,Length of Stay,Type of Admission,Patient Disposition,Discharge Year,CCS Diagnosis Code,CCS Diagnosis Description,CCS Procedure Code,CCS Procedure Description,APR DRG Code,APR DRG Description,APR MDC Code,APR MDC Description,APR Severity of Illness Code,APR Severity of Illness Description,APR Risk of Mortality,APR Medical Surgical Description,Payment Typology 1,Payment Typology 2,Payment Typology 3,Birth Weight,Abortion Edit Indicator,Emergency Department Indicator,Total Charges,Total Costs
New York City,Kings,7002053,001304,NYU Langone Hospital-Brooklyn,70 or Older,112,M,Black/African American,Not Span/Hispanic,2,Emergency,Home w/ Home Health Services,2020,CIR011,CORONARY ATHEROSCLEROSIS AND OTHER HEART DISEASE,,,198,ANGINA PECTORIS & CORONARY ATHEROSCLEROSIS,05,DISEASES AND DISORDERS OF THE CIRCULATORY SYSTEM,2,Moderate,Major,Medical,Medicare,Medicaid,,,,Y,20564.98,7194.87
New York City,Kings,7002053,001304,NYU Langone Hospital-Brooklyn,70 or Older,112,M,White,Spanish/Hispanic,4,Emergency,Short-term Hospital,2020,CIR011,CORONARY ATHEROSCLEROSIS AND OTHER HEART DISEASE,,,198,ANGINA PECTORIS & CORONARY ATHEROSCLEROSIS,05,DISEASES AND DISORDERS OF THE CIRCULATORY SYSTEM,2,Moderate,Moderate,Medical,Private Health Insurance,,,,,Y,49301.24,14958.15
New York City,Kings,7002053,001304,NYU Langone Hospital-Brooklyn,70 or Older,103,M,Other Race,Not Span/Hispanic,1,Emergency,Home w/ Home Health Services,2020,CIR012,NONSPECIFIC CHEST PAIN,,,198,ANGINA PECTORIS & CORONARY ATHEROSCLEROSIS,05,DISEASES AND DISORDERS OF THE CIRCULATORY SYSTEM,1,Minor,Minor,Medical,Medicare,Medicaid,,,,Y,36929.31,9692.11
New York City,Kings,7002053,001304,NYU Langone Hospital-Brooklyn,70 or Older,103,F,White,Not Span/Hispanic,3,Emergency,Home or Self Care,2020,CIR011,CORONARY ATHEROSCLEROSIS AND OTHER HEART DISEASE,IMG008,ULTRASONOGRAPHY,198,ANGINA PECTORIS & CORONARY ATHEROSCLEROSIS,05,DISEASES AND DISORDERS OF THE CIRCULATORY SYSTEM,2,Moderate,Moderate,Medical,Private Health Insurance,Medicaid,,,,Y,51185.21,12438.11
New York City,Kings,7002053,001304,NYU Langone Hospital-Brooklyn,70 or Older,112,F,Other Race,Not Span/Hispanic,2,Emergency,Home or Self Care,2020,CIR011,CORONARY ATHEROSCLEROSIS AND OTHER HEART DISEASE,,,198,ANGINA PECTORIS & CORONARY ATHEROSCLEROSIS,05,DISEASES AND DISORDERS OF THE CIRCULATORY SYSTEM,2,Moderate,Minor,Medical,Medicare,Medicaid,,,,Y,29038.34,7728.78
New York City,Kings,7002053,001304,NYU Langone Hospital-Brooklyn,70 or Older,112,F,Other Race,Spanish/Hispanic,2,Emergency,Home or Self Care,2020,CIR011,CORONARY ATHEROSCLEROSIS AND OTHER HEART DISEASE,,,198,ANGINA PECTORIS & CORONARY ATHEROSCLEROSIS,05,DISEASES AND DISORDERS OF THE CIRCULATORY SYSTEM,3,Major,Major,Medical,Medicaid,,,,,Y,32632.98,8175.19
New York City,Kings,7002053,001304,NYU Langone Hospital-Brooklyn,50 to 69,112,M,White,Spanish/Hispanic,1,Emergency,Home or Self Care,2020,CIR011,CORONARY ATHEROSCLEROSIS AND OTHER HEART DISEASE,,,198,ANGINA PECTORIS & CORONARY ATHEROSCLEROSIS,05,DISEASES AND DISORDERS OF THE CIRCULATORY SYSTEM,1,Minor,Moderate,Medical,Medicaid,,,,,Y,17472.6,4422.45
New York City,Kings,7002053,001304,NYU Langone Hospital-Brooklyn,70 or Older,112,F,Other Race,Not Span/Hispanic,2,Emergency,Home w/ Home Health Services,2020,CIR011,CORONARY ATHEROSCLEROSIS AND OTHER HEART DISEASE,,,198,ANGINA PECTORIS & CORONARY ATHEROSCLEROSIS,05,DISEASES AND DISORDERS OF THE CIRCULATORY SYSTEM,2,Moderate,Moderate,Medical,Medicare,,,,,Y,36503.11,8718.64
New York City,Kings,7002053,001304,NYU Langone Hospital-Brooklyn,50 to 69,112,M,Other Race,Spanish/Hispanic,2,Emergency,Home or Self Care,2020,CIR012,NONSPECIFIC CHEST PAIN,,,198,ANGINA PECTORIS & CORONARY ATHEROSCLEROSIS,05,DISEASES AND DISORDERS OF THE CIRCULATORY SYSTEM,1,Minor,Minor,Medical,Medicaid,,,,,Y,46049.63,9807.46
New York City,Kings,7002053,001304,NYU Langone Hospital-Brooklyn,50 to 69,112,M,White,Not Span/Hispanic,1,Emergency,Home or Self Care,2020,CIR012,NONSPECIFIC CHEST PAIN,,,198,ANGINA PECTORIS & CORONARY ATHEROSCLEROSIS,05,DISEASES AND DISORDERS OF THE CIRCULATORY SYSTEM,1,Minor,Minor,Medical,Blue Cross/Blue Shield,,,,,Y,40036.36,9535.1
New York City,Kings,7002053,001304,NYU Langone Hospital-Brooklyn,30 to 49,112,M,Other Race,Unknown,1,Emergency,Home or Self Care,2020,CIR011,CORONARY ATHEROSCLEROSIS AND OTHER HEART DISEASE,,,198,ANGINA PECTORIS & CORONARY ATHEROSCLEROSIS,05,DISEASES AND DISORDERS OF THE CIRCULATORY SYSTEM,1,Minor,Minor,Medical,Medicaid,,,,,Y,46740.41,11271.07
New York City,Kings,7002053,001304,NYU Langone Hospital-Brooklyn,70 or Older,112,M,White,Not Span/Hispanic,2,Emergency,Home w/ Home Health Services,2020,CIR012,NONSPECIFIC CHEST PAIN,,,198,ANGINA PECTORIS & CORONARY ATHEROSCLEROSIS,05,DISEASES AND DISORDERS OF THE CIRCULATORY SYSTEM,2,Moderate,Major,Medical,Medicare,Private Health Insurance,,,,Y,30926.42,8320.56
New York City,Kings,7002053,001304,NYU Langone Hospital-Brooklyn,50 to 69,112,F,Other Race,Not Span/Hispanic,2,Emergency,Home w/ Home Health Services,2020,CIR011,CORONARY ATHEROSCLEROSIS AND OTHER HEART DISEASE,,,198,ANGINA PECTORIS & CORONARY ATHEROSCLEROSIS,05,DISEASES AND DISORDERS OF THE CIRCULATORY SYSTEM,2,Moderate,Moderate,Medical,Private Health Insurance,Medicaid,,,,Y,29854.19,8119.34
New York City,Kings,7002053,001304,NYU Langone Hospital-Brooklyn,70 or Older,112,M,White,Not Span/Hispanic,5,Emergency,Skilled Nursing Home,2020,CIR011,CORONARY ATHEROSCLEROSIS AND OTHER HEART DISEASE,,,198,ANGINA PECTORIS & CORONARY ATHEROSCLEROSIS,05,DISEASES AND DISORDERS OF THE CIRCULATORY SYSTEM,3,Major,Major,Medical,Medicare,Blue Cross/Blue Shield,,,,Y,60605.79,18472.9
New York City,Kings,7002053,001304,NYU Langone Hospital-Brooklyn,50 to 69,112,M,White,Spanish/Hispanic,1,Emergency,Home or Self Care,2020,CIR012,NONSPECIFIC CHEST PAIN,ADM021,"ADMINISTRATION OF THERAPEUTIC SUBSTANCES, NEC",198,ANGINA PECTORIS & CORONARY ATHEROSCLEROSIS,05,DISEASES AND DISORDERS OF THE CIRCULATORY SYSTEM,2,Moderate,Minor,Medical,Medicaid,,,,,Y,38086.16,8717.01
New York City,Kings,7002053,001304,NYU Langone Hospital-Brooklyn,50 to 69,112,M,Black/African American,Not Span/Hispanic,5,Emergency,Home w/ Home Health Services,2020,CIR011,CORONARY ATHEROSCLEROSIS AND OTHER HEART DISEASE,ESA001,HEMODIALYSIS,198,ANGINA PECTORIS & CORONARY ATHEROSCLEROSIS,05,DISEASES AND DISORDERS OF THE CIRCULATORY SYSTEM,3,Major,Major,Medical,Medicare,Medicaid,,,,Y,97117.86,22457.07
New York City,Kings,7002053,001304,NYU Langone Hospital-Brooklyn,30 to 49,103,M,Other Race,Spanish/Hispanic,3,Emergency,Home or Self Care,2020,CIR012,NONSPECIFIC CHEST PAIN,,,198,ANGINA PECTORIS & CORONARY ATHEROSCLEROSIS,05,DISEASES AND DISORDERS OF THE CIRCULATORY SYSTEM,1,Minor,Major,Medical,Medicaid,,,,,Y,60690.24,15538.19
New York City,Kings,7002053,001304,NYU Langone Hospital-Brooklyn,50 to 69,112,F,Black/African American,Not Span/Hispanic,1,Emergency,Left Against Medical Advice,2020,CIR011,CORONARY ATHEROSCLEROSIS AND OTHER HEART DISEASE,,,198,ANGINA PECTORIS & CORONARY ATHEROSCLEROSIS,05,DISEASES AND DISORDERS OF THE CIRCULATORY SYSTEM,2,Moderate,Moderate,Medical,Medicaid,,,,,Y,37233.26,6776.4
New York City,Kings,7002053,001304,NYU Langone Hospital-Brooklyn,70 or Older,112,F,White,Not Span/Hispanic,2,Emergency,Home w/ Home Health Services,2020,CIR011,CORONARY ATHEROSCLEROSIS AND OTHER HEART DISEASE,ADM021,"ADMINISTRATION OF THERAPEUTIC SUBSTANCES, NEC",198,ANGINA PECTORIS & CORONARY ATHEROSCLEROSIS,05,DISEASES AND DISORDERS OF THE CIRCULATORY SYSTEM,2,Moderate,Moderate,Medical,Medicare,Medicaid,,,,Y,33205.21,8655.24
New York City,Kings,7002053,001304,NYU Langone Hospital-Brooklyn,70 or Older,112,F,White,Not Span/Hispanic,2,Emergency,Home w/ Home Health Services,2020,CIR011,CORONARY ATHEROSCLEROSIS AND OTHER HEART DISEASE,,,198,ANGINA PECTORIS & CORONARY ATHEROSCLEROSIS,05,DISEASES AND DISORDERS OF THE CIRCULATORY SYSTEM,2,Moderate,Major,Medical,Medicare,Medicaid,,,,Y,55553.98,14524.69
New York City,Kings,7002053,001304,NYU Langone Hospital-Brooklyn,70 or Older,112,M,Other Race,Not Span/Hispanic,4,Elective,Inpatient Rehabilitation Facility,2020,CIR011,CORONARY ATHEROSCLEROSIS AND OTHER HEART DISEASE,ADM021,"ADMINISTRATION OF THERAPEUTIC SUBSTANCES, NEC",198,ANGINA PECTORIS & CORONARY ATHEROSCLEROSIS,05,DISEASES AND DISORDERS OF THE CIRCULATORY SYSTEM,3,Major,Major,Medical,Medicare,Medicaid,,,,N,65078.85,14840.41
New York City,Kings,7002053,001304,NYU Langone Hospital-Brooklyn,70 or Older,112,M,Other Race,Unknown,1,Emergency,Home or Self Care,2020,CIR012,NONSPECIFIC CHEST PAIN,,,198,ANGINA PECTORIS & CORONARY ATHEROSCLEROSIS,05,DISEASES AND DISORDERS OF THE CIRCULATORY SYSTEM,1,Minor,Moderate,Medical,Medicaid,,,,,Y,22895.8,6537.46
New York City,Kings,7002053,001304,NYU Langone Hospital-Brooklyn,70 or Older,112,F,White,Not Span/Hispanic,3,Emergency,Home or Self Care,2020,CIR011,CORONARY ATHEROSCLEROSIS AND OTHER HEART DISEASE,,,198,ANGINA PECTORIS & CORONARY ATHEROSCLEROSIS,05,DISEASES AND DISORDERS OF THE CIRCULATORY SYSTEM,2,Moderate,Major,Medical,Medicaid,,,,,Y,53135.21,15108.97
New York City,Kings,7002053,001304,NYU Langone Hospital-Brooklyn,50 to 69,112,M,Other Race,Not Span/Hispanic,1,Emergency,Home or Self Care,2020,CIR012,NONSPECIFIC CHEST PAIN,,,198,ANGINA PECTORIS & CORONARY ATHEROSCLEROSIS,05,DISEASES AND DISORDERS OF THE CIRCULATORY SYSTEM,1,Minor,Minor,Medical,Blue Cross/Blue Shield,,,,,Y,42259.21,9950.8
New York City,Kings,7002053,001304,NYU Langone Hospital-Brooklyn,50 to 69,112,M,Other Race,Not Span/Hispanic,1,Emergency,Home w/ Home Health Services,2020,CIR012,NONSPECIFIC CHEST PAIN,,,198,ANGINA PECTORIS & CORONARY ATHEROSCLEROSIS,05,DISEASES AND DISORDERS OF THE CIRCULATORY SYSTEM,2,Moderate,Moderate,Medical,Medicaid,,,,,Y,44935.68,9985.15
New York City,Kings,7002053,001304,NYU Langone Hospital-Brooklyn,50 to 69,112,M,White,Spanish/Hispanic,1,Emergency,Home or Self Care,2020,CIR012,NONSPECIFIC CHEST PAIN,,,198,ANGINA PECTORIS & CORONARY ATHEROSCLEROSIS,05,DISEASES AND DISORDERS OF THE CIRCULATORY SYSTEM,1,Minor,Moderate,Medical,Medicaid,,,,,Y,51312.5,11227.21
New York City,Kings,7002053,001304,NYU Langone Hospital-Brooklyn,50 to 69,112,M,Other Race,Spanish/Hispanic,1,Emergency,Home or Self Care,2020,CIR011,CORONARY ATHEROSCLEROSIS AND OTHER HEART DISEASE,IMG008,ULTRASONOGRAPHY,198,ANGINA PECTORIS & CORONARY ATHEROSCLEROSIS,05,DISEASES AND DISORDERS OF THE CIRCULATORY SYSTEM,1,Minor,Minor,Medical,Medicare,,,,,Y,33348.21,8049.89
New York City,Kings,7002053,001304,NYU Langone Hospital-Brooklyn,50 to 69,112,F,White,Spanish/Hispanic,1,Emergency,Left Against Medical Advice,2020,CIR012,NONSPECIFIC CHEST PAIN,,,198,ANGINA PECTORIS & CORONARY ATHEROSCLEROSIS,05,DISEASES AND DISORDERS OF THE CIRCULATORY SYSTEM,2,Moderate,Minor,Medical,Medicaid,,,,,Y,17723.01,4471.94
New York City,Kings,7002053,001304,NYU Langone Hospital-Brooklyn,30 to 49,112,M,Other Race,Not Span/Hispanic,1,Emergency,Home or Self Care,2020,CIR012,NONSPECIFIC CHEST PAIN,,,198,ANGINA PECTORIS & CORONARY ATHEROSCLEROSIS,05,DISEASES AND DISORDERS OF THE CIRCULATORY SYSTEM,1,Minor,Minor,Medical,Medicaid,,,,,Y,49448.22,11000.11
New York City,Kings,7002053,001304,NYU Langone Hospital-Brooklyn,70 or Older,,M,Black/African American,Not Span/Hispanic,2,Emergency,Home or Self Care,2020,CIR012,NONSPECIFIC CHEST PAIN,,,198,ANGINA PECTORIS & CORONARY ATHEROSCLEROSIS,05,DISEASES AND DISORDERS OF THE CIRCULATORY SYSTEM,1,Minor,Minor,Medical,Private Health Insurance,,,,,Y,26033.6,7605.54
New York City,Kings,7002053,001304,NYU Langone Hospital-Brooklyn,50 to 69,112,M,White,Spanish/Hispanic,1,Emergency,Left Against Medical Advice,2020,CIR012,NONSPECIFIC CHEST PAIN,ADM021,"ADMINISTRATION OF THERAPEUTIC SUBSTANCES, NEC",198,ANGINA PECTORIS & CORONARY ATHEROSCLEROSIS,05,DISEASES AND DISORDERS OF THE CIRCULATORY SYSTEM,2,Moderate,Minor,Medical,Private Health Insurance,,,,,Y,14330.51,4176.79
New York City,Kings,7002053,001304,NYU Langone Hospital-Brooklyn,70 or Older,112,F,Other Race,Spanish/Hispanic,2,Emergency,Home w/ Home Health Services,2020,CIR011,CORONARY ATHEROSCLEROSIS AND OTHER HEART DISEASE,,,198,ANGINA PECTORIS & CORONARY ATHEROSCLEROSIS,05,DISEASES AND DISORDERS OF THE CIRCULATORY SYSTEM,2,Moderate,Minor,Medical,Medicare,Medicaid,,,,Y,50312.61,9957.49
New York City,Kings,7002053,001304,NYU Langone Hospital-Brooklyn,50 to 69,112,F,Other Race,Not Span/Hispanic,3,Emergency,Left Against Medical Advice,2020,CIR011,CORONARY ATHEROSCLEROSIS AND OTHER HEART DISEASE,,,198,ANGINA PECTORIS & CORONARY ATHEROSCLEROSIS,05,DISEASES AND DISORDERS OF THE CIRCULATORY SYSTEM,2,Moderate,Moderate,Medical,Medicaid,,,,,Y,49298.5,13928.63
New York City,Kings,7002053,001304,NYU Langone Hospital-Brooklyn,30 to 49,112,M,Other Race,Unknown,1,Emergency,Home or Self Care,2020,CIR011,CORONARY ATHEROSCLEROSIS AND OTHER HEART DISEASE,MAM004,CARDIAC STRESS TESTS,198,ANGINA PECTORIS & CORONARY ATHEROSCLEROSIS,05,DISEASES AND DISORDERS OF THE CIRCULATORY SYSTEM,2,Moderate,Moderate,Medical,Medicaid,,,,,Y,51744.47,11068.15
New York City,Kings,7002053,001304,NYU Langone Hospital-Brooklyn,30 to 49,112,M,Other Race,Not Span/Hispanic,1,Emergency,Home or Self Care,2020,CIR012,NONSPECIFIC CHEST PAIN,,,198,ANGINA PECTORIS & CORONARY ATHEROSCLEROSIS,05,DISEASES AND DISORDERS OF THE CIRCULATORY SYSTEM,2,Moderate,Minor,Medical,Medicaid,,,,,Y,38194.64,10047.83
New York City,Kings,7002053,001304,NYU Langone Hospital-Brooklyn,50 to 69,112,M,Other Race,Not Span/Hispanic,2,Emergency,Home w/ Home Health Services,2020,CIR011,CORONARY ATHEROSCLEROSIS AND OTHER HEART DISEASE,ADM021,"ADMINISTRATION OF THERAPEUTIC SUBSTANCES, NEC",198,ANGINA PECTORIS & CORONARY ATHEROSCLEROSIS,05,DISEASES AND DISORDERS OF THE CIRCULATORY SYSTEM,2,Moderate,Minor,Medical,Medicaid,,,,,Y,61888.71,13661.54
New York City,Kings,7002053,001304,NYU Langone Hospital-Brooklyn,30 to 49,112,M,Black/African American,Not Span/Hispanic,1,Emergency,Home or Self Care,2020,CIR011,CORONARY ATHEROSCLEROSIS AND OTHER HEART DISEASE,ADM021,"ADMINISTRATION OF THERAPEUTIC SUBSTANCES, NEC",198,ANGINA PECTORIS & CORONARY ATHEROSCLEROSIS,05,DISEASES AND DISORDERS OF THE CIRCULATORY SYSTEM,2,Moderate,Moderate,Medical,Blue Cross/Blue Shield,,,,,Y,22159.43,4937.65
New York City,Kings,7002053,001304,NYU Langone Hospital-Brooklyn,50 to 69,112,M,White,Spanish/Hispanic,2,Emergency,Home or Self Care,2020,CIR011,CORONARY ATHEROSCLEROSIS AND OTHER HEART DISEASE,ADM021,"ADMINISTRATION OF THERAPEUTIC SUBSTANCES, NEC",198,ANGINA PECTORIS & CORONARY ATHEROSCLEROSIS,05,DISEASES AND DISORDERS OF THE CIRCULATORY SYSTEM,2,Moderate,Minor,Medical,Medicaid,,,,,Y,41065.36,13054.15
New York City,Kings,7002053,001304,NYU Langone Hospital-Brooklyn,50 to 69,113,M,White,Not Span/Hispanic,1,Emergency,Left Against Medical Advice,2020,CIR012,NONSPECIFIC CHEST PAIN,ADM021,"ADMINISTRATION OF THERAPEUTIC SUBSTANCES, NEC",198,ANGINA PECTORIS & CORONARY ATHEROSCLEROSIS,05,DISEASES AND DISORDERS OF THE CIRCULATORY SYSTEM,1,Minor,Moderate,Medical,Medicaid,,,,,Y,39713.6,6891.66
New York City,Kings,7002053,001304,NYU Langone Hospital-Brooklyn,50 to 69,112,F,Other Race,Spanish/Hispanic,1,Emergency,Home or Self Care,2020,CIR012,NONSPECIFIC CHEST PAIN,MAM004,CARDIAC STRESS TESTS,198,ANGINA PECTORIS & CORONARY ATHEROSCLEROSIS,05,DISEASES AND DISORDERS OF THE CIRCULATORY SYSTEM,1,Minor,Minor,Medical,Medicaid,,,,,Y,38803.35,9401.07
New York City,Kings,7002053,001304,NYU Langone Hospital-Brooklyn,30 to 49,115,M,Other Race,Not Span/Hispanic,1,Emergency,Home or Self Care,2020,CIR011,CORONARY ATHEROSCLEROSIS AND OTHER HEART DISEASE,,,198,ANGINA PECTORIS & CORONARY ATHEROSCLEROSIS,05,DISEASES AND DISORDERS OF THE CIRCULATORY SYSTEM,1,Minor,Minor,Medical,Private Health Insurance,,,,,Y,16422.33,4338.45
New York City,Kings,7002053,001304,NYU Langone Hospital-Brooklyn,30 to 49,112,M,White,Spanish/Hispanic,1,Emergency,Home or Self Care,2020,CIR012,NONSPECIFIC CHEST PAIN,MAM004,CARDIAC STRESS TESTS,198,ANGINA PECTORIS & CORONARY ATHEROSCLEROSIS,05,DISEASES AND DISORDERS OF THE CIRCULATORY SYSTEM,1,Minor,Minor,Medical,Medicaid,,,,,Y,28513.82,7583.81
New York City,Kings,7002053,001304,NYU Langone Hospital-Brooklyn,50 to 69,112,F,Other Race,Spanish/Hispanic,1,Emergency,Home or Self Care,2020,CIR012,NONSPECIFIC CHEST PAIN,IMG008,ULTRASONOGRAPHY,198,ANGINA PECTORIS & CORONARY ATHEROSCLEROSIS,05,DISEASES AND DISORDERS OF THE CIRCULATORY SYSTEM,1,Minor,Moderate,Medical,Medicaid,,,,,Y,46366.07,7267.41
New York City,Kings,7002053,001304,NYU Langone Hospital-Brooklyn,70 or Older,112,F,Other Race,Unknown,1,Emergency,Home or Self Care,2020,CIR012,NONSPECIFIC CHEST PAIN,,,198,ANGINA PECTORIS & CORONARY ATHEROSCLEROSIS,05,DISEASES AND DISORDERS OF THE CIRCULATORY SYSTEM,1,Minor,Minor,Medical,Medicare,,,,,Y,36261.2,8536.5
New York City,Kings,7002053,001304,NYU Langone Hospital-Brooklyn,50 to 69,112,M,Other Race,Not Span/Hispanic,2,Emergency,Home or Self Care,2020,CIR011,CORONARY ATHEROSCLEROSIS AND OTHER HEART DISEASE,,,198,ANGINA PECTORIS & CORONARY ATHEROSCLEROSIS,05,DISEASES AND DISORDERS OF THE CIRCULATORY SYSTEM,1,Minor,Minor,Medical,Medicaid,,,,,Y,27468.51,7641.98
New York City,Kings,7002053,001304,NYU Langone Hospital-Brooklyn,50 to 69,103,M,White,Not Span/Hispanic,2,Emergency,Home or Self Care,2020,CIR011,CORONARY ATHEROSCLEROSIS AND OTHER HEART DISEASE,,,198,ANGINA PECTORIS & CORONARY ATHEROSCLEROSIS,05,DISEASES AND DISORDERS OF THE CIRCULATORY SYSTEM,2,Moderate,Minor,Medical,Private Health Insurance,,,,,Y,35112.1,11180.53
New York City,Kings,7002053,001304,NYU Langone Hospital-Brooklyn,50 to 69,112,F,White,Not Span/Hispanic,1,Emergency,Home or Self Care,2020,CIR012,NONSPECIFIC CHEST PAIN,,,198,ANGINA PECTORIS & CORONARY ATHEROSCLEROSIS,05,DISEASES AND DISORDERS OF THE CIRCULATORY SYSTEM,2,Moderate,Minor,Medical,Medicare,Medicaid,,,,Y,36310.3,8887.48
New York City,Kings,7002053,001304,NYU Langone Hospital-Brooklyn,50 to 69,112,F,Other Race,Spanish/Hispanic,1,Emergency,Home or Self Care,2020,CIR012,NONSPECIFIC CHEST PAIN,,,198,ANGINA PECTORIS & CORONARY ATHEROSCLEROSIS,05,DISEASES AND DISORDERS OF THE CIRCULATORY SYSTEM,2,Moderate,Moderate,Medical,Medicare,Medicaid,,,,Y,45572.69,11925.15
New York City,Kings,7002053,001304,NYU Langone Hospital-Brooklyn,30 to 49,114,M,Other Race,Not Span/Hispanic,1,Emergency,Left Against Medical Advice,2020,CIR012,NONSPECIFIC CHEST PAIN,ESA001,HEMODIALYSIS,198,ANGINA PECTORIS & CORONARY ATHEROSCLEROSIS,05,DISEASES AND DISORDERS OF THE CIRCULATORY SYSTEM,3,Major,Major,Medical,Medicare,Medicaid,,,,Y,43980.88,11899.29
New York City,Kings,7002053,001304,NYU Langone Hospital-Brooklyn,30 to 49,112,F,Black/African American,Not Span/Hispanic,1,Emergency,Home or Self Care,2020,CIR011,CORONARY ATHEROSCLEROSIS AND OTHER HEART DISEASE,,,198,ANGINA PECTORIS & CORONARY ATHEROSCLEROSIS,05,DISEASES AND DISORDERS OF THE CIRCULATORY SYSTEM,2,Moderate,Minor,Medical,Private Health Insurance,,,,,Y,23026.76,7406.05
New York City,Kings,7002053,001304,NYU Langone Hospital-Brooklyn,70 or Older,112,F,White,Not Span/Hispanic,7,Emergency,Skilled Nursing Home,2020,CIR011,CORONARY ATHEROSCLEROSIS AND OTHER HEART DISEASE,,,198,ANGINA PECTORIS & CORONARY ATHEROSCLEROSIS,05,DISEASES AND DISORDERS OF THE CIRCULATORY SYSTEM,3,Major,Major,Medical,Medicare,Medicare,,,,Y,96978.52,26564.27
New York City,Kings,7002053,001304,NYU Langone Hospital-Brooklyn,30 to 49,112,M,Black/African American,Not Span/Hispanic,1,Emergency,Home or Self Care,2020,CIR012,NONSPECIFIC CHEST PAIN,IMG008,ULTRASONOGRAPHY,198,ANGINA PECTORIS & CORONARY ATHEROSCLEROSIS,05,DISEASES AND DISORDERS OF THE CIRCULATORY SYSTEM,2,Moderate,Minor,Medical,Medicaid,,,,,Y,23406.72,5117.16
New York City,Kings,7002053,001304,NYU Langone Hospital-Brooklyn,50 to 69,112,M,White,Spanish/Hispanic,1,Emergency,Left Against Medical Advice,2020,CIR011,CORONARY ATHEROSCLEROSIS AND OTHER HEART DISEASE,,,198,ANGINA PECTORIS & CORONARY ATHEROSCLEROSIS,05,DISEASES AND DISORDERS OF THE CIRCULATORY SYSTEM,2,Moderate,Moderate,Medical,Medicaid,,,,,Y,14812.02,4151.64
New York City,Kings,7002053,001304,NYU Langone Hospital-Brooklyn,50 to 69,112,M,Black/African American,Not Span/Hispanic,2,Emergency,Home or Self Care,2020,CIR011,CORONARY ATHEROSCLEROSIS AND OTHER HEART DISEASE,IMG008,ULTRASONOGRAPHY,198,ANGINA PECTORIS & CORONARY ATHEROSCLEROSIS,05,DISEASES AND DISORDERS OF THE CIRCULATORY SYSTEM,2,Moderate,Minor,Medical,Medicaid,,,,,Y,50126.96,10388.79
New York City,Kings,7002053,001304,NYU Langone Hospital-Brooklyn,70 or Older,112,M,White,Not Span/Hispanic,1,Trauma,Home w/ Home Health Services,2020,CIR011,CORONARY ATHEROSCLEROSIS AND OTHER HEART DISEASE,SKB006,SKIN LACERATION REPAIR (EXCLUDING PERINEUM),198,ANGINA PECTORIS & CORONARY ATHEROSCLEROSIS,05,DISEASES AND DISORDERS OF THE CIRCULATORY SYSTEM,2,Moderate,Major,Medical,Medicare,Medicaid,,,,Y,34436.9,8263.71
New York City,Kings,7002053,001304,NYU Langone Hospital-Brooklyn,70 or Older,112,M,White,Not Span/Hispanic,1,Emergency,Skilled Nursing Home,2020,CIR011,CORONARY ATHEROSCLEROSIS AND OTHER HEART DISEASE,,,198,ANGINA PECTORIS & CORONARY ATHEROSCLEROSIS,05,DISEASES AND DISORDERS OF THE CIRCULATORY SYSTEM,2,Moderate,Minor,Medical,Medicare,,,,,Y,25434.84,5580.2
New York City,Kings,7002053,001304,NYU Langone Hospital-Brooklyn,50 to 69,103,M,Other Race,Not Span/Hispanic,1,Emergency,Home or Self Care,2020,CIR012,NONSPECIFIC CHEST PAIN,,,198,ANGINA PECTORIS & CORONARY ATHEROSCLEROSIS,05,DISEASES AND DISORDERS OF THE CIRCULATORY SYSTEM,3,Major,Major,Medical,Medicare,Medicaid,,,,Y,17291.1,4518.33
New York City,Kings,7002053,001304,NYU Langone Hospital-Brooklyn,30 to 49,112,F,Black/African American,Not Span/Hispanic,2,Emergency,Home or Self Care,2020,CIR011,CORONARY ATHEROSCLEROSIS AND OTHER HEART DISEASE,,,198,ANGINA PECTORIS & CORONARY ATHEROSCLEROSIS,05,DISEASES AND DISORDERS OF THE CIRCULATORY SYSTEM,2,Moderate,Minor,Medical,Medicaid,,,,,Y,40677.13,9517.6
New York City,Kings,7002053,001304,NYU Langone Hospital-Brooklyn,50 to 69,112,F,Other Race,Unknown,2,Emergency,Home or Self Care,2020,CIR012,NONSPECIFIC CHEST PAIN,,,198,ANGINA PECTORIS & CORONARY ATHEROSCLEROSIS,05,DISEASES AND DISORDERS OF THE CIRCULATORY SYSTEM,2,Moderate,Minor,Medical,Medicaid,,,,,Y,33491.4,8434.59
New York City,Kings,7002053,001304,NYU Langone Hospital-Brooklyn,50 to 69,112,M,Other Race,Not Span/Hispanic,1,Emergency,Home or Self Care,2020,CIR011,CORONARY ATHEROSCLEROSIS AND OTHER HEART DISEASE,IMG008,ULTRASONOGRAPHY,198,ANGINA PECTORIS & CORONARY ATHEROSCLEROSIS,05,DISEASES AND DISORDERS OF THE CIRCULATORY SYSTEM,2,Moderate,Moderate,Medical,Blue Cross/Blue Shield,,,,,Y,21846.75,5015.23
New York City,Kings,7002053,001304,NYU Langone Hospital-Brooklyn,30 to 49,112,F,Other Race,Spanish/Hispanic,1,Emergency,Home or Self Care,2020,CIR012,NONSPECIFIC CHEST PAIN,,,198,ANGINA PECTORIS & CORONARY ATHEROSCLEROSIS,05,DISEASES AND DISORDERS OF THE CIRCULATORY SYSTEM,1,Minor,Minor,Medical,Medicaid,,,,,Y,28192.4,5492.98
New York City,Kings,7002053,001304,NYU Langone Hospital-Brooklyn,70 or Older,112,F,Other Race,Not Span/Hispanic,2,Emergency,Home or Self Care,2020,CIR012,NONSPECIFIC CHEST PAIN,MAM004,CARDIAC STRESS TESTS,198,ANGINA PECTORIS & CORONARY ATHEROSCLEROSIS,05,DISEASES AND DISORDERS OF THE CIRCULATORY SYSTEM,2,Moderate,Moderate,Medical,Medicaid,,,,,Y,41756.87,9149.07
New York City,Kings,7002053,001304,NYU Langone Hospital-Brooklyn,30 to 49,112,M,Other Race,Not Span/Hispanic,1,Emergency,Home or Self Care,2020,CIR011,CORONARY ATHEROSCLEROSIS AND OTHER HEART DISEASE,ADM021,"ADMINISTRATION OF THERAPEUTIC SUBSTANCES, NEC",198,ANGINA PECTORIS & CORONARY ATHEROSCLEROSIS,05,DISEASES AND DISORDERS OF THE CIRCULATORY SYSTEM,1,Minor,Minor,Medical,Medicaid,,,,,Y,19040.09,4640.28