Hospital Service Area,Hospital County,Operating Certificate Number,Permanent Facility Id,Facility Name,Age Group,Zip Code - 3 digits,Gender,Race,Ethnicity,Length of Stay,Type of Admission,Patient Disposition,Discharge Year,CCS Diagnosis Code,CCS Diagnosis Description,CCS Procedure Code,CCS Procedure Description,APR DRG Code,APR DRG Description,APR MDC Code,APR MDC Description,APR Severity of Illness Code,APR Severity of Illness Description,APR Risk of Mortality,APR Medical Surgical Description,Payment Typology 1,Payment Typology 2,Payment Typology 3,Birth Weight,Abortion Edit Indicator,Emergency Department Indicator,Total Charges,Total Costs
Long Island,Suffolk,5123000,000885,Long Island Community Hospital,50 to 69,117,M,Other Race,Not Span/Hispanic,4,Emergency,Home or Self Care,2020,CIR011,CORONARY ATHEROSCLEROSIS AND OTHER HEART DISEASE,,,198,ANGINA PECTORIS & CORONARY ATHEROSCLEROSIS,05,DISEASES AND DISORDERS OF THE CIRCULATORY SYSTEM,1,Minor,Minor,Medical,Self-Pay,,,,,Y,36387.12,7793.77
Long Island,Suffolk,5123000,000885,Long Island Community Hospital,50 to 69,117,M,White,Not Span/Hispanic,2,Emergency,Home or Self Care,2020,CIR011,CORONARY ATHEROSCLEROSIS AND OTHER HEART DISEASE,SUD001,SUBSTANCE USE DETOXIFICATION,198,ANGINA PECTORIS & CORONARY ATHEROSCLEROSIS,05,DISEASES AND DISORDERS OF THE CIRCULATORY SYSTEM,1,Minor,Minor,Medical,Self-Pay,,,,,Y,27699.97,5350.05
Long Island,Suffolk,5123000,000885,Long Island Community Hospital,70 or Older,119,M,White,Not Span/Hispanic,3,Emergency,Home or Self Care,2020,CIR012,NONSPECIFIC CHEST PAIN,,,198,ANGINA PECTORIS & CORONARY ATHEROSCLEROSIS,05,DISEASES AND DISORDERS OF THE CIRCULATORY SYSTEM,2,Moderate,Moderate,Medical,Medicare,Medicare,Medicaid,,,Y,23007.88,4675.22
Long Island,Suffolk,5123000,000885,Long Island Community Hospital,70 or Older,117,M,White,Not Span/Hispanic,1,Emergency,Home or Self Care,2020,CIR011,CORONARY ATHEROSCLEROSIS AND OTHER HEART DISEASE,,,198,ANGINA PECTORIS & CORONARY ATHEROSCLEROSIS,05,DISEASES AND DISORDERS OF THE CIRCULATORY SYSTEM,2,Moderate,Major,Medical,Medicare,,,,,Y,11071.76,1892.41
Long Island,Suffolk,5123000,000885,Long Island Community Hospital,70 or Older,117,F,White,Not Span/Hispanic,3,Emergency,Skilled Nursing Home,2020,CIR011,CORONARY ATHEROSCLEROSIS AND OTHER HEART DISEASE,,,198,ANGINA PECTORIS & CORONARY ATHEROSCLEROSIS,05,DISEASES AND DISORDERS OF THE CIRCULATORY SYSTEM,2,Moderate,Moderate,Medical,Medicare,Medicare,Medicaid,,,Y,30608.15,5480.25
Long Island,Suffolk,5123000,000885,Long Island Community Hospital,50 to 69,119,F,White,Not Span/Hispanic,1,Emergency,Home or Self Care,2020,CIR012,NONSPECIFIC CHEST PAIN,,,198,ANGINA PECTORIS & CORONARY ATHEROSCLEROSIS,05,DISEASES AND DISORDERS OF THE CIRCULATORY SYSTEM,2,Moderate,Moderate,Medical,Medicare,Medicaid,,,,Y,33306.11,4709.47
Long Island,Suffolk,5123000,000885,Long Island Community Hospital,70 or Older,119,M,Other Race,Not Span/Hispanic,1,Emergency,Short-term Hospital,2020,CIR011,CORONARY ATHEROSCLEROSIS AND OTHER HEART DISEASE,,,198,ANGINA PECTORIS & CORONARY ATHEROSCLEROSIS,05,DISEASES AND DISORDERS OF THE CIRCULATORY SYSTEM,2,Moderate,Moderate,Medical,Private Health Insurance,Medicare,Medicare,,,Y,14571.99,2463.83
Long Island,Suffolk,5123000,000885,Long Island Community Hospital,70 or Older,117,F,White,Not Span/Hispanic,4,Emergency,Home or Self Care,2020,CIR012,NONSPECIFIC CHEST PAIN,,,198,ANGINA PECTORIS & CORONARY ATHEROSCLEROSIS,05,DISEASES AND DISORDERS OF THE CIRCULATORY SYSTEM,1,Minor,Minor,Medical,Medicare,Medicare,Medicaid,,,Y,39444.55,8133.45
Long Island,Suffolk,5123000,000885,Long Island Community Hospital,70 or Older,117,M,White,Not Span/Hispanic,1,Emergency,Skilled Nursing Home,2020,CIR012,NONSPECIFIC CHEST PAIN,,,198,ANGINA PECTORIS & CORONARY ATHEROSCLEROSIS,05,DISEASES AND DISORDERS OF THE CIRCULATORY SYSTEM,2,Moderate,Major,Medical,Medicare,Medicare,Blue Cross/Blue Shield,,,Y,10858.33,1909.69
Long Island,Suffolk,5123000,000885,Long Island Community Hospital,50 to 69,117,M,White,Not Span/Hispanic,1,Emergency,Home or Self Care,2020,CIR011,CORONARY ATHEROSCLEROSIS AND OTHER HEART DISEASE,,,198,ANGINA PECTORIS & CORONARY ATHEROSCLEROSIS,05,DISEASES AND DISORDERS OF THE CIRCULATORY SYSTEM,1,Minor,Minor,Medical,Medicare,,,,,Y,40730.17,7282.63
Long Island,Suffolk,5123000,000885,Long Island Community Hospital,30 to 49,117,M,Black/African American,Not Span/Hispanic,1,Emergency,Home or Self Care,2020,CIR012,NONSPECIFIC CHEST PAIN,,,198,ANGINA PECTORIS & CORONARY ATHEROSCLEROSIS,05,DISEASES AND DISORDERS OF THE CIRCULATORY SYSTEM,2,Moderate,Moderate,Medical,Private Health Insurance,Medicaid,,,,Y,12022.61,2020.66
Long Island,Suffolk,5123000,000885,Long Island Community Hospital,50 to 69,117,M,Black/African American,Not Span/Hispanic,9,Emergency,Home w/ Home Health Services,2020,CIR012,NONSPECIFIC CHEST PAIN,MST020,SUBCUTANEOUS TISSUE AND FASCIA EXCISION,198,ANGINA PECTORIS & CORONARY ATHEROSCLEROSIS,05,DISEASES AND DISORDERS OF THE CIRCULATORY SYSTEM,3,Major,Major,Medical,Private Health Insurance,Medicaid,,,,Y,90228.38,19494.98
Long Island,Suffolk,5123000,000885,Long Island Community Hospital,50 to 69,117,F,White,Not Span/Hispanic,1,Emergency,Home or Self Care,2020,CIR012,NONSPECIFIC CHEST PAIN,,,198,ANGINA PECTORIS & CORONARY ATHEROSCLEROSIS,05,DISEASES AND DISORDERS OF THE CIRCULATORY SYSTEM,1,Minor,Moderate,Medical,Private Health Insurance,Medicaid,,,,Y,17490.34,2872.13
Long Island,Suffolk,5123000,000885,Long Island Community Hospital,50 to 69,117,F,White,Not Span/Hispanic,1,Emergency,Home or Self Care,2020,CIR012,NONSPECIFIC CHEST PAIN,OTR004,ISOLATION PROCEDURES,198,ANGINA PECTORIS & CORONARY ATHEROSCLEROSIS,05,DISEASES AND DISORDERS OF THE CIRCULATORY SYSTEM,1,Minor,Minor,Medical,Medicare,Medicare,,,,Y,13926.8,1900.96
Long Island,Suffolk,5123000,000885,Long Island Community Hospital,50 to 69,119,F,White,Not Span/Hispanic,2,Emergency,Home or Self Care,2020,CIR012,NONSPECIFIC CHEST PAIN,OTR004,ISOLATION PROCEDURES,198,ANGINA PECTORIS & CORONARY ATHEROSCLEROSIS,05,DISEASES AND DISORDERS OF THE CIRCULATORY SYSTEM,1,Minor,Moderate,Medical,Private Health Insurance,Medicaid,,,,Y,30201.12,3853.24
Long Island,Suffolk,5123000,000885,Long Island Community Hospital,70 or Older,117,F,Other Race,Not Span/Hispanic,3,Emergency,Skilled Nursing Home,2020,CIR012,NONSPECIFIC CHEST PAIN,ESA001,HEMODIALYSIS,198,ANGINA PECTORIS & CORONARY ATHEROSCLEROSIS,05,DISEASES AND DISORDERS OF THE CIRCULATORY SYSTEM,2,Moderate,Major,Medical,Medicare,Medicare,Medicaid,,,Y,31618.2,5369.27
Long Island,Suffolk,5123000,000885,Long Island Community Hospital,70 or Older,117,M,White,Not Span/Hispanic,1,Emergency,Home or Self Care,2020,CIR011,CORONARY ATHEROSCLEROSIS AND OTHER HEART DISEASE,MAM006,PACEMAKER AND DEFIBRILLATOR INTERROGATION,198,ANGINA PECTORIS & CORONARY ATHEROSCLEROSIS,05,DISEASES AND DISORDERS OF THE CIRCULATORY SYSTEM,2,Moderate,Moderate,Medical,Medicare,Medicare,Private Health Insurance,,,Y,19827.91,2139.67
Long Island,Suffolk,5123000,000885,Long Island Community Hospital,70 or Older,117,M,Other Race,Not Span/Hispanic,1,Emergency,Home or Self Care,2020,CIR011,CORONARY ATHEROSCLEROSIS AND OTHER HEART DISEASE,,,198,ANGINA PECTORIS & CORONARY ATHEROSCLEROSIS,05,DISEASES AND DISORDERS OF THE CIRCULATORY SYSTEM,2,Moderate,Minor,Medical,Medicare,Medicare,,,,Y,11123.24,1938.92
Long Island,Suffolk,5123000,000885,Long Island Community Hospital,30 to 49,117,M,White,Not Span/Hispanic,2,Emergency,Home or Self Care,2020,CIR011,CORONARY ATHEROSCLEROSIS AND OTHER HEART DISEASE,SUD001,SUBSTANCE USE DETOXIFICATION,198,ANGINA PECTORIS & CORONARY ATHEROSCLEROSIS,05,DISEASES AND DISORDERS OF THE CIRCULATORY SYSTEM,2,Moderate,Minor,Medical,Private Health Insurance,Medicaid,,,,Y,18618.9,3334.85
Long Island,Suffolk,5123000,000885,Long Island Community Hospital,30 to 49,117,M,White,Not Span/Hispanic,2,Emergency,Left Against Medical Advice,2020,CIR012,NONSPECIFIC CHEST PAIN,OTR004,ISOLATION PROCEDURES,198,ANGINA PECTORIS & CORONARY ATHEROSCLEROSIS,05,DISEASES AND DISORDERS OF THE CIRCULATORY SYSTEM,2,Moderate,Minor,Medical,Private Health Insurance,Medicaid,,,,Y,37315.75,4920.53
Long Island,Suffolk,5123000,000885,Long Island Community Hospital,30 to 49,117,M,White,Not Span/Hispanic,1,Emergency,Home or Self Care,2020,CIR012,NONSPECIFIC CHEST PAIN,SUD001,SUBSTANCE USE DETOXIFICATION,198,ANGINA PECTORIS & CORONARY ATHEROSCLEROSIS,05,DISEASES AND DISORDERS OF THE CIRCULATORY SYSTEM,2,Moderate,Minor,Medical,Private Health Insurance,Medicaid,,,,Y,25750.64,4164.8
Long Island,Suffolk,5123000,000885,Long Island Community Hospital,50 to 69,119,M,White,Not Span/Hispanic,1,Emergency,Left Against Medical Advice,2020,CIR012,NONSPECIFIC CHEST PAIN,SUD001,SUBSTANCE USE DETOXIFICATION,198,ANGINA PECTORIS & CORONARY ATHEROSCLEROSIS,05,DISEASES AND DISORDERS OF THE CIRCULATORY SYSTEM,1,Minor,Minor,Medical,Private Health Insurance,Medicaid,,,,Y,24310.67,1973.54
Long Island,Suffolk,5123000,000885,Long Island Community Hospital,50 to 69,119,M,White,Not Span/Hispanic,4,Emergency,Home w/ Home Health Services,2020,CIR011,CORONARY ATHEROSCLEROSIS AND OTHER HEART DISEASE,,,198,ANGINA PECTORIS & CORONARY ATHEROSCLEROSIS,05,DISEASES AND DISORDERS OF THE CIRCULATORY SYSTEM,3,Major,Major,Medical,Medicare,,,,,Y,42164.48,8073.11
Long Island,Suffolk,5123000,000885,Long Island Community Hospital,30 to 49,117,F,Black/African American,Not Span/Hispanic,6,Emergency,Home w/ Home Health Services,2020,CIR012,NONSPECIFIC CHEST PAIN,OTR004,ISOLATION PROCEDURES,198,ANGINA PECTORIS & CORONARY ATHEROSCLEROSIS,05,DISEASES AND DISORDERS OF THE CIRCULATORY SYSTEM,2,Moderate,Moderate,Medical,Private Health Insurance,Medicaid,,,,Y,48187.71,10336.49
Long Island,Suffolk,5123000,000885,Long Island Community Hospital,50 to 69,117,M,White,Not Span/Hispanic,4,Emergency,Home w/ Home Health Services,2020,CIR011,CORONARY ATHEROSCLEROSIS AND OTHER HEART DISEASE,,,198,ANGINA PECTORIS & CORONARY ATHEROSCLEROSIS,05,DISEASES AND DISORDERS OF THE CIRCULATORY SYSTEM,3,Major,Major,Medical,Medicare,Medicare,Private Health Insurance,,,Y,28713.42,6005.23
Long Island,Suffolk,5123000,000885,Long Island Community Hospital,70 or Older,117,M,White,Not Span/Hispanic,3,Emergency,Home or Self Care,2020,CIR011,CORONARY ATHEROSCLEROSIS AND OTHER HEART DISEASE,,,198,ANGINA PECTORIS & CORONARY ATHEROSCLEROSIS,05,DISEASES AND DISORDERS OF THE CIRCULATORY SYSTEM,2,Moderate,Moderate,Medical,Medicare,Medicare,Private Health Insurance,,,Y,27171.43,5096.7
Long Island,Suffolk,5123000,000885,Long Island Community Hospital,70 or Older,119,F,Black/African American,Not Span/Hispanic,3,Emergency,Home or Self Care,2020,CIR012,NONSPECIFIC CHEST PAIN,,,198,ANGINA PECTORIS & CORONARY ATHEROSCLEROSIS,05,DISEASES AND DISORDERS OF THE CIRCULATORY SYSTEM,2,Moderate,Minor,Medical,Medicare,Medicare,Medicaid,,,Y,20408.98,4445.16
Long Island,Suffolk,5123000,000885,Long Island Community Hospital,50 to 69,117,F,White,Not Span/Hispanic,3,Emergency,Home or Self Care,2020,CIR011,CORONARY ATHEROSCLEROSIS AND OTHER HEART DISEASE,,,198,ANGINA PECTORIS & CORONARY ATHEROSCLEROSIS,05,DISEASES AND DISORDERS OF THE CIRCULATORY SYSTEM,2,Moderate,Minor,Medical,Medicare,Medicare,,,,Y,41988.89,7156.25
Long Island,Suffolk,5123000,000885,Long Island Community Hospital,50 to 69,119,M,White,Not Span/Hispanic,1,Emergency,Left Against Medical Advice,2020,CIR011,CORONARY ATHEROSCLEROSIS AND OTHER HEART DISEASE,,,198,ANGINA PECTORIS & CORONARY ATHEROSCLEROSIS,05,DISEASES AND DISORDERS OF THE CIRCULATORY SYSTEM,2,Moderate,Minor,Medical,Private Health Insurance,Medicaid,,,,Y,19803.29,2147.53
Long Island,Suffolk,5123000,000885,Long Island Community Hospital,18 to 29,117,F,Black/African American,Not Span/Hispanic,3,Elective,Psychiatric Hospital or Unit of Hosp,2020,CIR011,CORONARY ATHEROSCLEROSIS AND OTHER HEART DISEASE,,,198,ANGINA PECTORIS & CORONARY ATHEROSCLEROSIS,05,DISEASES AND DISORDERS OF THE CIRCULATORY SYSTEM,2,Moderate,Minor,Medical,Private Health Insurance,Medicaid,,,,N,20978.57,4531.49
Long Island,Suffolk,5123000,000885,Long Island Community Hospital,70 or Older,119,F,White,Not Span/Hispanic,5,Emergency,Home w/ Home Health Services,2020,CIR011,CORONARY ATHEROSCLEROSIS AND OTHER HEART DISEASE,GIS001,ESOPHAGOGASTRODUODENOSCOPY (EGD) WITH BIOPSY,198,ANGINA PECTORIS & CORONARY ATHEROSCLEROSIS,05,DISEASES AND DISORDERS OF THE CIRCULATORY SYSTEM,1,Minor,Moderate,Medical,Medicare,Medicare,Private Health Insurance,,,Y,77493.16,11157.66
Long Island,Suffolk,5123000,000885,Long Island Community Hospital,50 to 69,117,M,Other Race,Not Span/Hispanic,1,Emergency,Home or Self Care,2020,CIR011,CORONARY ATHEROSCLEROSIS AND OTHER HEART DISEASE,,,198,ANGINA PECTORIS & CORONARY ATHEROSCLEROSIS,05,DISEASES AND DISORDERS OF THE CIRCULATORY SYSTEM,2,Moderate,Moderate,Medical,Blue Cross/Blue Shield,,,,,Y,17424.76,2784.04
Long Island,Suffolk,5123000,000885,Long Island Community Hospital,70 or Older,119,M,White,Not Span/Hispanic,10,Emergency,Skilled Nursing Home,2020,CIR012,NONSPECIFIC CHEST PAIN,,,198,ANGINA PECTORIS & CORONARY ATHEROSCLEROSIS,05,DISEASES AND DISORDERS OF THE CIRCULATORY SYSTEM,2,Moderate,Major,Medical,Medicare,Medicaid,,,,Y,80069.99,15705.59
Long Island,Suffolk,5123000,000885,Long Island Community Hospital,70 or Older,119,M,White,Not Span/Hispanic,2,Emergency,Home or Self Care,2020,CIR011,CORONARY ATHEROSCLEROSIS AND OTHER HEART DISEASE,,,198,ANGINA PECTORIS & CORONARY ATHEROSCLEROSIS,05,DISEASES AND DISORDERS OF THE CIRCULATORY SYSTEM,2,Moderate,Moderate,Medical,Medicare,,,,,Y,16987.19,3218.74
Long Island,Suffolk,5123000,000885,Long Island Community Hospital,70 or Older,117,M,White,Not Span/Hispanic,3,Emergency,Home w/ Home Health Services,2020,CIR012,NONSPECIFIC CHEST PAIN,,,198,ANGINA PECTORIS & CORONARY ATHEROSCLEROSIS,05,DISEASES AND DISORDERS OF THE CIRCULATORY SYSTEM,2,Moderate,Moderate,Medical,Medicare,Medicare,Blue Cross/Blue Shield,,,Y,39361.47,7188.03
Long Island,Suffolk,5123000,000885,Long Island Community Hospital,70 or Older,117,M,White,Not Span/Hispanic,1,Emergency,Short-term Hospital,2020,CIR011,CORONARY ATHEROSCLEROSIS AND OTHER HEART DISEASE,,,198,ANGINA PECTORIS & CORONARY ATHEROSCLEROSIS,05,DISEASES AND DISORDERS OF THE CIRCULATORY SYSTEM,1,Minor,Minor,Medical,Medicare,Medicare,Blue Cross/Blue Shield,,,Y,10542.73,1839.86
Long Island,Suffolk,5123000,000885,Long Island Community Hospital,18 to 29,119,M,White,Not Span/Hispanic,1,Emergency,Home or Self Care,2020,CIR012,NONSPECIFIC CHEST PAIN,,,198,ANGINA PECTORIS & CORONARY ATHEROSCLEROSIS,05,DISEASES AND DISORDERS OF THE CIRCULATORY SYSTEM,1,Minor,Minor,Medical,Private Health Insurance,Medicaid,,,,N,4714.5,1274.53
Long Island,Suffolk,5123000,000885,Long Island Community Hospital,70 or Older,119,M,White,Not Span/Hispanic,2,Emergency,Home or Self Care,2020,CIR012,NONSPECIFIC CHEST PAIN,OTR004,ISOLATION PROCEDURES,198,ANGINA PECTORIS & CORONARY ATHEROSCLEROSIS,05,DISEASES AND DISORDERS OF THE CIRCULATORY SYSTEM,3,Major,Moderate,Medical,Medicare,,,,,Y,44379.85,4412.63
