Hospital Service Area,Hospital County,Operating Certificate Number,Permanent Facility Id,Facility Name,Age Group,Zip Code - 3 digits,Gender,Race,Ethnicity,Length of Stay,Type of Admission,Patient Disposition,Discharge Year,CCS Diagnosis Code,CCS Diagnosis Description,CCS Procedure Code,CCS Procedure Description,APR DRG Code,APR DRG Description,APR MDC Code,APR MDC Description,APR Severity of Illness Code,APR Severity of Illness Description,APR Risk of Mortality,APR Medical Surgical Description,Payment Typology 1,Payment Typology 2,Payment Typology 3,Birth Weight,Abortion Edit Indicator,Emergency Department Indicator,Total Charges,Total Costs
New York City,Manhattan,7002001,001438,Bellevue Hospital Center,50 to 69,112,F,Black/African American,Not Span/Hispanic,1,Emergency,Home or Self Care,2019,CIR008,HYPERTENSION WITH COMPLICATIONS AND SECONDARY HYPERTENSION,,,199,HYPERTENSION,05,DISEASES AND DISORDERS OF THE CIRCULATORY SYSTEM,2,Moderate,Moderate,Medical,Medicaid,,,,,true,11535.34,7666.39
New York City,Manhattan,7002001,001438,Bellevue Hospital Center,0 to 17,104,M,Other Race,Not Span/Hispanic,3,Emergency,Home or Self Care,2019,CIR008,HYPERTENSION WITH COMPLICATIONS AND SECONDARY HYPERTENSION,IMG005,MAGNETIC RESONANCE IMAGING (MRI),199,HYPERTENSION,05,DISEASES AND DISORDERS OF THE CIRCULATORY SYSTEM,2,Moderate,Minor,Medical,Medicaid,Medicaid,,,,false,20523,13639.59
Hudson Valley,Westchester,5902001,001045,White Plains Hospital Center,50 to 69,108,M,Other Race,Not Span/Hispanic,3,Emergency,Home or Self Care,2019,CIR008,HYPERTENSION WITH COMPLICATIONS AND SECONDARY HYPERTENSION,,,199,HYPERTENSION,05,DISEASES AND DISORDERS OF THE CIRCULATORY SYSTEM,2,Moderate,Minor,Medical,Medicaid,,,,,true,29883,6779.92
Hudson Valley,Westchester,5902001,001045,White Plains Hospital Center,30 to 49,106,M,Black/African American,Not Span/Hispanic,1,Emergency,Home or Self Care,2019,CIR008,HYPERTENSION WITH COMPLICATIONS AND SECONDARY HYPERTENSION,,,199,HYPERTENSION,05,DISEASES AND DISORDERS OF THE CIRCULATORY SYSTEM,4,Extreme,Major,Medical,Self-Pay,,,,,true,20942,3283.78
Hudson Valley,Rockland,4329000,000779,Good Samaritan Hospital of Suffern,70 or Older,109,M,White,Not Span/Hispanic,4,Emergency,Home or Self Care,2019,CIR008,HYPERTENSION WITH COMPLICATIONS AND SECONDARY HYPERTENSION,,,199,HYPERTENSION,05,DISEASES AND DISORDERS OF THE CIRCULATORY SYSTEM,3,Major,Moderate,Medical,Medicare,,,,,true,61906.79,9574.18
Hudson Valley,Westchester,5902001,001045,White Plains Hospital Center,50 to 69,104,M,Black/African American,Not Span/Hispanic,2,Emergency,Home or Self Care,2019,CIR008,HYPERTENSION WITH COMPLICATIONS AND SECONDARY HYPERTENSION,,,199,HYPERTENSION,05,DISEASES AND DISORDERS OF THE CIRCULATORY SYSTEM,2,Moderate,Moderate,Medical,Medicaid,,,,,true,35147,6552.6
New York City,Kings,7002053,001304,NYU Langone Hospital-Brooklyn,50 to 69,112,M,Black/African American,Not Span/Hispanic,4,Emergency,Home or Self Care,2019,CIR008,HYPERTENSION WITH COMPLICATIONS AND SECONDARY HYPERTENSION,,,199,HYPERTENSION,05,DISEASES AND DISORDERS OF THE CIRCULATORY SYSTEM,2,Moderate,Minor,Medical,Private Health Insurance,Medicare,,,,true,49008.14,15634.96
New York City,Kings,7002053,001304,NYU Langone Hospital-Brooklyn,70 or Older,112,F,White,Unknown,2,Emergency,Home or Self Care,2019,CIR008,HYPERTENSION WITH COMPLICATIONS AND SECONDARY HYPERTENSION,IMG007,COMPUTERIZED TOMOGRAPHY (CT) WITHOUT CONTRAST,199,HYPERTENSION,05,DISEASES AND DISORDERS OF THE CIRCULATORY SYSTEM,2,Moderate,Moderate,Medical,Medicare,Private Health Insurance,,,,true,29118.84,9089.96
Long Island,Nassau,2908000,000511,NYU Langone Hospital-Long Island,50 to 69,115,M,Black/African American,Not Span/Hispanic,5,Emergency,Home or Self Care,2019,CIR008,HYPERTENSION WITH COMPLICATIONS AND SECONDARY HYPERTENSION,,,199,HYPERTENSION,05,DISEASES AND DISORDERS OF THE CIRCULATORY SYSTEM,1,Minor,Minor,Medical,Blue Cross/Blue Shield,Medicare,,,,true,60018.44,11689.38
New York City,Kings,7001016,001301,Kings County Hospital Center,50 to 69,OOS,M,Black/African American,Not Span/Hispanic,2,Emergency,Home or Self Care,2019,CIR008,HYPERTENSION WITH COMPLICATIONS AND SECONDARY HYPERTENSION,ADM021,"ADMINISTRATION OF THERAPEUTIC SUBSTANCES, NEC",199,HYPERTENSION,05,DISEASES AND DISORDERS OF THE CIRCULATORY SYSTEM,4,Extreme,Extreme,Medical,Private Health Insurance,,,,,true,19494.93,13848.44
Finger Lakes,Monroe,2701003,000411,Rochester General Hospital,70 or Older,146,F,Other Race,Spanish/Hispanic,3,Emergency,Home w/ Home Health Services,2019,CIR008,HYPERTENSION WITH COMPLICATIONS AND SECONDARY HYPERTENSION,,,199,HYPERTENSION,05,DISEASES AND DISORDERS OF THE CIRCULATORY SYSTEM,2,Moderate,Major,Medical,Medicare,,,,,true,10726.45,4876.92
Finger Lakes,Monroe,2701003,000411,Rochester General Hospital,70 or Older,146,F,White,Not Span/Hispanic,4,Emergency,Home or Self Care,2019,CIR008,HYPERTENSION WITH COMPLICATIONS AND SECONDARY HYPERTENSION,,,199,HYPERTENSION,05,DISEASES AND DISORDERS OF THE CIRCULATORY SYSTEM,1,Minor,Moderate,Medical,Medicare,,,,,true,13751.64,5908.27
New York City,Bronx,7000001,001178,BronxCare Hospital Center,50 to 69,104,M,Black/African American,Not Span/Hispanic,1,Emergency,Left Against Medical Advice,2019,CIR008,HYPERTENSION WITH COMPLICATIONS AND SECONDARY HYPERTENSION,,,199,HYPERTENSION,05,DISEASES AND DISORDERS OF THE CIRCULATORY SYSTEM,2,Moderate,Moderate,Medical,Medicaid,Medicaid,,,,false,7730.86,7642.46
New York City,Kings,7001002,001286,Brookdale Hospital Medical Center,30 to 49,112,F,Black/African American,Not Span/Hispanic,1,Emergency,Home or Self Care,2019,CIR007,ESSENTIAL HYPERTENSION,IMG006,COMPUTERIZED TOMOGRAPHY (CT) WITH CONTRAST,199,HYPERTENSION,05,DISEASES AND DISORDERS OF THE CIRCULATORY SYSTEM,1,Minor,Minor,Medical,Medicaid,,,,,true,6972.81,3058.44
New York City,Kings,7001002,001286,Brookdale Hospital Medical Center,50 to 69,112,M,Black/African American,Not Span/Hispanic,3,Emergency,Skilled Nursing Home,2019,CIR008,HYPERTENSION WITH COMPLICATIONS AND SECONDARY HYPERTENSION,,,199,HYPERTENSION,05,DISEASES AND DISORDERS OF THE CIRCULATORY SYSTEM,2,Moderate,Minor,Medical,Medicare,Medicaid,,,,true,18213.83,9410.21
New York City,Bronx,7000002,001165,Jacobi Medical Center,50 to 69,104,F,White,Not Span/Hispanic,2,Emergency,Home or Self Care,2019,CIR008,HYPERTENSION WITH COMPLICATIONS AND SECONDARY HYPERTENSION,,,199,HYPERTENSION,05,DISEASES AND DISORDERS OF THE CIRCULATORY SYSTEM,1,Minor,Minor,Medical,Medicaid,,,,,true,18099.4,10708.51
Hudson Valley,Westchester,5922000,001122,New York - Presbyterian Hospital,18 to 29,104,M,Other Race,Not Span/Hispanic,1,Emergency,Home or Self Care,2019,CIR007,ESSENTIAL HYPERTENSION,,,199,HYPERTENSION,05,DISEASES AND DISORDERS OF THE CIRCULATORY SYSTEM,1,Minor,Minor,Medical,Self-Pay,,,,,true,22166.8,6463.92
Finger Lakes,Monroe,2701003,000411,Rochester General Hospital,50 to 69,146,M,Black/African American,Not Span/Hispanic,2,Emergency,Home or Self Care,2019,CIR008,HYPERTENSION WITH COMPLICATIONS AND SECONDARY HYPERTENSION,,,199,HYPERTENSION,05,DISEASES AND DISORDERS OF THE CIRCULATORY SYSTEM,4,Extreme,Major,Medical,Medicare,Medicare,,,,true,14779.17,5862.64
Long Island,Suffolk,5154001,000925,Good Samaritan Hospital Medical Center,70 or Older,117,M,White,Not Span/Hispanic,4,Emergency,Home or Self Care,2019,CIR007,ESSENTIAL HYPERTENSION,IMG005,MAGNETIC RESONANCE IMAGING (MRI),199,HYPERTENSION,05,DISEASES AND DISORDERS OF THE CIRCULATORY SYSTEM,2,Moderate,Moderate,Medical,Medicare,Private Health Insurance,,,,true,40959.9,6556.43
New York City,Kings,7001021,001306,New York - Presbyterian Brooklyn Methodist Hospital,30 to 49,112,M,White,Spanish/Hispanic,2,Emergency,Home or Self Care,2019,CIR008,HYPERTENSION WITH COMPLICATIONS AND SECONDARY HYPERTENSION,CAR024,VENOUS AND ARTERIAL CATHETER PLACEMENT,199,HYPERTENSION,05,DISEASES AND DISORDERS OF THE CIRCULATORY SYSTEM,3,Major,Moderate,Medical,Medicaid,Self-Pay,,,,true,27582.28,7193.1
Central NY,Oneida,3202003,000599,Faxton-St Lukes Healthcare St Lukes Division,30 to 49,135,F,Black/African American,Not Span/Hispanic,2,Emergency,Home or Self Care,2019,CIR008,HYPERTENSION WITH COMPLICATIONS AND SECONDARY HYPERTENSION,ESA001,HEMODIALYSIS,199,HYPERTENSION,05,DISEASES AND DISORDERS OF THE CIRCULATORY SYSTEM,2,Moderate,Moderate,Medical,Medicare,,,,,true,26206.49,5342.84
Hudson Valley,Dutchess,1302001,000181,Vassar Brothers Medical Center,70 or Older,125,M,White,Not Span/Hispanic,1,Emergency,Home or Self Care,2019,CIR008,HYPERTENSION WITH COMPLICATIONS AND SECONDARY HYPERTENSION,,,199,HYPERTENSION,05,DISEASES AND DISORDERS OF THE CIRCULATORY SYSTEM,1,Minor,Minor,Medical,Self-Pay,,,,,false,11809.42,2220.68
Hudson Valley,Westchester,5932000,001129,Phelps Hospital,50 to 69,OOS,M,White,Not Span/Hispanic,1,Emergency,Home or Self Care,2019,CIR008,HYPERTENSION WITH COMPLICATIONS AND SECONDARY HYPERTENSION,,,199,HYPERTENSION,05,DISEASES AND DISORDERS OF THE CIRCULATORY SYSTEM,2,Moderate,Minor,Medical,Blue Cross/Blue Shield,,,,,true,39682.39,3863.32
Hudson Valley,Westchester,5902001,001045,White Plains Hospital Center,30 to 49,105,F,Other Race,Not Span/Hispanic,1,Emergency,Home or Self Care,2019,CIR008,HYPERTENSION WITH COMPLICATIONS AND SECONDARY HYPERTENSION,,,199,HYPERTENSION,05,DISEASES AND DISORDERS OF THE CIRCULATORY SYSTEM,1,Minor,Minor,Medical,Self-Pay,,,,,true,11312,2720.42
New York City,Kings,7001002,001286,Brookdale Hospital Medical Center,50 to 69,112,F,Black/African American,Not Span/Hispanic,6,Emergency,Home or Self Care,2019,CIR008,HYPERTENSION WITH COMPLICATIONS AND SECONDARY HYPERTENSION,,,199,HYPERTENSION,05,DISEASES AND DISORDERS OF THE CIRCULATORY SYSTEM,3,Major,Moderate,Medical,Medicaid,,,,,true,34519.27,16686.73
New York City,Kings,7001002,001286,Brookdale Hospital Medical Center,50 to 69,112,M,Black/African American,Not Span/Hispanic,1,Emergency,Left Against Medical Advice,2019,CIR008,HYPERTENSION WITH COMPLICATIONS AND SECONDARY HYPERTENSION,ESA004,NON-INVASIVE VENTILATION,199,HYPERTENSION,05,DISEASES AND DISORDERS OF THE CIRCULATORY SYSTEM,2,Moderate,Moderate,Medical,Medicaid,,,,,true,8522.5,3999.62
New York City,Kings,7002053,001304,NYU Langone Hospital-Brooklyn,50 to 69,112,M,Other Race,Not Span/Hispanic,1,Emergency,Home or Self Care,2019,CIR008,HYPERTENSION WITH COMPLICATIONS AND SECONDARY HYPERTENSION,IMG007,COMPUTERIZED TOMOGRAPHY (CT) WITHOUT CONTRAST,199,HYPERTENSION,05,DISEASES AND DISORDERS OF THE CIRCULATORY SYSTEM,3,Major,Moderate,Medical,Blue Cross/Blue Shield,,,,,true,19182.57,5160.47
New York City,Kings,7002053,001304,NYU Langone Hospital-Brooklyn,70 or Older,112,F,White,Not Span/Hispanic,3,Emergency,Skilled Nursing Home,2019,CIR008,HYPERTENSION WITH COMPLICATIONS AND SECONDARY HYPERTENSION,,,199,HYPERTENSION,05,DISEASES AND DISORDERS OF THE CIRCULATORY SYSTEM,3,Major,Major,Medical,Medicare,Medicare,,,,true,57419.96,15162.95
Finger Lakes,Monroe,2701003,000411,Rochester General Hospital,50 to 69,146,M,Black/African American,Not Span/Hispanic,3,Emergency,Home or Self Care,2019,CIR008,HYPERTENSION WITH COMPLICATIONS AND SECONDARY HYPERTENSION,ESA001,HEMODIALYSIS,199,HYPERTENSION,05,DISEASES AND DISORDERS OF THE CIRCULATORY SYSTEM,3,Major,Major,Medical,Medicare,,,,,true,12911.36,5342.73
Capital/Adirond,Albany,0101004,000005,St. Peter's Hospital,30 to 49,121,F,White,Not Span/Hispanic,1,Emergency,Home or Self Care,2019,CIR008,HYPERTENSION WITH COMPLICATIONS AND SECONDARY HYPERTENSION,,,199,HYPERTENSION,05,DISEASES AND DISORDERS OF THE CIRCULATORY SYSTEM,2,Moderate,Minor,Medical,Medicaid,Medicaid,,,,true,8269.05,2684.8
Finger Lakes,Monroe,2701003,000411,Rochester General Hospital,50 to 69,146,M,Black/African American,Not Span/Hispanic,6,Emergency,Left Against Medical Advice,2019,CIR008,HYPERTENSION WITH COMPLICATIONS AND SECONDARY HYPERTENSION,GIS001,ESOPHAGOGASTRODUODENOSCOPY (EGD) WITH BIOPSY,199,HYPERTENSION,05,DISEASES AND DISORDERS OF THE CIRCULATORY SYSTEM,3,Major,Moderate,Medical,Medicaid,,,,,true,26867.12,12514.87
New York City,Manhattan,7002054,001458,New York-Presbyterian Hospital - New York Weill Cornell Center,50 to 69,104,M,White,Not Span/Hispanic,1,Emergency,Home or Self Care,2019,CIR008,HYPERTENSION WITH COMPLICATIONS AND SECONDARY HYPERTENSION,,,199,HYPERTENSION,05,DISEASES AND DISORDERS OF THE CIRCULATORY SYSTEM,2,Moderate,Minor,Medical,Private Health Insurance,Self-Pay,,,,true,19259.21,4233.78
Hudson Valley,Rockland,4324000,000776,Montefiore Nyack,50 to 69,109,F,White,Not Span/Hispanic,2,Emergency,Short-term Hospital,2019,CIR008,HYPERTENSION WITH COMPLICATIONS AND SECONDARY HYPERTENSION,,,199,HYPERTENSION,05,DISEASES AND DISORDERS OF THE CIRCULATORY SYSTEM,4,Extreme,Major,Medical,Self-Pay,,,,,false,54140.65,10414.2
Hudson Valley,Westchester,5907001,001097,SJRH - St Johns Division,50 to 69,104,M,White,Spanish/Hispanic,2,Emergency,Home or Self Care,2019,CIR008,HYPERTENSION WITH COMPLICATIONS AND SECONDARY HYPERTENSION,,,199,HYPERTENSION,05,DISEASES AND DISORDERS OF THE CIRCULATORY SYSTEM,3,Major,Moderate,Medical,Medicaid,,,,,true,19754.13,6116.92
New York City,Kings,7001020,001305,Maimonides Medical Center,50 to 69,112,M,White,Not Span/Hispanic,1,Emergency,Home or Self Care,2019,CIR008,HYPERTENSION WITH COMPLICATIONS AND SECONDARY HYPERTENSION,IMG008,ULTRASONOGRAPHY,199,HYPERTENSION,05,DISEASES AND DISORDERS OF THE CIRCULATORY SYSTEM,1,Minor,Minor,Medical,Medicaid,Medicaid,Self-Pay,,,false,16757,2619.78
Long Island,Suffolk,5154001,000925,Good Samaritan Hospital Medical Center,50 to 69,117,F,White,Not Span/Hispanic,1,Emergency,Home or Self Care,2019,CIR008,HYPERTENSION WITH COMPLICATIONS AND SECONDARY HYPERTENSION,,,199,HYPERTENSION,05,DISEASES AND DISORDERS OF THE CIRCULATORY SYSTEM,2,Moderate,Moderate,Medical,Medicaid,Medicaid,,,,true,25077,3184.49
New York City,Bronx,7000001,001178,BronxCare Hospital Center,18 to 29,104,M,Other Race,Spanish/Hispanic,2,Emergency,Home or Self Care,2019,CIR008,HYPERTENSION WITH COMPLICATIONS AND SECONDARY HYPERTENSION,,,199,HYPERTENSION,05,DISEASES AND DISORDERS OF THE CIRCULATORY SYSTEM,3,Major,Major,Medical,Medicaid,Medicaid,,,,true,9013.59,10016.6
New York City,Kings,7001033,001315,Kingsbrook Jewish Medical Center,50 to 69,116,M,Black/African American,Not Span/Hispanic,4,Emergency,Skilled Nursing Home,2019,CIR008,HYPERTENSION WITH COMPLICATIONS AND SECONDARY HYPERTENSION,OTR004,ISOLATION PROCEDURES,199,HYPERTENSION,05,DISEASES AND DISORDERS OF THE CIRCULATORY SYSTEM,3,Major,Moderate,Medical,Medicaid,Self-Pay,,,,true,33666,11602.41
Long Island,Nassau,2950001,000527,Mount Sinai South Nassau,30 to 49,116,M,Black/African American,Not Span/Hispanic,2,Emergency,Home or Self Care,2019,CIR008,HYPERTENSION WITH COMPLICATIONS AND SECONDARY HYPERTENSION,,,199,HYPERTENSION,05,DISEASES AND DISORDERS OF THE CIRCULATORY SYSTEM,2,Moderate,Minor,Medical,Medicaid,Medicaid,,,,true,18691.46,3320.09
Hudson Valley,Rockland,4329000,000779,Good Samaritan Hospital of Suffern,70 or Older,109,F,Black/African American,Not Span/Hispanic,5,Emergency,Skilled Nursing Home,2019,CIR008,HYPERTENSION WITH COMPLICATIONS AND SECONDARY HYPERTENSION,,,199,HYPERTENSION,05,DISEASES AND DISORDERS OF THE CIRCULATORY SYSTEM,2,Moderate,Major,Medical,Medicare,Private Health Insurance,,,,true,84036.99,12185.46
New York City,Kings,7001021,001306,New York - Presbyterian Brooklyn Methodist Hospital,70 or Older,112,M,Black/African American,Not Span/Hispanic,5,Emergency,Skilled Nursing Home,2019,CIR008,HYPERTENSION WITH COMPLICATIONS AND SECONDARY HYPERTENSION,ESA004,NON-INVASIVE VENTILATION,199,HYPERTENSION,05,DISEASES AND DISORDERS OF THE CIRCULATORY SYSTEM,4,Extreme,Major,Medical,Medicare,Self-Pay,,,,true,49334.46,14258.05
New York City,Bronx,7000006,001169,Montefiore Medical Center - Henry & Lucy Moses Div,70 or Older,104,M,Black/African American,Not Span/Hispanic,6,Emergency,Home or Self Care,2019,CIR007,ESSENTIAL HYPERTENSION,IMG005,MAGNETIC RESONANCE IMAGING (MRI),199,HYPERTENSION,05,DISEASES AND DISORDERS OF THE CIRCULATORY SYSTEM,2,Moderate,Major,Medical,Medicare,,,,,true,117384.25,20246.44
New York City,Kings,7001020,001305,Maimonides Medical Center,70 or Older,112,F,White,Not Span/Hispanic,5,Emergency,Skilled Nursing Home,2019,CIR007,ESSENTIAL HYPERTENSION,MAM011,ELECTROENCEPHALOGRAM (EEG),199,HYPERTENSION,05,DISEASES AND DISORDERS OF THE CIRCULATORY SYSTEM,1,Minor,Minor,Medical,Medicare,Medicaid,Self-Pay,,,true,33939.01,9606.79
New York City,Manhattan,7002054,003975,New York Presbyterian Hospital - Allen Hospital,50 to 69,104,F,White,Spanish/Hispanic,2,Emergency,Home or Self Care,2019,CIR007,ESSENTIAL HYPERTENSION,,,199,HYPERTENSION,05,DISEASES AND DISORDERS OF THE CIRCULATORY SYSTEM,1,Minor,Minor,Medical,Private Health Insurance,Private Health Insurance,Self-Pay,,,true,26147.77,5763.69
New York City,Manhattan,7002054,003975,New York Presbyterian Hospital - Allen Hospital,70 or Older,104,F,White,Spanish/Hispanic,2,Emergency,Home w/ Home Health Services,2019,CIR008,HYPERTENSION WITH COMPLICATIONS AND SECONDARY HYPERTENSION,ADM021,"ADMINISTRATION OF THERAPEUTIC SUBSTANCES, NEC",199,HYPERTENSION,05,DISEASES AND DISORDERS OF THE CIRCULATORY SYSTEM,1,Minor,Minor,Medical,Medicare,Medicare,Self-Pay,,,true,34868.67,7493.95
Finger Lakes,Monroe,2701005,000413,Strong Memorial Hospital,70 or Older,146,F,Black/African American,Not Span/Hispanic,3,Emergency,Home or Self Care,2019,CIR008,HYPERTENSION WITH COMPLICATIONS AND SECONDARY HYPERTENSION,,,199,HYPERTENSION,05,DISEASES AND DISORDERS OF THE CIRCULATORY SYSTEM,3,Major,Major,Medical,Medicare,,,,,true,10876.7,5729.99
New York City,Manhattan,7002054,001464,New York-Presbyterian Hospital - Columbia Presbyterian Center,70 or Older,100,F,Other Race,Not Span/Hispanic,4,Emergency,Home w/ Home Health Services,2019,CIR008,HYPERTENSION WITH COMPLICATIONS AND SECONDARY HYPERTENSION,,,199,HYPERTENSION,05,DISEASES AND DISORDERS OF THE CIRCULATORY SYSTEM,2,Moderate,Moderate,Medical,Medicare,Medicare,Medicaid,,,true,49588.12,11229.51
Long Island,Suffolk,5151001,000245,Stony Brook University Hospital,70 or Older,117,F,White,Not Span/Hispanic,4,Emergency,Home or Self Care,2019,CIR008,HYPERTENSION WITH COMPLICATIONS AND SECONDARY HYPERTENSION,,,199,HYPERTENSION,05,DISEASES AND DISORDERS OF THE CIRCULATORY SYSTEM,3,Major,Major,Medical,Medicare,Private Health Insurance,,,,true,44197.53,13359.14
New York City,Kings,7001021,001306,New York - Presbyterian Brooklyn Methodist Hospital,30 to 49,112,M,White,Not Span/Hispanic,10,Emergency,Home or Self Care,2019,CIR008,HYPERTENSION WITH COMPLICATIONS AND SECONDARY HYPERTENSION,CAR024,VENOUS AND ARTERIAL CATHETER PLACEMENT,199,HYPERTENSION,05,DISEASES AND DISORDERS OF THE CIRCULATORY SYSTEM,3,Major,Minor,Medical,Medicaid,Self-Pay,,,,true,120231.99,33908.33
New York City,Bronx,7000006,001169,Montefiore Medical Center - Henry & Lucy Moses Div,50 to 69,104,F,Other Race,Unknown,1,Emergency,Home or Self Care,2019,CIR007,ESSENTIAL HYPERTENSION,ADM017,ADMINISTRATION OF NUTRITIONAL AND ELECTROLYTIC SUBSTANCES,199,HYPERTENSION,05,DISEASES AND DISORDERS OF THE CIRCULATORY SYSTEM,1,Minor,Minor,Medical,Medicaid,,,,,true,15887.46,2707.49
New York City,Kings,7001046,001309,Interfaith Medical Center,50 to 69,112,M,Black/African American,Not Span/Hispanic,5,Emergency,Left Against Medical Advice,2019,CIR008,HYPERTENSION WITH COMPLICATIONS AND SECONDARY HYPERTENSION,,,199,HYPERTENSION,05,DISEASES AND DISORDERS OF THE CIRCULATORY SYSTEM,1,Minor,Moderate,Medical,Medicaid,Medicaid,,,,true,33065.57,13699.05
New York City,Kings,7001002,001286,Brookdale Hospital Medical Center,50 to 69,112,F,Other Race,Unknown,2,Emergency,Home or Self Care,2019,CIR008,HYPERTENSION WITH COMPLICATIONS AND SECONDARY HYPERTENSION,ESA004,NON-INVASIVE VENTILATION,199,HYPERTENSION,05,DISEASES AND DISORDERS OF THE CIRCULATORY SYSTEM,3,Major,Major,Medical,Medicare,Medicaid,,,,true,12677.44,6360.35
New York City,Manhattan,7002001,001438,Bellevue Hospital Center,50 to 69,115,M,Black/African American,Not Span/Hispanic,11,Emergency,Home or Self Care,2019,CIR007,ESSENTIAL HYPERTENSION,ADM021,"ADMINISTRATION OF THERAPEUTIC SUBSTANCES, NEC",199,HYPERTENSION,05,DISEASES AND DISORDERS OF THE CIRCULATORY SYSTEM,3,Major,Moderate,Medical,Medicare,Medicare,Medicaid,,,true,56399.1,37482.84
New York City,Manhattan,7002001,001438,Bellevue Hospital Center,50 to 69,112,F,Other Race,Spanish/Hispanic,2,Emergency,Home or Self Care,2019,CIR008,HYPERTENSION WITH COMPLICATIONS AND SECONDARY HYPERTENSION,MAM004,CARDIAC STRESS TESTS,199,HYPERTENSION,05,DISEASES AND DISORDERS OF THE CIRCULATORY SYSTEM,1,Minor,Minor,Medical,Medicaid,Medicaid,,,,true,19974.43,13275.01
New York City,Manhattan,7002054,001464,New York-Presbyterian Hospital - Columbia Presbyterian Center,70 or Older,100,M,Other Race,Not Span/Hispanic,3,Emergency,Home w/ Home Health Services,2019,CIR008,HYPERTENSION WITH COMPLICATIONS AND SECONDARY HYPERTENSION,,,199,HYPERTENSION,05,DISEASES AND DISORDERS OF THE CIRCULATORY SYSTEM,1,Minor,Moderate,Medical,Medicare,Medicaid,Self-Pay,,,true,47590.23,10660.41
New York City,Kings,7001003,001288,Brooklyn Hospital Center - Downtown Campus,70 or Older,112,M,Black/African American,Unknown,7,Emergency,Home or Self Care,2019,CIR008,HYPERTENSION WITH COMPLICATIONS AND SECONDARY HYPERTENSION,,,199,HYPERTENSION,05,DISEASES AND DISORDERS OF THE CIRCULATORY SYSTEM,2,Moderate,Moderate,Medical,Medicare,Medicare,Medicaid,,,true,103531.59,17523.96
New York City,Kings,7001021,001306,New York - Presbyterian Brooklyn Methodist Hospital,70 or Older,112,F,Black/African American,Not Span/Hispanic,3,Emergency,Home or Self Care,2019,CIR007,ESSENTIAL HYPERTENSION,IMG008,ULTRASONOGRAPHY,199,HYPERTENSION,05,DISEASES AND DISORDERS OF THE CIRCULATORY SYSTEM,1,Minor,Minor,Medical,Medicare,Blue Cross/Blue Shield,Self-Pay,,,true,23040.64,5621.94
New York City,Bronx,7000024,001186,North Central Bronx Hospital,50 to 69,104,F,Other Race,Spanish/Hispanic,2,Emergency,Home or Self Care,2019,CIR008,HYPERTENSION WITH COMPLICATIONS AND SECONDARY HYPERTENSION,,,199,HYPERTENSION,05,DISEASES AND DISORDERS OF THE CIRCULATORY SYSTEM,3,Major,Moderate,Medical,Medicaid,Medicaid,,,,true,15298.04,9183.55
New York City,Bronx,7000006,001169,Montefiore Medical Center - Henry & Lucy Moses Div,50 to 69,104,M,Black/African American,Not Span/Hispanic,3,Emergency,Home or Self Care,2019,CIR008,HYPERTENSION WITH COMPLICATIONS AND SECONDARY HYPERTENSION,,,199,HYPERTENSION,05,DISEASES AND DISORDERS OF THE CIRCULATORY SYSTEM,2,Moderate,Minor,Medical,Private Health Insurance,,,,,true,35876.43,7145.81
New York City,Kings,7001003,001288,Brooklyn Hospital Center - Downtown Campus,70 or Older,112,F,Black/African American,Unknown,4,Emergency,Home or Self Care,2019,CIR008,HYPERTENSION WITH COMPLICATIONS AND SECONDARY HYPERTENSION,,,199,HYPERTENSION,05,DISEASES AND DISORDERS OF THE CIRCULATORY SYSTEM,2,Moderate,Moderate,Medical,Medicare,Medicare,Medicaid,,,true,51448.5,8785.06
Finger Lakes,Monroe,2701003,000411,Rochester General Hospital,30 to 49,146,F,Black/African American,Not Span/Hispanic,1,Emergency,Home or Self Care,2019,CIR008,HYPERTENSION WITH COMPLICATIONS AND SECONDARY HYPERTENSION,,,199,HYPERTENSION,05,DISEASES AND DISORDERS OF THE CIRCULATORY SYSTEM,2,Moderate,Moderate,Medical,Medicaid,,,,,true,5998.96,2053.97
Hudson Valley,Rockland,4324000,000776,Montefiore Nyack,70 or Older,109,F,Black/African American,Not Span/Hispanic,1,Emergency,Psychiatric Hospital or Unit of Hosp,2019,CIR008,HYPERTENSION WITH COMPLICATIONS AND SECONDARY HYPERTENSION,,,199,HYPERTENSION,05,DISEASES AND DISORDERS OF THE CIRCULATORY SYSTEM,2,Moderate,Moderate,Medical,Medicare,Medicaid,,,,false,10584.81,1852