Hospital Service Area,Hospital County,Operating Certificate Number,Permanent Facility Id,Facility Name,Age Group,Zip Code - 3 digits,Gender,Race,Ethnicity,Length of Stay,Type of Admission,Patient Disposition,Discharge Year,CCS Diagnosis Code,CCS Diagnosis Description,CCS Procedure Code,CCS Procedure Description,APR DRG Code,APR DRG Description,APR MDC Code,APR MDC Description,APR Severity of Illness Code,APR Severity of Illness Description,APR Risk of Mortality,APR Medical Surgical Description,Payment Typology 1,Payment Typology 2,Payment Typology 3,Birth Weight,Abortion Edit Indicator,Emergency Department Indicator,Total Charges,Total Costs
New York City,Manhattan,7002053,001463,NYU Langone Hospitals,30 to 49,100,F,White,Not Span/Hispanic,2,Emergency,Home or Self Care,2020,CIR008,HYPERTENSION WITH COMPLICATIONS AND SECONDARY HYPERTENSION,MAM011,ELECTROENCEPHALOGRAM (EEG),199,HYPERTENSION,05,DISEASES AND DISORDERS OF THE CIRCULATORY SYSTEM,1,Minor,Minor,Medical,Blue Cross/Blue Shield,,,,,Y,42557.94,9314.72
New York City,Manhattan,7002053,001463,NYU Langone Hospitals,70 or Older,101,F,White,Not Span/Hispanic,6,Emergency,Home or Self Care,2020,CIR008,HYPERTENSION WITH COMPLICATIONS AND SECONDARY HYPERTENSION,IMG008,ULTRASONOGRAPHY,199,HYPERTENSION,05,DISEASES AND DISORDERS OF THE CIRCULATORY SYSTEM,2,Moderate,Moderate,Medical,Medicare,Blue Cross/Blue Shield,,,,Y,88098.38,23461.9
New York City,Manhattan,7002053,001463,NYU Langone Hospitals,50 to 69,113,M,Other Race,Not Span/Hispanic,1,Emergency,Home w/ Home Health Services,2020,CIR008,HYPERTENSION WITH COMPLICATIONS AND SECONDARY HYPERTENSION,ESA001,HEMODIALYSIS,199,HYPERTENSION,05,DISEASES AND DISORDERS OF THE CIRCULATORY SYSTEM,3,Major,Moderate,Medical,Medicare,Medicaid,,,,Y,40686.11,8362.37
New York City,Manhattan,7002053,001463,NYU Langone Hospitals,70 or Older,100,F,Other Race,Spanish/Hispanic,2,Emergency,Home w/ Home Health Services,2020,CIR008,HYPERTENSION WITH COMPLICATIONS AND SECONDARY HYPERTENSION,IMG007,COMPUTERIZED TOMOGRAPHY (CT) WITHOUT CONTRAST,199,HYPERTENSION,05,DISEASES AND DISORDERS OF THE CIRCULATORY SYSTEM,1,Minor,Minor,Medical,Medicare,Medicaid,,,,Y,93216.94,11042.23
New York City,Manhattan,7002053,001463,NYU Langone Hospitals,50 to 69,112,F,Black/African American,Not Span/Hispanic,5,Emergency,Home or Self Care,2020,CIR008,HYPERTENSION WITH COMPLICATIONS AND SECONDARY HYPERTENSION,,,199,HYPERTENSION,05,DISEASES AND DISORDERS OF THE CIRCULATORY SYSTEM,4,Extreme,Extreme,Medical,Private Health Insurance,,,,,Y,90391.77,24316.91
New York City,Manhattan,7002053,001463,NYU Langone Hospitals,70 or Older,100,F,Other Race,Not Span/Hispanic,6,Emergency,Skilled Nursing Home,2020,CIR008,HYPERTENSION WITH COMPLICATIONS AND SECONDARY HYPERTENSION,MAM011,ELECTROENCEPHALOGRAM (EEG),199,HYPERTENSION,05,DISEASES AND DISORDERS OF THE CIRCULATORY SYSTEM,2,Moderate,Major,Medical,Medicare,Medicaid,,,,Y,117395.17,24049.6
New York City,Manhattan,7002053,001463,NYU Langone Hospitals,50 to 69,112,M,Other Race,Unknown,4,Emergency,Home or Self Care,2020,CIR008,HYPERTENSION WITH COMPLICATIONS AND SECONDARY HYPERTENSION,,,199,HYPERTENSION,05,DISEASES AND DISORDERS OF THE CIRCULATORY SYSTEM,2,Moderate,Moderate,Medical,Medicaid,,,,,Y,65181.27,19481.41
New York City,Manhattan,7002053,001463,NYU Langone Hospitals,70 or Older,100,F,Other Race,Not Span/Hispanic,1,Emergency,Home w/ Home Health Services,2020,CIR008,HYPERTENSION WITH COMPLICATIONS AND SECONDARY HYPERTENSION,ESA001,HEMODIALYSIS,199,HYPERTENSION,05,DISEASES AND DISORDERS OF THE CIRCULATORY SYSTEM,4,Extreme,Major,Medical,Medicare,Medicare,,,,Y,35195.02,14619.41
New York City,Manhattan,7002053,001463,NYU Langone Hospitals,50 to 69,112,M,White,Not Span/Hispanic,2,Emergency,Home or Self Care,2020,CIR008,HYPERTENSION WITH COMPLICATIONS AND SECONDARY HYPERTENSION,IMG008,ULTRASONOGRAPHY,199,HYPERTENSION,05,DISEASES AND DISORDERS OF THE CIRCULATORY SYSTEM,3,Major,Moderate,Medical,Private Health Insurance,,,,,Y,42949.76,9274.87
New York City,Manhattan,7002053,001463,NYU Langone Hospitals,30 to 49,114,M,Black/African American,Not Span/Hispanic,1,Emergency,Home or Self Care,2020,CIR008,HYPERTENSION WITH COMPLICATIONS AND SECONDARY HYPERTENSION,,,199,HYPERTENSION,05,DISEASES AND DISORDERS OF THE CIRCULATORY SYSTEM,1,Minor,Minor,Medical,Blue Cross/Blue Shield,,,,,Y,15330.16,4355.43
New York City,Manhattan,7002053,001463,NYU Langone Hospitals,70 or Older,100,M,White,Not Span/Hispanic,4,Emergency,Home w/ Home Health Services,2020,CIR008,HYPERTENSION WITH COMPLICATIONS AND SECONDARY HYPERTENSION,,,199,HYPERTENSION,05,DISEASES AND DISORDERS OF THE CIRCULATORY SYSTEM,2,Moderate,Moderate,Medical,Medicare,Medicare,,,,Y,41595.71,14415.73
New York City,Manhattan,7002053,001463,NYU Langone Hospitals,70 or Older,100,F,White,Not Span/Hispanic,1,Emergency,Home or Self Care,2020,CIR008,HYPERTENSION WITH COMPLICATIONS AND SECONDARY HYPERTENSION,,,199,HYPERTENSION,05,DISEASES AND DISORDERS OF THE CIRCULATORY SYSTEM,3,Major,Major,Medical,Medicare,,,,,Y,20878.71,4877.09
New York City,Manhattan,7002053,001463,NYU Langone Hospitals,30 to 49,104,M,Other Race,Unknown,14,Emergency,Psychiatric Hospital or Unit of Hosp,2020,CIR008,HYPERTENSION WITH COMPLICATIONS AND SECONDARY HYPERTENSION,,,199,HYPERTENSION,05,DISEASES AND DISORDERS OF THE CIRCULATORY SYSTEM,4,Extreme,Extreme,Medical,Medicaid,,,,,Y,132653.36,47048.1
New York City,Manhattan,7002053,001463,NYU Langone Hospitals,70 or Older,OOS,F,White,Not Span/Hispanic,2,Emergency,Home w/ Home Health Services,2020,CIR008,HYPERTENSION WITH COMPLICATIONS AND SECONDARY HYPERTENSION,ESA004,NON-INVASIVE VENTILATION,199,HYPERTENSION,05,DISEASES AND DISORDERS OF THE CIRCULATORY SYSTEM,2,Moderate,Major,Medical,Private Health Insurance,Medicare,Blue Cross/Blue Shield,,,Y,44732.25,10286.81
New York City,Manhattan,7002053,001463,NYU Langone Hospitals,30 to 49,112,M,White,Not Span/Hispanic,3,Emergency,Left Against Medical Advice,2020,CIR008,HYPERTENSION WITH COMPLICATIONS AND SECONDARY HYPERTENSION,,,199,HYPERTENSION,05,DISEASES AND DISORDERS OF THE CIRCULATORY SYSTEM,2,Moderate,Minor,Medical,Self-Pay,,,,,Y,44926,12154.33
New York City,Manhattan,7002053,001463,NYU Langone Hospitals,0 to 17,112,F,Black/African American,Not Span/Hispanic,1,Elective,Home or Self Care,2020,CIR008,HYPERTENSION WITH COMPLICATIONS AND SECONDARY HYPERTENSION,IMG002,FLUOROSCOPIC ANGIOGRAPHY (EXCLUDING CORONARY),199,HYPERTENSION,05,DISEASES AND DISORDERS OF THE CIRCULATORY SYSTEM,3,Major,Moderate,Medical,Medicaid,,,,,N,78730.48,12078.28
New York City,Manhattan,7002053,001463,NYU Langone Hospitals,70 or Older,OOS,M,Other Race,Not Span/Hispanic,1,Emergency,Left Against Medical Advice,2020,CIR008,HYPERTENSION WITH COMPLICATIONS AND SECONDARY HYPERTENSION,,,199,HYPERTENSION,05,DISEASES AND DISORDERS OF THE CIRCULATORY SYSTEM,1,Minor,Minor,Medical,Medicare,Medicaid,,,,Y,26189.47,5249.4
New York City,Manhattan,7002053,001463,NYU Langone Hospitals,70 or Older,100,F,White,Not Span/Hispanic,2,Emergency,Home or Self Care,2020,CIR008,HYPERTENSION WITH COMPLICATIONS AND SECONDARY HYPERTENSION,,,199,HYPERTENSION,05,DISEASES AND DISORDERS OF THE CIRCULATORY SYSTEM,2,Moderate,Major,Medical,Medicare,Medicare,,,,Y,36014.22,8971.41
New York City,Manhattan,7002053,001463,NYU Langone Hospitals,50 to 69,112,M,White,Not Span/Hispanic,1,Emergency,Home or Self Care,2020,CIR007,ESSENTIAL HYPERTENSION,,,199,HYPERTENSION,05,DISEASES AND DISORDERS OF THE CIRCULATORY SYSTEM,1,Minor,Minor,Medical,Blue Cross/Blue Shield,,,,,Y,34334.38,9206.5
New York City,Manhattan,7002053,001463,NYU Langone Hospitals,70 or Older,100,F,Other Race,Not Span/Hispanic,9,Emergency,Home or Self Care,2020,CIR008,HYPERTENSION WITH COMPLICATIONS AND SECONDARY HYPERTENSION,URN002,KIDNEY AND OTHER URINARY TRACT BIOPSY (NON-ENDOSCOPIC),199,HYPERTENSION,05,DISEASES AND DISORDERS OF THE CIRCULATORY SYSTEM,2,Moderate,Moderate,Medical,Medicare,,,,,Y,135427.55,35329.36
New York City,Manhattan,7002053,001463,NYU Langone Hospitals,50 to 69,112,M,White,Unknown,1,Emergency,Home or Self Care,2020,CIR008,HYPERTENSION WITH COMPLICATIONS AND SECONDARY HYPERTENSION,,,199,HYPERTENSION,05,DISEASES AND DISORDERS OF THE CIRCULATORY SYSTEM,2,Moderate,Moderate,Medical,Private Health Insurance,,,,,Y,24468.84,5453.39
New York City,Manhattan,7002053,001463,NYU Langone Hospitals,70 or Older,112,F,White,Not Span/Hispanic,11,Emergency,Home w/ Home Health Services,2020,CIR008,HYPERTENSION WITH COMPLICATIONS AND SECONDARY HYPERTENSION,IMG008,ULTRASONOGRAPHY,199,HYPERTENSION,05,DISEASES AND DISORDERS OF THE CIRCULATORY SYSTEM,3,Major,Extreme,Medical,Medicare,Blue Cross/Blue Shield,,,,Y,149986.52,39497.68
New York City,Manhattan,7002053,001463,NYU Langone Hospitals,30 to 49,112,M,White,Not Span/Hispanic,1,Emergency,Home or Self Care,2020,CIR007,ESSENTIAL HYPERTENSION,,,199,HYPERTENSION,05,DISEASES AND DISORDERS OF THE CIRCULATORY SYSTEM,1,Minor,Minor,Medical,Medicaid,,,,,Y,17635.71,4663.18
New York City,Manhattan,7002053,001463,NYU Langone Hospitals,70 or Older,114,F,Black/African American,Not Span/Hispanic,4,Emergency,Home or Self Care,2020,CIR008,HYPERTENSION WITH COMPLICATIONS AND SECONDARY HYPERTENSION,,,199,HYPERTENSION,05,DISEASES AND DISORDERS OF THE CIRCULATORY SYSTEM,3,Major,Major,Medical,Private Health Insurance,,,,,Y,120172.1,30657.23
New York City,Manhattan,7002053,001463,NYU Langone Hospitals,30 to 49,100,M,Other Race,Unknown,5,Emergency,Home or Self Care,2020,CIR008,HYPERTENSION WITH COMPLICATIONS AND SECONDARY HYPERTENSION,,,199,HYPERTENSION,05,DISEASES AND DISORDERS OF THE CIRCULATORY SYSTEM,3,Major,Major,Medical,Blue Cross/Blue Shield,,,,,Y,52341.92,17432.74
New York City,Manhattan,7002053,001463,NYU Langone Hospitals,70 or Older,112,M,White,Not Span/Hispanic,2,Emergency,Home w/ Home Health Services,2020,CIR008,HYPERTENSION WITH COMPLICATIONS AND SECONDARY HYPERTENSION,,,199,HYPERTENSION,05,DISEASES AND DISORDERS OF THE CIRCULATORY SYSTEM,1,Minor,Moderate,Medical,Medicare,Medicaid,,,,Y,38746.34,8895.97
New York City,Manhattan,7002053,001463,NYU Langone Hospitals,50 to 69,113,M,White,Not Span/Hispanic,2,Emergency,Home or Self Care,2020,CIR008,HYPERTENSION WITH COMPLICATIONS AND SECONDARY HYPERTENSION,OTR004,ISOLATION PROCEDURES,199,HYPERTENSION,05,DISEASES AND DISORDERS OF THE CIRCULATORY SYSTEM,3,Major,Major,Medical,Medicaid,,,,,Y,44064.02,9694.32
New York City,Manhattan,7002053,001463,NYU Langone Hospitals,70 or Older,100,M,Other Race,Not Span/Hispanic,2,Emergency,Home or Self Care,2020,CIR008,HYPERTENSION WITH COMPLICATIONS AND SECONDARY HYPERTENSION,,,199,HYPERTENSION,05,DISEASES AND DISORDERS OF THE CIRCULATORY SYSTEM,2,Moderate,Minor,Medical,Medicare,Medicaid,,,,Y,38333.79,8780.39
New York City,Manhattan,7002053,001463,NYU Langone Hospitals,70 or Older,112,F,Other Race,Not Span/Hispanic,1,Emergency,Home or Self Care,2020,CIR008,HYPERTENSION WITH COMPLICATIONS AND SECONDARY HYPERTENSION,OTR004,ISOLATION PROCEDURES,199,HYPERTENSION,05,DISEASES AND DISORDERS OF THE CIRCULATORY SYSTEM,1,Minor,Minor,Medical,Medicare,,,,,Y,23091.67,5109.25
New York City,Manhattan,7002053,001463,NYU Langone Hospitals,50 to 69,113,M,Other Race,Not Span/Hispanic,2,Emergency,Home w/ Home Health Services,2020,CIR008,HYPERTENSION WITH COMPLICATIONS AND SECONDARY HYPERTENSION,ESA001,HEMODIALYSIS,199,HYPERTENSION,05,DISEASES AND DISORDERS OF THE CIRCULATORY SYSTEM,3,Major,Moderate,Medical,Medicare,Medicaid,,,,Y,59418.99,17003.33
New York City,Manhattan,7002053,001463,NYU Langone Hospitals,70 or Older,113,F,Other Race,Not Span/Hispanic,1,Emergency,Home or Self Care,2020,CIR008,HYPERTENSION WITH COMPLICATIONS AND SECONDARY HYPERTENSION,,,199,HYPERTENSION,05,DISEASES AND DISORDERS OF THE CIRCULATORY SYSTEM,1,Minor,Minor,Medical,Medicare,Medicaid,,,,Y,54952.52,10879.19
New York City,Manhattan,7002053,001463,NYU Langone Hospitals,50 to 69,100,M,Other Race,Spanish/Hispanic,1,Emergency,Home or Self Care,2020,CIR008,HYPERTENSION WITH COMPLICATIONS AND SECONDARY HYPERTENSION,ESA001,HEMODIALYSIS,199,HYPERTENSION,05,DISEASES AND DISORDERS OF THE CIRCULATORY SYSTEM,2,Moderate,Major,Medical,Medicare,Medicaid,,,,Y,28026.81,9034.66
New York City,Manhattan,7002053,001463,NYU Langone Hospitals,30 to 49,100,M,Black/African American,Not Span/Hispanic,1,Emergency,Home or Self Care,2020,CIR008,HYPERTENSION WITH COMPLICATIONS AND SECONDARY HYPERTENSION,ESA001,HEMODIALYSIS,199,HYPERTENSION,05,DISEASES AND DISORDERS OF THE CIRCULATORY SYSTEM,3,Major,Extreme,Medical,Medicare,Medicaid,,,,Y,29884.06,9754.68
New York City,Manhattan,7002053,001463,NYU Langone Hospitals,70 or Older,,F,Other Race,Spanish/Hispanic,4,Emergency,Home or Self Care,2020,CIR008,HYPERTENSION WITH COMPLICATIONS AND SECONDARY HYPERTENSION,MAM011,ELECTROENCEPHALOGRAM (EEG),199,HYPERTENSION,05,DISEASES AND DISORDERS OF THE CIRCULATORY SYSTEM,3,Major,Major,Medical,Medicaid,,,,,Y,179955.65,37914.3
New York City,Manhattan,7002053,001463,NYU Langone Hospitals,70 or Older,100,F,White,Not Span/Hispanic,1,Emergency,Home or Self Care,2020,CIR008,HYPERTENSION WITH COMPLICATIONS AND SECONDARY HYPERTENSION,,,199,HYPERTENSION,05,DISEASES AND DISORDERS OF THE CIRCULATORY SYSTEM,2,Moderate,Minor,Medical,Medicare,Private Health Insurance,,,,Y,23880.89,6482.01
New York City,Manhattan,7002053,001463,NYU Langone Hospitals,50 to 69,112,M,Black/African American,Not Span/Hispanic,2,Emergency,Home or Self Care,2020,CIR008,HYPERTENSION WITH COMPLICATIONS AND SECONDARY HYPERTENSION,,,199,HYPERTENSION,05,DISEASES AND DISORDERS OF THE CIRCULATORY SYSTEM,1,Minor,Minor,Medical,Private Health Insurance,,,,,Y,80193.96,15689.49
New York City,Manhattan,7002053,001463,NYU Langone Hospitals,30 to 49,112,M,White,Not Span/Hispanic,2,Emergency,Home or Self Care,2020,CIR008,HYPERTENSION WITH COMPLICATIONS AND SECONDARY HYPERTENSION,IMG008,ULTRASONOGRAPHY,199,HYPERTENSION,05,DISEASES AND DISORDERS OF THE CIRCULATORY SYSTEM,2,Moderate,Minor,Medical,Private Health Insurance,,,,,Y,45933.69,11543.32
New York City,Manhattan,7002053,001463,NYU Langone Hospitals,50 to 69,112,F,Black/African American,Not Span/Hispanic,1,Emergency,Home or Self Care,2020,CIR008,HYPERTENSION WITH COMPLICATIONS AND SECONDARY HYPERTENSION,,,199,HYPERTENSION,05,DISEASES AND DISORDERS OF THE CIRCULATORY SYSTEM,2,Moderate,Minor,Medical,Medicaid,,,,,Y,36820.18,10362.25
New York City,Manhattan,7002053,001463,NYU Langone Hospitals,30 to 49,104,F,Black/African American,Not Span/Hispanic,7,Emergency,Home or Self Care,2020,CIR008,HYPERTENSION WITH COMPLICATIONS AND SECONDARY HYPERTENSION,,,199,HYPERTENSION,05,DISEASES AND DISORDERS OF THE CIRCULATORY SYSTEM,3,Major,Extreme,Medical,Self-Pay,,,,,Y,81293.29,24938.77
New York City,Manhattan,7002053,001463,NYU Langone Hospitals,70 or Older,112,M,Black/African American,Not Span/Hispanic,2,Emergency,Home w/ Home Health Services,2020,CIR008,HYPERTENSION WITH COMPLICATIONS AND SECONDARY HYPERTENSION,ESA001,HEMODIALYSIS,199,HYPERTENSION,05,DISEASES AND DISORDERS OF THE CIRCULATORY SYSTEM,2,Moderate,Major,Medical,Medicare,,,,,Y,49620.66,14591.94
New York City,Manhattan,7002053,001463,NYU Langone Hospitals,70 or Older,100,F,Other Race,Not Span/Hispanic,1,Emergency,Home w/ Home Health Services,2020,CIR008,HYPERTENSION WITH COMPLICATIONS AND SECONDARY HYPERTENSION,,,199,HYPERTENSION,05,DISEASES AND DISORDERS OF THE CIRCULATORY SYSTEM,1,Minor,Moderate,Medical,Medicare,Blue Cross/Blue Shield,,,,Y,57584.72,14638.23
New York City,Manhattan,7002053,001463,NYU Langone Hospitals,50 to 69,114,M,Other Race,Not Span/Hispanic,1,Emergency,Home w/ Home Health Services,2020,CIR008,HYPERTENSION WITH COMPLICATIONS AND SECONDARY HYPERTENSION,,,199,HYPERTENSION,05,DISEASES AND DISORDERS OF THE CIRCULATORY SYSTEM,2,Moderate,Major,Medical,Medicare,Medicaid,,,,Y,60293.5,9583.54
New York City,Manhattan,7002053,001463,NYU Langone Hospitals,70 or Older,100,F,Black/African American,Not Span/Hispanic,3,Emergency,Home or Self Care,2020,CIR008,HYPERTENSION WITH COMPLICATIONS AND SECONDARY HYPERTENSION,IMG008,ULTRASONOGRAPHY,199,HYPERTENSION,05,DISEASES AND DISORDERS OF THE CIRCULATORY SYSTEM,2,Moderate,Moderate,Medical,Medicare,,,,,Y,53956.64,16075.52
New York City,Manhattan,7002053,001463,NYU Langone Hospitals,30 to 49,112,F,Black/African American,Not Span/Hispanic,6,Emergency,Home or Self Care,2020,CIR008,HYPERTENSION WITH COMPLICATIONS AND SECONDARY HYPERTENSION,,,199,HYPERTENSION,05,DISEASES AND DISORDERS OF THE CIRCULATORY SYSTEM,2,Moderate,Major,Medical,Medicaid,,,,,Y,118776.85,38039.96
New York City,Manhattan,7002053,001463,NYU Langone Hospitals,50 to 69,100,M,White,Not Span/Hispanic,1,Emergency,Home w/ Home Health Services,2020,CIR008,HYPERTENSION WITH COMPLICATIONS AND SECONDARY HYPERTENSION,OTR004,ISOLATION PROCEDURES,199,HYPERTENSION,05,DISEASES AND DISORDERS OF THE CIRCULATORY SYSTEM,3,Major,Moderate,Medical,Medicare,Medicaid,,,,Y,18587.99,5873.57
New York City,Manhattan,7002053,001463,NYU Langone Hospitals,30 to 49,100,M,Other Race,Unknown,1,Emergency,Left Against Medical Advice,2020,CIR008,HYPERTENSION WITH COMPLICATIONS AND SECONDARY HYPERTENSION,ESA001,HEMODIALYSIS,199,HYPERTENSION,05,DISEASES AND DISORDERS OF THE CIRCULATORY SYSTEM,3,Major,Extreme,Medical,Medicare,,,,,Y,36520.19,12641.73
New York City,Manhattan,7002053,001463,NYU Langone Hospitals,50 to 69,114,F,Black/African American,Spanish/Hispanic,2,Emergency,Home or Self Care,2020,CIR008,HYPERTENSION WITH COMPLICATIONS AND SECONDARY HYPERTENSION,,,199,HYPERTENSION,05,DISEASES AND DISORDERS OF THE CIRCULATORY SYSTEM,2,Moderate,Moderate,Medical,Blue Cross/Blue Shield,Blue Cross/Blue Shield,,,,Y,37135.54,11860.6
New York City,Manhattan,7002053,001463,NYU Langone Hospitals,30 to 49,111,M,Black/African American,Not Span/Hispanic,8,Emergency,Home or Self Care,2020,CIR008,HYPERTENSION WITH COMPLICATIONS AND SECONDARY HYPERTENSION,URN002,KIDNEY AND OTHER URINARY TRACT BIOPSY (NON-ENDOSCOPIC),199,HYPERTENSION,05,DISEASES AND DISORDERS OF THE CIRCULATORY SYSTEM,4,Extreme,Extreme,Medical,Medicaid,,,,,Y,166313.5,46030.14
New York City,Manhattan,7002053,001463,NYU Langone Hospitals,70 or Older,100,M,Other Race,Not Span/Hispanic,6,Emergency,Home or Self Care,2020,CIR008,HYPERTENSION WITH COMPLICATIONS AND SECONDARY HYPERTENSION,CAR024,VENOUS AND ARTERIAL CATHETER PLACEMENT,199,HYPERTENSION,05,DISEASES AND DISORDERS OF THE CIRCULATORY SYSTEM,4,Extreme,Extreme,Medical,Medicare,,,,,Y,129130.21,35697.9
New York City,Manhattan,7002053,001463,NYU Langone Hospitals,70 or Older,113,M,White,Not Span/Hispanic,1,Emergency,Home or Self Care,2020,CIR007,ESSENTIAL HYPERTENSION,,,199,HYPERTENSION,05,DISEASES AND DISORDERS OF THE CIRCULATORY SYSTEM,1,Minor,Minor,Medical,Medicare,,,,,Y,46640.91,11736.53
New York City,Manhattan,7002053,001463,NYU Langone Hospitals,50 to 69,104,M,Black/African American,Not Span/Hispanic,3,Emergency,Home w/ Home Health Services,2020,CIR008,HYPERTENSION WITH COMPLICATIONS AND SECONDARY HYPERTENSION,MAM011,ELECTROENCEPHALOGRAM (EEG),199,HYPERTENSION,05,DISEASES AND DISORDERS OF THE CIRCULATORY SYSTEM,3,Major,Major,Medical,Medicare,Medicaid,,,,Y,57357.66,22102.09
New York City,Manhattan,7002053,001463,NYU Langone Hospitals,70 or Older,112,F,Other Race,Spanish/Hispanic,1,Emergency,Home w/ Home Health Services,2020,CIR008,HYPERTENSION WITH COMPLICATIONS AND SECONDARY HYPERTENSION,,,199,HYPERTENSION,05,DISEASES AND DISORDERS OF THE CIRCULATORY SYSTEM,1,Minor,Moderate,Medical,Medicare,Blue Cross/Blue Shield,Medicaid,,,Y,58477.24,14952.36
New York City,Manhattan,7002053,001463,NYU Langone Hospitals,70 or Older,100,F,Black/African American,Not Span/Hispanic,2,Emergency,Home or Self Care,2020,CIR008,HYPERTENSION WITH COMPLICATIONS AND SECONDARY HYPERTENSION,,,199,HYPERTENSION,05,DISEASES AND DISORDERS OF THE CIRCULATORY SYSTEM,3,Major,Major,Medical,Medicare,Blue Cross/Blue Shield,,,,Y,34319.02,11139.33
New York City,Manhattan,7002053,001463,NYU Langone Hospitals,70 or Older,100,F,White,Not Span/Hispanic,8,Emergency,Skilled Nursing Home,2020,CIR008,HYPERTENSION WITH COMPLICATIONS AND SECONDARY HYPERTENSION,,,199,HYPERTENSION,05,DISEASES AND DISORDERS OF THE CIRCULATORY SYSTEM,3,Major,Major,Medical,Medicare,,,,,Y,143888.21,42380.41
New York City,Manhattan,7002053,001463,NYU Langone Hospitals,70 or Older,100,F,Other Race,Spanish/Hispanic,1,Emergency,Home or Self Care,2020,CIR008,HYPERTENSION WITH COMPLICATIONS AND SECONDARY HYPERTENSION,,,199,HYPERTENSION,05,DISEASES AND DISORDERS OF THE CIRCULATORY SYSTEM,2,Moderate,Minor,Medical,Medicare,,,,,Y,31799.21,7327.8
New York City,Manhattan,7002053,001463,NYU Langone Hospitals,30 to 49,103,M,Black/African American,Not Span/Hispanic,3,Emergency,Left Against Medical Advice,2020,CIR008,HYPERTENSION WITH COMPLICATIONS AND SECONDARY HYPERTENSION,IMG008,ULTRASONOGRAPHY,199,HYPERTENSION,05,DISEASES AND DISORDERS OF THE CIRCULATORY SYSTEM,2,Moderate,Major,Medical,Medicaid,,,,,Y,67971.2,17187.01
New York City,Manhattan,7002053,001463,NYU Langone Hospitals,50 to 69,112,F,White,Not Span/Hispanic,2,Emergency,Home or Self Care,2020,CIR008,HYPERTENSION WITH COMPLICATIONS AND SECONDARY HYPERTENSION,,,199,HYPERTENSION,05,DISEASES AND DISORDERS OF THE CIRCULATORY SYSTEM,2,Moderate,Minor,Medical,Medicare,Medicaid,,,,Y,42977.43,11933.46
New York City,Manhattan,7002053,001463,NYU Langone Hospitals,70 or Older,100,M,White,Not Span/Hispanic,5,Emergency,Home w/ Home Health Services,2020,CIR008,HYPERTENSION WITH COMPLICATIONS AND SECONDARY HYPERTENSION,OTR004,ISOLATION PROCEDURES,199,HYPERTENSION,05,DISEASES AND DISORDERS OF THE CIRCULATORY SYSTEM,4,Extreme,Extreme,Medical,Medicare,Private Health Insurance,,,,Y,112624.58,34936.2
New York City,Manhattan,7002053,001463,NYU Langone Hospitals,50 to 69,100,F,Black/African American,Not Span/Hispanic,13,Emergency,Skilled Nursing Home,2020,CIR008,HYPERTENSION WITH COMPLICATIONS AND SECONDARY HYPERTENSION,OTR004,ISOLATION PROCEDURES,199,HYPERTENSION,05,DISEASES AND DISORDERS OF THE CIRCULATORY SYSTEM,2,Moderate,Moderate,Medical,Medicaid,,,,,Y,249638.29,96244.47
New York City,Manhattan,7002053,001463,NYU Langone Hospitals,50 to 69,100,F,Black/African American,Not Span/Hispanic,1,Emergency,Home or Self Care,2020,CIR008,HYPERTENSION WITH COMPLICATIONS AND SECONDARY HYPERTENSION,,,199,HYPERTENSION,05,DISEASES AND DISORDERS OF THE CIRCULATORY SYSTEM,1,Minor,Minor,Medical,Medicare,Medicare,,,,Y,39294,12862.5
New York City,Manhattan,7002053,001463,NYU Langone Hospitals,70 or Older,100,M,White,Not Span/Hispanic,1,Emergency,Home or Self Care,2020,CIR008,HYPERTENSION WITH COMPLICATIONS AND SECONDARY HYPERTENSION,,,199,HYPERTENSION,05,DISEASES AND DISORDERS OF THE CIRCULATORY SYSTEM,2,Moderate,Moderate,Medical,Medicare,Blue Cross/Blue Shield,,,,Y,27422.57,6779.97
New York City,Manhattan,7002053,001463,NYU Langone Hospitals,70 or Older,100,M,White,Not Span/Hispanic,1,Emergency,Home or Self Care,2020,CIR008,HYPERTENSION WITH COMPLICATIONS AND SECONDARY HYPERTENSION,,,199,HYPERTENSION,05,DISEASES AND DISORDERS OF THE CIRCULATORY SYSTEM,2,Moderate,Major,Medical,Medicare,Medicare,,,,Y,29494.72,6817.52
New York City,Manhattan,7002053,001463,NYU Langone Hospitals,50 to 69,OOS,F,Black/African American,Not Span/Hispanic,4,Emergency,Home or Self Care,2020,CIR008,HYPERTENSION WITH COMPLICATIONS AND SECONDARY HYPERTENSION,CAR024,VENOUS AND ARTERIAL CATHETER PLACEMENT,199,HYPERTENSION,05,DISEASES AND DISORDERS OF THE CIRCULATORY SYSTEM,3,Major,Major,Medical,Private Health Insurance,,,,,N,57082.25,27689.03
New York City,Manhattan,7002053,001463,NYU Langone Hospitals,70 or Older,112,F,White,Not Span/Hispanic,4,Emergency,Home w/ Home Health Services,2020,CIR008,HYPERTENSION WITH COMPLICATIONS AND SECONDARY HYPERTENSION,ESA004,NON-INVASIVE VENTILATION,199,HYPERTENSION,05,DISEASES AND DISORDERS OF THE CIRCULATORY SYSTEM,3,Major,Major,Medical,Medicare,Medicaid,,,,Y,73567.54,22202.43