Hospital Service Area,Hospital County,Operating Certificate Number,Permanent Facility Id,Facility Name,Age Group,Zip Code - 3 digits,Gender,Race,Ethnicity,Length of Stay,Type of Admission,Patient Disposition,Discharge Year,CCS Diagnosis Code,CCS Diagnosis Description,CCS Procedure Code,CCS Procedure Description,APR DRG Code,APR DRG Description,APR MDC Code,APR MDC Description,APR Severity of Illness Code,APR Severity of Illness Description,APR Risk of Mortality,APR Medical Surgical Description,Payment Typology 1,Payment Typology 2,Payment Typology 3,Birth Weight,Abortion Edit Indicator,Emergency Department Indicator,Total Charges,Total Costs
New York City,Manhattan,7002032,001469,Mount Sinai St. Luke's,50 to 69,100,F,Black/African American,Spanish/Hispanic,7,Trauma,Psychiatric Hospital or Unit of Hosp,2017,233,Intracranial injury,142,PARTIAL EXCISION BONE,020,Craniotomy for trauma,01,Diseases and Disorders of the Nervous System,2,Moderate,Moderate,Surgical,Medicaid,Self-Pay,,,N,Y,107136.43,34328.87
New York City,Bronx,7000006,001169,Montefiore Medical Center - Henry & Lucy Moses Div,50 to 69,104,M,Other Race,Not Span/Hispanic,15,Emergency,Skilled Nursing Home,2017,233,Intracranial injury,009,OTHER OR THER NERV SYS,020,Craniotomy for trauma,01,Diseases and Disorders of the Nervous System,3,Major,Major,Surgical,Medicare,Medicaid,,,N,Y,272771.47,58552.05
New York City,Manhattan,7002032,001466,Mount Sinai West,50 to 69,100,M,Black/African American,Unknown,60,Emergency,Inpatient Rehabilitation Facility,2017,233,Intracranial injury,009,OTHER OR THER NERV SYS,020,Craniotomy for trauma,01,Diseases and Disorders of the Nervous System,3,Major,Minor,Surgical,Medicaid,Self-Pay,,,N,Y,659266.91,206974.21
New York City,Manhattan,7002032,001469,Mount Sinai St. Luke's,70 or Older,100,M,Black/African American,Not Span/Hispanic,7,Trauma,Skilled Nursing Home,2017,233,Intracranial injury,001,INCISION & EXCISION CNS,020,Craniotomy for trauma,01,Diseases and Disorders of the Nervous System,3,Major,Major,Surgical,Medicare,Medicare,Medicaid,,N,Y,108616.35,34900.50
Hudson Valley,Orange,3523000,000699,Orange Regional Medical Center,50 to 69,109,F,White,Not Span/Hispanic,6,Emergency,Inpatient Rehabilitation Facility,2017,233,Intracranial injury,001,INCISION & EXCISION CNS,020,Craniotomy for trauma,01,Diseases and Disorders of the Nervous System,3,Major,Moderate,Surgical,Private Health Insurance,Blue Cross/Blue Shield,,,N,Y,88040.24,33005.86
Hudson Valley,Orange,3523000,000699,Orange Regional Medical Center,70 or Older,127,M,White,Not Span/Hispanic,13,Emergency,Skilled Nursing Home,2017,233,Intracranial injury,001,INCISION & EXCISION CNS,020,Craniotomy for trauma,01,Diseases and Disorders of the Nervous System,3,Major,Major,Surgical,Medicare,Private Health Insurance,,,N,Y,133001.12,53334.88
New York City,Manhattan,7002002,001439,Mount Sinai Beth Israel,18 to 29,100,M,Other Race,Unknown,4,Emergency,Home or Self Care,2017,228,Skull and face fractures,144,"TRTMNT,FACE FRACT/DISLC",020,Craniotomy for trauma,01,Diseases and Disorders of the Nervous System,1,Minor,Minor,Surgical,Self-Pay,Self-Pay,,,N,Y,70448.24,20972.72
New York City,Manhattan,7002053,001463,NYU Langone Hospitals,70 or Older,112,M,White,Not Span/Hispanic,5,Emergency,Skilled Nursing Home,2017,233,Intracranial injury,009,OTHER OR THER NERV SYS,020,Craniotomy for trauma,01,Diseases and Disorders of the Nervous System,3,Major,Major,Surgical,Medicare,,,,N,Y,157736.87,50930.13
Long Island,Nassau,2950002,000528,Nassau University Medical Center,70 or Older,,M,Black/African American,Not Span/Hispanic,6,Emergency,Home w/ Home Health Services,2017,233,Intracranial injury,009,OTHER OR THER NERV SYS,020,Craniotomy for trauma,01,Diseases and Disorders of the Nervous System,1,Minor,Moderate,Surgical,Medicare,Medicare,Self-Pay,,N,N,68478.01,33618.33
Long Island,Nassau,2950002,000528,Nassau University Medical Center,70 or Older,117,M,White,Not Span/Hispanic,5,Trauma,Home w/ Home Health Services,2017,233,Intracranial injury,009,OTHER OR THER NERV SYS,020,Craniotomy for trauma,01,Diseases and Disorders of the Nervous System,1,Minor,Moderate,Surgical,Medicare,Medicare,Self-Pay,,N,N,71504.20,33554.15
New York City,Kings,7001021,001306,New York - Presbyterian Brooklyn Methodist Hospital,70 or Older,112,M,White,Not Span/Hispanic,9,Emergency,Inpatient Rehabilitation Facility,2017,233,Intracranial injury,001,INCISION & EXCISION CNS,020,Craniotomy for trauma,01,Diseases and Disorders of the Nervous System,4,Extreme,Extreme,Surgical,Medicare,Blue Cross/Blue Shield,Self-Pay,,N,Y,114105.37,44501.33
New York City,Manhattan,7002032,001466,Mount Sinai West,50 to 69,100,M,Black/African American,Not Span/Hispanic,4,Emergency,Home or Self Care,2017,233,Intracranial injury,009,OTHER OR THER NERV SYS,020,Craniotomy for trauma,01,Diseases and Disorders of the Nervous System,1,Minor,Minor,Surgical,Private Health Insurance,Self-Pay,,,N,Y,68178.62,23350.10
Hudson Valley,Rockland,4329000,000779,Good Samaritan Hospital of Suffern,70 or Older,109,F,White,Not Span/Hispanic,7,Elective,Home w/ Home Health Services,2017,233,Intracranial injury,009,OTHER OR THER NERV SYS,020,Craniotomy for trauma,01,Diseases and Disorders of the Nervous System,3,Major,Moderate,Surgical,Medicare,Private Health Insurance,,,N,N,123547.44,32995.85
New York City,Manhattan,7002053,001463,NYU Langone Hospitals,70 or Older,100,F,White,Not Span/Hispanic,3,Urgent,Inpatient Rehabilitation Facility,2017,233,Intracranial injury,061,OT OR PRCS VES NOT HEAD,020,Craniotomy for trauma,01,Diseases and Disorders of the Nervous System,3,Major,Major,Surgical,Medicare,,,,N,N,166424.29,41191.69
Long Island,Suffolk,5123000,000885,Brookhaven Memorial Hospital Medical Center Inc,50 to 69,117,M,White,Not Span/Hispanic,16,Emergency,Home or Self Care,2017,233,Intracranial injury,222,BLOOD TRANSFUSION,020,Craniotomy for trauma,01,Diseases and Disorders of the Nervous System,1,Minor,Minor,Surgical,Private Health Insurance,,,,N,Y,204192.77,40972.32
Western NY,Erie,1401014,000207,Buffalo General Medical Center,50 to 69,147,F,White,Not Span/Hispanic,5,Emergency,Inpatient Rehabilitation Facility,2017,233,Intracranial injury,009,OTHER OR THER NERV SYS,020,Craniotomy for trauma,01,Diseases and Disorders of the Nervous System,2,Moderate,Moderate,Surgical,Medicare,Self-Pay,,,N,Y,66772.44,26398.49
Western NY,Erie,1401014,000207,Buffalo General Medical Center,70 or Older,147,F,White,Spanish/Hispanic,15,Emergency,Expired,2017,233,Intracranial injury,009,OTHER OR THER NERV SYS,020,Craniotomy for trauma,01,Diseases and Disorders of the Nervous System,4,Extreme,Extreme,Surgical,Medicare,Self-Pay,,,N,Y,154353.46,59991.84
Western NY,Erie,1401014,000207,Buffalo General Medical Center,70 or Older,142,F,White,Not Span/Hispanic,5,Emergency,Inpatient Rehabilitation Facility,2017,233,Intracranial injury,009,OTHER OR THER NERV SYS,020,Craniotomy for trauma,01,Diseases and Disorders of the Nervous System,1,Minor,Moderate,Surgical,Medicare,Self-Pay,,,N,Y,50770.54,20251.87
Western NY,Erie,1401014,000207,Buffalo General Medical Center,50 to 69,140,F,White,Not Span/Hispanic,7,Emergency,Skilled Nursing Home,2017,233,Intracranial injury,009,OTHER OR THER NERV SYS,020,Craniotomy for trauma,01,Diseases and Disorders of the Nervous System,3,Major,Major,Surgical,Federal/State/Local/VA,Medicare,Self-Pay,,N,Y,77243.08,28738.18
Western NY,Erie,1401014,000207,Buffalo General Medical Center,50 to 69,142,M,White,Not Span/Hispanic,4,Emergency,Hospice - Medical Facility,2017,233,Intracranial injury,001,INCISION & EXCISION CNS,020,Craniotomy for trauma,01,Diseases and Disorders of the Nervous System,3,Major,Minor,Surgical,Federal/State/Local/VA,Medicare,Self-Pay,,N,Y,64268.69,24098.55
Western NY,Erie,1401005,000210,Erie County Medical Center,50 to 69,142,M,Black/African American,Unknown,43,Emergency,Expired,2017,233,Intracranial injury,216,RESP INTUB/MECH VENTIL,020,Craniotomy for trauma,01,Diseases and Disorders of the Nervous System,4,Extreme,Extreme,Surgical,Self-Pay,Medicaid,,,N,Y,230281.47,142527.71
Western NY,Erie,1401005,000210,Erie County Medical Center,18 to 29,140,M,White,Not Span/Hispanic,10,Emergency,Home or Self Care,2017,233,Intracranial injury,009,OTHER OR THER NERV SYS,020,Craniotomy for trauma,01,Diseases and Disorders of the Nervous System,1,Minor,Minor,Surgical,Miscellaneous/Other,Self-Pay,,,N,Y,50591.20,23540.51
Western NY,Erie,1401005,000210,Erie County Medical Center,50 to 69,,M,Black/African American,Unknown,8,Emergency,Expired,2017,233,Intracranial injury,001,INCISION & EXCISION CNS,020,Craniotomy for trauma,01,Diseases and Disorders of the Nervous System,4,Extreme,Extreme,Surgical,Medicare,,,,N,Y,73476.80,35173.33
Hudson Valley,Westchester,5901000,001039,NewYork-Presbyterian/Hudson Valley Hospital,70 or Older,106,M,White,Not Span/Hispanic,8,Emergency,Skilled Nursing Home,2017,233,Intracranial injury,009,OTHER OR THER NERV SYS,020,Craniotomy for trauma,01,Diseases and Disorders of the Nervous System,1,Minor,Moderate,Surgical,Medicare,,,,N,Y,84071.34,37354.14
New York City,Kings,7001033,001315,Kingsbrook Jewish Medical Center,70 or Older,112,F,Black/African American,Not Span/Hispanic,13,Emergency,Skilled Nursing Home,2017,233,Intracranial injury,009,OTHER OR THER NERV SYS,020,Craniotomy for trauma,01,Diseases and Disorders of the Nervous System,1,Minor,Moderate,Surgical,Medicare,Medicare,Medicaid,,N,Y,100932.00,29947.64
New York City,Manhattan,7002032,001466,Mount Sinai West,70 or Older,111,M,White,Not Span/Hispanic,4,Elective,Home w/ Home Health Services,2017,233,Intracranial injury,009,OTHER OR THER NERV SYS,020,Craniotomy for trauma,01,Diseases and Disorders of the Nervous System,3,Major,Moderate,Surgical,Medicare,Medicare,Self-Pay,,N,N,71196.04,23166.33
New York City,Richmond,7004003,001740,Staten Island University Hosp-North,70 or Older,103,M,White,Not Span/Hispanic,15,Emergency,Inpatient Rehabilitation Facility,2017,233,Intracranial injury,009,OTHER OR THER NERV SYS,020,Craniotomy for trauma,01,Diseases and Disorders of the Nervous System,3,Major,Major,Surgical,Medicare,Medicare,,,N,Y,147876.45,35513.52
Capital/Adirond,Schenectady,4601001,000829,Ellis Hospital,50 to 69,123,M,White,Not Span/Hispanic,20,Emergency,Skilled Nursing Home,2017,233,Intracranial injury,001,INCISION & EXCISION CNS,020,Craniotomy for trauma,01,Diseases and Disorders of the Nervous System,3,Major,Moderate,Surgical,Medicaid,Medicaid,,,N,N,159172.85,59408.83
Hudson Valley,Orange,3523000,000699,Orange Regional Medical Center,50 to 69,127,F,White,Not Span/Hispanic,19,Emergency,Skilled Nursing Home,2017,233,Intracranial injury,001,INCISION & EXCISION CNS,020,Craniotomy for trauma,01,Diseases and Disorders of the Nervous System,3,Major,Moderate,Surgical,Blue Cross/Blue Shield,Medicare,,,N,Y,139557.09,47104.86
New York City,Bronx,7000006,001169,Montefiore Medical Center - Henry & Lucy Moses Div,70 or Older,104,M,Other Race,Not Span/Hispanic,15,Emergency,Hospice - Medical Facility,2017,233,Intracranial injury,001,INCISION & EXCISION CNS,020,Craniotomy for trauma,01,Diseases and Disorders of the Nervous System,4,Extreme,Extreme,Surgical,Medicare,Medicaid,Private Health Insurance,,N,Y,276870.38,61954.30
New York City,Kings,7002053,001304,NYU Langone Hospital-Brooklyn,70 or Older,112,F,White,Not Span/Hispanic,5,Emergency,Hospice - Medical Facility,2017,233,Intracranial injury,009,OTHER OR THER NERV SYS,020,Craniotomy for trauma,01,Diseases and Disorders of the Nervous System,4,Extreme,Extreme,Surgical,Medicare,,,,N,Y,199887.73,90280.73
New York City,Manhattan,7002053,001463,NYU Langone Hospitals,50 to 69,OOS,M,White,Not Span/Hispanic,2,Elective,Home w/ Home Health Services,2017,228,Skull and face fractures,161,OT OR THER PRCS ON BONE,020,Craniotomy for trauma,01,Diseases and Disorders of the Nervous System,3,Major,Minor,Surgical,Private Health Insurance,,,,N,N,353655.73,65513.36
New York City,Manhattan,7002053,001463,NYU Langone Hospitals,70 or Older,100,F,White,Not Span/Hispanic,9,Emergency,Inpatient Rehabilitation Facility,2017,233,Intracranial injury,009,OTHER OR THER NERV SYS,020,Craniotomy for trauma,01,Diseases and Disorders of the Nervous System,3,Major,Moderate,Surgical,Medicare,,,,N,Y,370453.04,75544.97
New York City,Manhattan,7002032,001466,Mount Sinai West,50 to 69,113,M,Other Race,Not Span/Hispanic,6,Urgent,Home w/ Home Health Services,2017,233,Intracranial injury,001,INCISION & EXCISION CNS,020,Craniotomy for trauma,01,Diseases and Disorders of the Nervous System,1,Minor,Moderate,Surgical,Medicaid,Self-Pay,,,N,N,96298.78,32132.91
Long Island,Suffolk,5154001,000925,Good Samaritan Hospital Medical Center,70 or Older,117,M,White,Not Span/Hispanic,13,Emergency,Skilled Nursing Home,2017,233,Intracranial injury,009,OTHER OR THER NERV SYS,020,Craniotomy for trauma,01,Diseases and Disorders of the Nervous System,3,Major,Major,Surgical,Medicare,Blue Cross/Blue Shield,,,N,Y,160871.92,32724.38
Long Island,Suffolk,5154001,000925,Good Samaritan Hospital Medical Center,70 or Older,117,M,Other Race,Spanish/Hispanic,56,Emergency,Inpatient Rehabilitation Facility,2017,233,Intracranial injury,009,OTHER OR THER NERV SYS,020,Craniotomy for trauma,01,Diseases and Disorders of the Nervous System,4,Extreme,Extreme,Surgical,Miscellaneous/Other,Medicare,Medicare,,N,Y,628122.17,147390.26
Long Island,Suffolk,5154001,000925,Good Samaritan Hospital Medical Center,70 or Older,117,M,White,Not Span/Hispanic,5,Emergency,Skilled Nursing Home,2017,233,Intracranial injury,001,INCISION & EXCISION CNS,020,Craniotomy for trauma,01,Diseases and Disorders of the Nervous System,1,Minor,Major,Surgical,Medicare,Medicare,,,N,Y,190428.09,35618.46
Long Island,Suffolk,5154001,000925,Good Samaritan Hospital Medical Center,50 to 69,117,F,White,Not Span/Hispanic,8,Emergency,Home w/ Home Health Services,2017,233,Intracranial injury,009,OTHER OR THER NERV SYS,020,Craniotomy for trauma,01,Diseases and Disorders of the Nervous System,3,Major,Moderate,Surgical,"Managed Care, Unspecified",,,,N,Y,195920.51,40880.58
Long Island,Suffolk,5154001,000925,Good Samaritan Hospital Medical Center,30 to 49,117,M,White,Spanish/Hispanic,12,Emergency,Home or Self Care,2017,233,Intracranial injury,144,"TRTMNT,FACE FRACT/DISLC",020,Craniotomy for trauma,01,Diseases and Disorders of the Nervous System,2,Moderate,Minor,Surgical,Miscellaneous/Other,,,,N,Y,136009.19,24979.39
Long Island,Suffolk,5154001,000925,Good Samaritan Hospital Medical Center,30 to 49,117,F,White,Not Span/Hispanic,6,Emergency,Home or Self Care,2017,233,Intracranial injury,009,OTHER OR THER NERV SYS,020,Craniotomy for trauma,01,Diseases and Disorders of the Nervous System,3,Major,Major,Surgical,Miscellaneous/Other,Blue Cross/Blue Shield,,,N,Y,213648.52,43943.53
New York City,Kings,7002053,001304,NYU Langone Hospital-Brooklyn,70 or Older,112,M,White,Not Span/Hispanic,7,Emergency,Expired,2017,233,Intracranial injury,009,OTHER OR THER NERV SYS,020,Craniotomy for trauma,01,Diseases and Disorders of the Nervous System,3,Major,Major,Surgical,Medicare,,,,N,Y,256811.49,112698.56
New York City,Kings,7001021,001306,New York - Presbyterian Brooklyn Methodist Hospital,70 or Older,112,M,White,Not Span/Hispanic,6,Emergency,Inpatient Rehabilitation Facility,2017,233,Intracranial injury,009,OTHER OR THER NERV SYS,020,Craniotomy for trauma,01,Diseases and Disorders of the Nervous System,1,Minor,Major,Surgical,Medicare,Private Health Insurance,Self-Pay,,N,Y,60050.94,26648.80
New York City,Manhattan,7002054,001437,New York-Presbyterian/Lower Manhattan Hospital,70 or Older,100,F,Other Race,Not Span/Hispanic,3,Emergency,Expired,2017,233,Intracranial injury,009,OTHER OR THER NERV SYS,020,Craniotomy for trauma,01,Diseases and Disorders of the Nervous System,4,Extreme,Extreme,Surgical,Medicare,Medicare,Medicaid,,N,Y,108619.98,42921.63
New York City,Manhattan,7002054,001458,New York Presbyterian Hospital - New York Weill Cornell Center,50 to 69,112,M,White,Not Span/Hispanic,13,Emergency,Skilled Nursing Home,2017,233,Intracranial injury,009,OTHER OR THER NERV SYS,020,Craniotomy for trauma,01,Diseases and Disorders of the Nervous System,2,Moderate,Moderate,Surgical,Medicare,Private Health Insurance,Self-Pay,,N,N,306008.75,173513.14
New York City,Manhattan,7002053,001463,NYU Langone Hospitals,70 or Older,100,M,Other Race,Spanish/Hispanic,3,Emergency,Inpatient Rehabilitation Facility,2017,233,Intracranial injury,009,OTHER OR THER NERV SYS,020,Craniotomy for trauma,01,Diseases and Disorders of the Nervous System,2,Moderate,Moderate,Surgical,Medicare,,,,N,Y,113211.39,30017.61
New York City,Manhattan,7002054,001464,New York Presbyterian Hospital - Columbia Presbyterian Center,70 or Older,100,M,Black/African American,Not Span/Hispanic,12,Emergency,Inpatient Rehabilitation Facility,2017,233,Intracranial injury,001,INCISION & EXCISION CNS,020,Craniotomy for trauma,01,Diseases and Disorders of the Nervous System,3,Major,Major,Surgical,Medicare,Medicare,Self-Pay,,N,Y,174411.03,73136.60
New York City,Manhattan,7002054,001464,New York Presbyterian Hospital - Columbia Presbyterian Center,0 to 17,104,F,White,Not Span/Hispanic,2,Emergency,Home or Self Care,2017,233,Intracranial injury,001,INCISION & EXCISION CNS,020,Craniotomy for trauma,01,Diseases and Disorders of the Nervous System,1,Minor,Minor,Surgical,Private Health Insurance,Self-Pay,,,N,Y,63982.09,25421.62
New York City,Queens,7003000,001626,Elmhurst Hospital Center,50 to 69,113,M,Other Race,Spanish/Hispanic,27,Emergency,Inpatient Rehabilitation Facility,2017,233,Intracranial injury,216,RESP INTUB/MECH VENTIL,020,Craniotomy for trauma,01,Diseases and Disorders of the Nervous System,3,Major,Major,Surgical,Medicaid,,,,N,Y,171421.58,85915.12
New York City,Queens,7003010,001637,New York - Presbyterian/Queens,50 to 69,113,F,Other Race,Not Span/Hispanic,6,Emergency,Expired,2017,233,Intracranial injury,009,OTHER OR THER NERV SYS,020,Craniotomy for trauma,01,Diseases and Disorders of the Nervous System,3,Major,Major,Surgical,Medicare,Blue Cross/Blue Shield,Self-Pay,,N,Y,91602.63,29853.47
New York City,Queens,7003010,001637,New York - Presbyterian/Queens,50 to 69,113,M,Other Race,Not Span/Hispanic,2,Emergency,Expired,2017,233,Intracranial injury,001,INCISION & EXCISION CNS,020,Craniotomy for trauma,01,Diseases and Disorders of the Nervous System,3,Major,Extreme,Surgical,Private Health Insurance,Medicaid,Self-Pay,,N,Y,45606.09,11984.37
New York City,Queens,7003010,001637,New York - Presbyterian/Queens,70 or Older,113,M,Other Race,Not Span/Hispanic,5,Emergency,Home w/ Home Health Services,2017,233,Intracranial injury,009,OTHER OR THER NERV SYS,020,Craniotomy for trauma,01,Diseases and Disorders of the Nervous System,1,Minor,Moderate,Surgical,Medicare,Medicaid,Self-Pay,,N,Y,38645.53,10402.01
New York City,Queens,7003010,001637,New York - Presbyterian/Queens,70 or Older,113,M,White,Not Span/Hispanic,8,Emergency,Home w/ Home Health Services,2017,233,Intracranial injury,001,INCISION & EXCISION CNS,020,Craniotomy for trauma,01,Diseases and Disorders of the Nervous System,1,Minor,Minor,Surgical,Medicare,Blue Cross/Blue Shield,Self-Pay,,N,Y,71662.26,23517.65
New York City,Queens,7003010,001637,New York - Presbyterian/Queens,70 or Older,113,M,Other Race,Not Span/Hispanic,7,Emergency,Home or Self Care,2017,233,Intracranial injury,001,INCISION & EXCISION CNS,020,Craniotomy for trauma,01,Diseases and Disorders of the Nervous System,2,Moderate,Moderate,Surgical,Self-Pay,,,,N,Y,59949.85,21671.84
New York City,Queens,7003010,001637,New York - Presbyterian/Queens,50 to 69,113,M,Other Race,Not Span/Hispanic,3,Emergency,Home w/ Home Health Services,2017,233,Intracranial injury,001,INCISION & EXCISION CNS,020,Craniotomy for trauma,01,Diseases and Disorders of the Nervous System,1,Minor,Moderate,Surgical,Medicaid,Self-Pay,,,N,Y,34639.60,11884.82
Long Island,Nassau,2950002,000528,Nassau University Medical Center,70 or Older,115,M,White,Not Span/Hispanic,5,Emergency,Hospice - Medical Facility,2017,233,Intracranial injury,009,OTHER OR THER NERV SYS,020,Craniotomy for trauma,01,Diseases and Disorders of the Nervous System,3,Major,Extreme,Surgical,Medicare,Private Health Insurance,Self-Pay,,N,N,87173.88,44243.14
Western NY,Erie,1401008,000213,Mercy Hospital of Buffalo,70 or Older,140,F,White,Not Span/Hispanic,21,Emergency,Expired,2017,233,Intracranial injury,009,OTHER OR THER NERV SYS,020,Craniotomy for trauma,01,Diseases and Disorders of the Nervous System,4,Extreme,Extreme,Surgical,Medicare,Medicare,Private Health Insurance,,N,Y,263220.57,82477.14
Western NY,Erie,1401008,000213,Mercy Hospital of Buffalo,70 or Older,141,M,White,Not Span/Hispanic,10,Emergency,Skilled Nursing Home,2017,233,Intracranial injury,009,OTHER OR THER NERV SYS,020,Craniotomy for trauma,01,Diseases and Disorders of the Nervous System,3,Major,Major,Surgical,Medicare,Medicare,Blue Cross/Blue Shield,,N,Y,52316.07,19633.85
Western NY,Erie,1404000,000267,Kenmore Mercy Hospital,70 or Older,142,M,White,Not Span/Hispanic,7,Elective,Skilled Nursing Home,2017,233,Intracranial injury,001,INCISION & EXCISION CNS,020,Craniotomy for trauma,01,Diseases and Disorders of the Nervous System,1,Minor,Moderate,Surgical,Medicare,Medicare,Blue Cross/Blue Shield,,N,N,33854.93,12156.86
Western NY,Erie,1404000,000267,Kenmore Mercy Hospital,70 or Older,142,F,White,Not Span/Hispanic,8,Emergency,Hospice - Medical Facility,2017,233,Intracranial injury,009,OTHER OR THER NERV SYS,020,Craniotomy for trauma,01,Diseases and Disorders of the Nervous System,4,Extreme,Major,Surgical,Medicare,Medicare,,,N,Y,45912.45,15971.36
Central NY,Onondaga,3301008,000636,Crouse Hospital,70 or Older,136,M,White,Not Span/Hispanic,6,Urgent,Home or Self Care,2017,233,Intracranial injury,009,OTHER OR THER NERV SYS,020,Craniotomy for trauma,01,Diseases and Disorders of the Nervous System,2,Moderate,Major,Surgical,Medicare,Medicare,Blue Cross/Blue Shield,,N,N,34269.12,13825.02
New York City,Bronx,7000008,001172,Lincoln Medical & Mental Health Center,30 to 49,104,M,Black/African American,Not Span/Hispanic,9,Emergency,Home or Self Care,2017,233,Intracranial injury,009,OTHER OR THER NERV SYS,020,Craniotomy for trauma,01,Diseases and Disorders of the Nervous System,1,Minor,Minor,Surgical,Medicaid,Medicaid,,,N,Y,45228.18,23502.01
New York City,Bronx,7000008,001172,Lincoln Medical & Mental Health Center,50 to 69,104,M,Other Race,Spanish/Hispanic,2,Emergency,Home or Self Care,2017,233,Intracranial injury,009,OTHER OR THER NERV SYS,020,Craniotomy for trauma,01,Diseases and Disorders of the Nervous System,1,Minor,Minor,Surgical,Medicaid,Medicaid,,,N,Y,15304.52,7952.72
New York City,Bronx,7000008,001172,Lincoln Medical & Mental Health Center,18 to 29,104,M,Other Race,Spanish/Hispanic,2,Emergency,Home or Self Care,2017,228,Skull and face fractures,144,"TRTMNT,FACE FRACT/DISLC",020,Craniotomy for trauma,01,Diseases and Disorders of the Nervous System,1,Minor,Minor,Surgical,Medicaid,,,,N,Y,23709.38,12320.15
New York City,Kings,7001016,001301,Kings County Hospital Center,0 to 17,112,M,Other Race,Spanish/Hispanic,3,Emergency,Home or Self Care,2017,233,Intracranial injury,001,INCISION & EXCISION CNS,020,Craniotomy for trauma,01,Diseases and Disorders of the Nervous System,1,Minor,Minor,Surgical,Medicaid,Medicaid,,,N,Y,36551.80,21970.45
New York City,Kings,7001016,001301,Kings County Hospital Center,18 to 29,112,M,Black/African American,Not Span/Hispanic,2,Emergency,Home or Self Care,2017,228,Skull and face fractures,144,"TRTMNT,FACE FRACT/DISLC",020,Craniotomy for trauma,01,Diseases and Disorders of the Nervous System,1,Minor,Minor,Surgical,Miscellaneous/Other,Medicaid,,,N,Y,30643.87,18419.33