Hospital Service Area,Hospital County,Operating Certificate Number,Permanent Facility Id,Facility Name,Age Group,Zip Code - 3 digits,Gender,Race,Ethnicity,Length of Stay,Type of Admission,Patient Disposition,Discharge Year,CCS Diagnosis Code,CCS Diagnosis Description,CCS Procedure Code,CCS Procedure Description,APR DRG Code,APR DRG Description,APR MDC Code,APR MDC Description,APR Severity of Illness Code,APR Severity of Illness Description,APR Risk of Mortality,APR Medical Surgical Description,Payment Typology 1,Payment Typology 2,Payment Typology 3,Birth Weight,Abortion Edit Indicator,Emergency Department Indicator,Total Charges,Total Costs
Long Island,Suffolk,5151001,000245,Stony Brook University Hospital,70 or Older,117,M,Other Race,Not Span/Hispanic,44,Emergency,Inpatient Rehabilitation Facility,2019,INJ008,"TRAUMATIC BRAIN INJURY (TBI); CONCUSSION, INITIAL ENCOUNTER",CNS004,INTRACRANIAL EPIDURAL AND SUBDURAL SPACE DRAINAGE,020,CRANIOTOMY FOR TRAUMA,01,DISEASES AND DISORDERS OF THE NERVOUS SYSTEM,4,Extreme,Major,Surgical,Medicaid,,,,,true,640780.3,204621.29
New York City,Manhattan,7002017,001450,Lenox Hill Hospital,70 or Older,100,F,Black/African American,Not Span/Hispanic,6,Emergency,Home w/ Home Health Services,2019,INJ008,"TRAUMATIC BRAIN INJURY (TBI); CONCUSSION, INITIAL ENCOUNTER",CNS004,INTRACRANIAL EPIDURAL AND SUBDURAL SPACE DRAINAGE,020,CRANIOTOMY FOR TRAUMA,01,DISEASES AND DISORDERS OF THE NERVOUS SYSTEM,1,Minor,Moderate,Surgical,Medicare,Blue Cross/Blue Shield,,,,true,134145.48,42580.98
Long Island,Suffolk,5154001,000925,Good Samaritan Hospital Medical Center,70 or Older,117,M,White,Not Span/Hispanic,9,Emergency,Skilled Nursing Home,2019,INJ008,"TRAUMATIC BRAIN INJURY (TBI); CONCUSSION, INITIAL ENCOUNTER",CNS004,INTRACRANIAL EPIDURAL AND SUBDURAL SPACE DRAINAGE,020,CRANIOTOMY FOR TRAUMA,01,DISEASES AND DISORDERS OF THE NERVOUS SYSTEM,3,Major,Major,Surgical,Medicare,Medicare,,,,true,145317.05,32993.42
New York City,Kings,7001021,001306,New York - Presbyterian Brooklyn Methodist Hospital,70 or Older,112,M,Other Race,Not Span/Hispanic,9,Emergency,Inpatient Rehabilitation Facility,2019,INJ008,"TRAUMATIC BRAIN INJURY (TBI); CONCUSSION, INITIAL ENCOUNTER",CNS004,INTRACRANIAL EPIDURAL AND SUBDURAL SPACE DRAINAGE,020,CRANIOTOMY FOR TRAUMA,01,DISEASES AND DISORDERS OF THE NERVOUS SYSTEM,4,Extreme,Extreme,Surgical,Medicare,Medicare,Medicaid,,,true,176334.57,58011.57
Hudson Valley,Dutchess,1302001,000181,Vassar Brothers Medical Center,70 or Older,124,M,White,Not Span/Hispanic,5,Emergency,Home or Self Care,2019,INJ008,"TRAUMATIC BRAIN INJURY (TBI); CONCUSSION, INITIAL ENCOUNTER",CNS006,OTHER CNS DRAINAGE AND RELATED PROCEDURES,020,CRANIOTOMY FOR TRAUMA,01,DISEASES AND DISORDERS OF THE NERVOUS SYSTEM,2,Moderate,Moderate,Surgical,Private Health Insurance,,,,,true,59903.15,26643.6
New York City,Kings,7001002,001286,Brookdale Hospital Medical Center,30 to 49,112,M,Black/African American,Not Span/Hispanic,8,Emergency,Expired,2019,INJ008,"TRAUMATIC BRAIN INJURY (TBI); CONCUSSION, INITIAL ENCOUNTER",CNS005,VENTRICULOSTOMY [PERCUTANEOUS APPROACH],020,CRANIOTOMY FOR TRAUMA,01,DISEASES AND DISORDERS OF THE NERVOUS SYSTEM,4,Extreme,Extreme,Surgical,Medicaid,,,,,true,78719.56,37884.71
New York City,Kings,7001002,001286,Brookdale Hospital Medical Center,50 to 69,112,F,Black/African American,Not Span/Hispanic,4,Emergency,Home or Self Care,2019,INJ008,"TRAUMATIC BRAIN INJURY (TBI); CONCUSSION, INITIAL ENCOUNTER",CNS006,OTHER CNS DRAINAGE AND RELATED PROCEDURES,020,CRANIOTOMY FOR TRAUMA,01,DISEASES AND DISORDERS OF THE NERVOUS SYSTEM,2,Moderate,Major,Surgical,Self-Pay,,,,,true,37771.33,23859.09
New York City,Kings,7002053,001304,NYU Langone Hospital-Brooklyn,50 to 69,112,M,Other Race,Not Span/Hispanic,3,Emergency,Home or Self Care,2019,INJ008,"TRAUMATIC BRAIN INJURY (TBI); CONCUSSION, INITIAL ENCOUNTER",CNS004,INTRACRANIAL EPIDURAL AND SUBDURAL SPACE DRAINAGE,020,CRANIOTOMY FOR TRAUMA,01,DISEASES AND DISORDERS OF THE NERVOUS SYSTEM,1,Minor,Minor,Surgical,Private Health Insurance,,,,,true,108989.97,27772.12
Hudson Valley,Westchester,5957001,001139,Westchester Medical Center,70 or Older,107,M,White,Not Span/Hispanic,22,Urgent,Home w/ Home Health Services,2019,INJ008,"TRAUMATIC BRAIN INJURY (TBI); CONCUSSION, INITIAL ENCOUNTER",CNS004,INTRACRANIAL EPIDURAL AND SUBDURAL SPACE DRAINAGE,020,CRANIOTOMY FOR TRAUMA,01,DISEASES AND DISORDERS OF THE NERVOUS SYSTEM,3,Major,Moderate,Surgical,Blue Cross/Blue Shield,Medicare,,,,false,481916.85,89658.27
New York City,Manhattan,7002054,001464,New York-Presbyterian Hospital - Columbia Presbyterian Center,70 or Older,100,M,Other Race,Spanish/Hispanic,7,Emergency,Home w/ Home Health Services,2019,INJ008,"TRAUMATIC BRAIN INJURY (TBI); CONCUSSION, INITIAL ENCOUNTER",CNS004,INTRACRANIAL EPIDURAL AND SUBDURAL SPACE DRAINAGE,020,CRANIOTOMY FOR TRAUMA,01,DISEASES AND DISORDERS OF THE NERVOUS SYSTEM,3,Major,Major,Surgical,Medicare,Medicare,Medicaid,,,true,186534.91,74003.24
Long Island,Nassau,2953000,000563,St. Francis Hospital & Heart Center,70 or Older,115,F,White,Not Span/Hispanic,17,Emergency,Skilled Nursing Home,2019,INJ008,"TRAUMATIC BRAIN INJURY (TBI); CONCUSSION, INITIAL ENCOUNTER",CNS004,INTRACRANIAL EPIDURAL AND SUBDURAL SPACE DRAINAGE,020,CRANIOTOMY FOR TRAUMA,01,DISEASES AND DISORDERS OF THE NERVOUS SYSTEM,4,Extreme,Major,Surgical,Medicare,Private Health Insurance,,,,true,251943.97,50558.8
New York City,Manhattan,7002032,001469,Mount Sinai Morningside,30 to 49,100,F,Other Race,Spanish/Hispanic,17,Emergency,Skilled Nursing Home,2019,INJ008,"TRAUMATIC BRAIN INJURY (TBI); CONCUSSION, INITIAL ENCOUNTER",CNS004,INTRACRANIAL EPIDURAL AND SUBDURAL SPACE DRAINAGE,020,CRANIOTOMY FOR TRAUMA,01,DISEASES AND DISORDERS OF THE NERVOUS SYSTEM,3,Major,Major,Surgical,Medicaid,Medicaid,Self-Pay,,,true,308333.56,88534.57
New York City,Manhattan,7002001,001438,Bellevue Hospital Center,70 or Older,100,M,White,Not Span/Hispanic,11,Emergency,Inpatient Rehabilitation Facility,2019,INJ008,"TRAUMATIC BRAIN INJURY (TBI); CONCUSSION, INITIAL ENCOUNTER",CNS004,INTRACRANIAL EPIDURAL AND SUBDURAL SPACE DRAINAGE,020,CRANIOTOMY FOR TRAUMA,01,DISEASES AND DISORDERS OF THE NERVOUS SYSTEM,2,Moderate,Moderate,Surgical,Medicare,Medicare,,,,true,82613.27,54904.78
New York City,Richmond,7004003,001740,Staten Island University Hosp-North,70 or Older,112,F,White,Not Span/Hispanic,5,Emergency,Inpatient Rehabilitation Facility,2019,INJ008,"TRAUMATIC BRAIN INJURY (TBI); CONCUSSION, INITIAL ENCOUNTER",CNS004,INTRACRANIAL EPIDURAL AND SUBDURAL SPACE DRAINAGE,020,CRANIOTOMY FOR TRAUMA,01,DISEASES AND DISORDERS OF THE NERVOUS SYSTEM,1,Minor,Major,Surgical,Medicare,Blue Cross/Blue Shield,,,,true,48119.17,14277.5
Capital/Adirond,Albany,0101004,000005,St. Peter's Hospital,70 or Older,121,M,Black/African American,Not Span/Hispanic,6,Elective,Short-term Hospital,2019,INJ008,"TRAUMATIC BRAIN INJURY (TBI); CONCUSSION, INITIAL ENCOUNTER",CNS004,INTRACRANIAL EPIDURAL AND SUBDURAL SPACE DRAINAGE,020,CRANIOTOMY FOR TRAUMA,01,DISEASES AND DISORDERS OF THE NERVOUS SYSTEM,3,Major,Major,Surgical,Medicare,Private Health Insurance,,,,false,56338.9,21440.66
Hudson Valley,Westchester,5957001,001139,Westchester Medical Center,70 or Older,OOS,F,Other Race,Unknown,8,Emergency,Inpatient Rehabilitation Facility,2019,INJ008,"TRAUMATIC BRAIN INJURY (TBI); CONCUSSION, INITIAL ENCOUNTER",CNS007,CNS EXCISION PROCEDURES,020,CRANIOTOMY FOR TRAUMA,01,DISEASES AND DISORDERS OF THE NERVOUS SYSTEM,2,Moderate,Major,Surgical,Medicare,Blue Cross/Blue Shield,,,,true,291086.4,49664.9
Southern Tier,Broome,0303001,000058,United Health Services Hospitals Inc. - Wilson Medical Center,70 or Older,137,M,White,Not Span/Hispanic,12,Emergency,Inpatient Rehabilitation Facility,2019,INJ008,"TRAUMATIC BRAIN INJURY (TBI); CONCUSSION, INITIAL ENCOUNTER",CNS004,INTRACRANIAL EPIDURAL AND SUBDURAL SPACE DRAINAGE,020,CRANIOTOMY FOR TRAUMA,01,DISEASES AND DISORDERS OF THE NERVOUS SYSTEM,2,Moderate,Moderate,Surgical,Medicare,Medicare,Private Health Insurance,,,true,85114.7,36433.19
New York City,Kings,7001020,001305,Maimonides Medical Center,30 to 49,112,F,White,Not Span/Hispanic,5,Emergency,Skilled Nursing Home,2019,INJ008,"TRAUMATIC BRAIN INJURY (TBI); CONCUSSION, INITIAL ENCOUNTER",CNS004,INTRACRANIAL EPIDURAL AND SUBDURAL SPACE DRAINAGE,020,CRANIOTOMY FOR TRAUMA,01,DISEASES AND DISORDERS OF THE NERVOUS SYSTEM,1,Minor,Minor,Surgical,Medicare,Medicaid,Self-Pay,,,true,75950.07,17579.21
New York City,Manhattan,7002054,001437,New York-Presbyterian/Lower Manhattan Hospital,18 to 29,100,M,Other Race,Spanish/Hispanic,17,Emergency,Home or Self Care,2019,INJ008,"TRAUMATIC BRAIN INJURY (TBI); CONCUSSION, INITIAL ENCOUNTER",CNS004,INTRACRANIAL EPIDURAL AND SUBDURAL SPACE DRAINAGE,020,CRANIOTOMY FOR TRAUMA,01,DISEASES AND DISORDERS OF THE NERVOUS SYSTEM,4,Extreme,Extreme,Surgical,Medicaid,Self-Pay,,,,true,422677.13,188957.47
Western NY,Erie,1401005,000210,Erie County Medical Center,50 to 69,142,F,Black/African American,Not Span/Hispanic,16,Emergency,Inpatient Rehabilitation Facility,2019,INJ008,"TRAUMATIC BRAIN INJURY (TBI); CONCUSSION, INITIAL ENCOUNTER",CNS004,INTRACRANIAL EPIDURAL AND SUBDURAL SPACE DRAINAGE,020,CRANIOTOMY FOR TRAUMA,01,DISEASES AND DISORDERS OF THE NERVOUS SYSTEM,3,Major,Major,Surgical,Medicare,Medicaid,Medicare,,,true,76939.18,44216.04
Finger Lakes,Monroe,2701003,000411,Rochester General Hospital,70 or Older,146,F,White,Not Span/Hispanic,8,Emergency,Skilled Nursing Home,2019,INJ008,"TRAUMATIC BRAIN INJURY (TBI); CONCUSSION, INITIAL ENCOUNTER",CNS004,INTRACRANIAL EPIDURAL AND SUBDURAL SPACE DRAINAGE,020,CRANIOTOMY FOR TRAUMA,01,DISEASES AND DISORDERS OF THE NERVOUS SYSTEM,3,Major,Major,Surgical,Medicare,,,,,true,36947.17,15558.93
Southern Tier,Broome,0303001,000058,United Health Services Hospitals Inc. - Wilson Medical Center,50 to 69,139,F,White,Not Span/Hispanic,10,Emergency,Skilled Nursing Home,2019,INJ008,"TRAUMATIC BRAIN INJURY (TBI); CONCUSSION, INITIAL ENCOUNTER",CNS004,INTRACRANIAL EPIDURAL AND SUBDURAL SPACE DRAINAGE,020,CRANIOTOMY FOR TRAUMA,01,DISEASES AND DISORDERS OF THE NERVOUS SYSTEM,2,Moderate,Minor,Surgical,Medicare,Medicare,,,,true,143036.6,48822.69
Capital/Adirond,Albany,0101000,000001,Albany Medical Center Hospital,50 to 69,120,M,White,Not Span/Hispanic,23,Emergency,Skilled Nursing Home,2019,INJ008,"TRAUMATIC BRAIN INJURY (TBI); CONCUSSION, INITIAL ENCOUNTER",CNS004,INTRACRANIAL EPIDURAL AND SUBDURAL SPACE DRAINAGE,020,CRANIOTOMY FOR TRAUMA,01,DISEASES AND DISORDERS OF THE NERVOUS SYSTEM,3,Major,Major,Surgical,Medicare,Medicaid,,,,true,186172.06,59127.49
Capital/Adirond,Albany,0101004,000005,St. Peter's Hospital,70 or Older,121,F,White,Not Span/Hispanic,11,Elective,Short-term Hospital,2019,INJ008,"TRAUMATIC BRAIN INJURY (TBI); CONCUSSION, INITIAL ENCOUNTER",CNS004,INTRACRANIAL EPIDURAL AND SUBDURAL SPACE DRAINAGE,020,CRANIOTOMY FOR TRAUMA,01,DISEASES AND DISORDERS OF THE NERVOUS SYSTEM,3,Major,Major,Surgical,Medicare,Private Health Insurance,,,,false,84510.5,34348.75
Capital/Adirond,Albany,0101004,000005,St. Peter's Hospital,70 or Older,122,F,Other Race,Not Span/Hispanic,5,Elective,Skilled Nursing Home,2019,INJ008,"TRAUMATIC BRAIN INJURY (TBI); CONCUSSION, INITIAL ENCOUNTER",CNS004,INTRACRANIAL EPIDURAL AND SUBDURAL SPACE DRAINAGE,020,CRANIOTOMY FOR TRAUMA,01,DISEASES AND DISORDERS OF THE NERVOUS SYSTEM,3,Major,Major,Surgical,Medicare,Blue Cross/Blue Shield,,,,false,60968,19872.03
Hudson Valley,Orange,3522000,000694,St Luke's Cornwall Hospital/Newburgh,50 to 69,109,M,White,Not Span/Hispanic,5,Emergency,Inpatient Rehabilitation Facility,2019,INJ008,"TRAUMATIC BRAIN INJURY (TBI); CONCUSSION, INITIAL ENCOUNTER",CNS004,INTRACRANIAL EPIDURAL AND SUBDURAL SPACE DRAINAGE,020,CRANIOTOMY FOR TRAUMA,01,DISEASES AND DISORDERS OF THE NERVOUS SYSTEM,4,Extreme,Extreme,Surgical,Federal/State/Local/VA,Medicare,Private Health Insurance,,,true,74132.49,20882.89
New York City,Manhattan,7002032,001469,Mount Sinai Morningside,50 to 69,100,M,Black/African American,Not Span/Hispanic,17,Emergency,Skilled Nursing Home,2019,INJ008,"TRAUMATIC BRAIN INJURY (TBI); CONCUSSION, INITIAL ENCOUNTER",CNS004,INTRACRANIAL EPIDURAL AND SUBDURAL SPACE DRAINAGE,020,CRANIOTOMY FOR TRAUMA,01,DISEASES AND DISORDERS OF THE NERVOUS SYSTEM,4,Extreme,Extreme,Surgical,Medicare,Blue Cross/Blue Shield,Self-Pay,,,true,261431.31,70500.51
Long Island,Nassau,2950001,000527,Mount Sinai South Nassau,70 or Older,115,M,Other Race,Not Span/Hispanic,13,Emergency,Skilled Nursing Home,2019,INJ008,"TRAUMATIC BRAIN INJURY (TBI); CONCUSSION, INITIAL ENCOUNTER",CNS004,INTRACRANIAL EPIDURAL AND SUBDURAL SPACE DRAINAGE,020,CRANIOTOMY FOR TRAUMA,01,DISEASES AND DISORDERS OF THE NERVOUS SYSTEM,3,Major,Major,Surgical,Medicare,Medicare,,,,true,160130.64,33330.37
Capital/Adirond,Albany,0101000,000001,Albany Medical Center Hospital,50 to 69,122,M,Black/African American,Not Span/Hispanic,25,Trauma,Skilled Nursing Home,2019,INJ008,"TRAUMATIC BRAIN INJURY (TBI); CONCUSSION, INITIAL ENCOUNTER",CNS005,VENTRICULOSTOMY [PERCUTANEOUS APPROACH],020,CRANIOTOMY FOR TRAUMA,01,DISEASES AND DISORDERS OF THE NERVOUS SYSTEM,4,Extreme,Major,Surgical,"Managed Care, Unspecified",,,,,true,273236.52,86210.87
Capital/Adirond,Albany,0101000,000001,Albany Medical Center Hospital,50 to 69,123,M,White,Not Span/Hispanic,5,Emergency,Inpatient Rehabilitation Facility,2019,INJ008,"TRAUMATIC BRAIN INJURY (TBI); CONCUSSION, INITIAL ENCOUNTER",CNS004,INTRACRANIAL EPIDURAL AND SUBDURAL SPACE DRAINAGE,020,CRANIOTOMY FOR TRAUMA,01,DISEASES AND DISORDERS OF THE NERVOUS SYSTEM,1,Minor,Moderate,Surgical,Medicare,,,,,true,50968,19941.47
Southern Tier,Broome,0303001,000058,United Health Services Hospitals Inc. - Wilson Medical Center,50 to 69,137,M,White,Not Span/Hispanic,15,Emergency,Home or Self Care,2019,INJ008,"TRAUMATIC BRAIN INJURY (TBI); CONCUSSION, INITIAL ENCOUNTER",CNS004,INTRACRANIAL EPIDURAL AND SUBDURAL SPACE DRAINAGE,020,CRANIOTOMY FOR TRAUMA,01,DISEASES AND DISORDERS OF THE NERVOUS SYSTEM,4,Extreme,Major,Surgical,Private Health Insurance,,,,,true,111880.5,48277.94
Capital/Adirond,Albany,0101000,000001,Albany Medical Center Hospital,70 or Older,137,M,White,Not Span/Hispanic,3,Emergency,Home or Self Care,2019,INJ008,"TRAUMATIC BRAIN INJURY (TBI); CONCUSSION, INITIAL ENCOUNTER",CNS004,INTRACRANIAL EPIDURAL AND SUBDURAL SPACE DRAINAGE,020,CRANIOTOMY FOR TRAUMA,01,DISEASES AND DISORDERS OF THE NERVOUS SYSTEM,1,Minor,Minor,Surgical,Medicare,,,,,true,23683.86,7920.01
Long Island,Nassau,2950001,000527,Mount Sinai South Nassau,70 or Older,117,F,Other Race,Not Span/Hispanic,5,Emergency,Skilled Nursing Home,2019,INJ008,"TRAUMATIC BRAIN INJURY (TBI); CONCUSSION, INITIAL ENCOUNTER",CNS004,INTRACRANIAL EPIDURAL AND SUBDURAL SPACE DRAINAGE,020,CRANIOTOMY FOR TRAUMA,01,DISEASES AND DISORDERS OF THE NERVOUS SYSTEM,3,Major,Major,Surgical,Medicare,Medicare,,,,true,164553.49,28239.44
New York City,Kings,7001021,001306,New York - Presbyterian Brooklyn Methodist Hospital,50 to 69,104,M,Black/African American,Not Span/Hispanic,24,Emergency,Inpatient Rehabilitation Facility,2019,INJ008,"TRAUMATIC BRAIN INJURY (TBI); CONCUSSION, INITIAL ENCOUNTER",CNS004,INTRACRANIAL EPIDURAL AND SUBDURAL SPACE DRAINAGE,020,CRANIOTOMY FOR TRAUMA,01,DISEASES AND DISORDERS OF THE NERVOUS SYSTEM,4,Extreme,Major,Surgical,"Managed Care, Unspecified",Medicaid,Self-Pay,,,true,334616.99,112170.22
New York City,Manhattan,7002054,001458,New York-Presbyterian Hospital - New York Weill Cornell Center,50 to 69,100,M,White,Multi-ethnic,5,Emergency,Home or Self Care,2019,INJ008,"TRAUMATIC BRAIN INJURY (TBI); CONCUSSION, INITIAL ENCOUNTER",CNS006,OTHER CNS DRAINAGE AND RELATED PROCEDURES,020,CRANIOTOMY FOR TRAUMA,01,DISEASES AND DISORDERS OF THE NERVOUS SYSTEM,1,Minor,Moderate,Surgical,Medicare,Private Health Insurance,Self-Pay,,,true,153040.58,66603.61
Hudson Valley,Rockland,4324000,000776,Montefiore Nyack,70 or Older,109,F,White,Not Span/Hispanic,12,Emergency,Inpatient Rehabilitation Facility,2019,INJ008,"TRAUMATIC BRAIN INJURY (TBI); CONCUSSION, INITIAL ENCOUNTER",CNS004,INTRACRANIAL EPIDURAL AND SUBDURAL SPACE DRAINAGE,020,CRANIOTOMY FOR TRAUMA,01,DISEASES AND DISORDERS OF THE NERVOUS SYSTEM,1,Minor,Moderate,Surgical,Medicare,Medicaid,,,,false,144089.48,28171.1
Finger Lakes,Monroe,2754001,000471,The Unity Hospital of Rochester,50 to 69,146,M,White,Not Span/Hispanic,2,Emergency,Home or Self Care,2019,INJ008,"TRAUMATIC BRAIN INJURY (TBI); CONCUSSION, INITIAL ENCOUNTER",CNS006,OTHER CNS DRAINAGE AND RELATED PROCEDURES,020,CRANIOTOMY FOR TRAUMA,01,DISEASES AND DISORDERS OF THE NERVOUS SYSTEM,1,Minor,Minor,Surgical,Self-Pay,,,,,false,12945.73,8728.09
Long Island,Suffolk,5154001,000925,Good Samaritan Hospital Medical Center,30 to 49,117,M,Black/African American,Not Span/Hispanic,3,Emergency,Expired,2019,INJ008,"TRAUMATIC BRAIN INJURY (TBI); CONCUSSION, INITIAL ENCOUNTER",CNS004,INTRACRANIAL EPIDURAL AND SUBDURAL SPACE DRAINAGE,020,CRANIOTOMY FOR TRAUMA,01,DISEASES AND DISORDERS OF THE NERVOUS SYSTEM,4,Extreme,Extreme,Surgical,Self-Pay,,,,,true,163531.21,32916.44
New York City,Manhattan,7002032,001469,Mount Sinai Morningside,70 or Older,111,F,White,Not Span/Hispanic,9,Emergency,Inpatient Rehabilitation Facility,2019,INJ008,"TRAUMATIC BRAIN INJURY (TBI); CONCUSSION, INITIAL ENCOUNTER",CNS004,INTRACRANIAL EPIDURAL AND SUBDURAL SPACE DRAINAGE,020,CRANIOTOMY FOR TRAUMA,01,DISEASES AND DISORDERS OF THE NERVOUS SYSTEM,1,Minor,Moderate,Surgical,Medicare,Medicare,Medicaid,,,true,166856.88,48271.43
New York City,Bronx,7000002,001165,Jacobi Medical Center,30 to 49,109,M,Black/African American,Not Span/Hispanic,12,Emergency,Home or Self Care,2019,INJ001,"FRACTURE OF HEAD AND NECK, INITIAL ENCOUNTER",MST012,BONE FIXATION (EXCLUDING EXTREMITIES),020,CRANIOTOMY FOR TRAUMA,01,DISEASES AND DISORDERS OF THE NERVOUS SYSTEM,3,Major,Minor,Surgical,Medicaid,,,,,true,90835.64,53742.91
Hudson Valley,Westchester,5957001,001139,Westchester Medical Center,0 to 17,125,M,Black/African American,Not Span/Hispanic,7,Emergency,Home or Self Care,2019,INJ001,"FRACTURE OF HEAD AND NECK, INITIAL ENCOUNTER",MST029,"MUSCULOSKELETAL DEVICE PROCEDURES, NEC",020,CRANIOTOMY FOR TRAUMA,01,DISEASES AND DISORDERS OF THE NERVOUS SYSTEM,2,Moderate,Minor,Surgical,Miscellaneous/Other,Medicaid,,,,true,203599.15,37766.48
Capital/Adirond,Albany,0101000,000001,Albany Medical Center Hospital,70 or Older,128,F,White,Not Span/Hispanic,7,Emergency,Home w/ Home Health Services,2019,INJ008,"TRAUMATIC BRAIN INJURY (TBI); CONCUSSION, INITIAL ENCOUNTER",CNS004,INTRACRANIAL EPIDURAL AND SUBDURAL SPACE DRAINAGE,020,CRANIOTOMY FOR TRAUMA,01,DISEASES AND DISORDERS OF THE NERVOUS SYSTEM,1,Minor,Moderate,Surgical,Medicare,"Managed Care, Unspecified",,,,true,64117.64,20023.33
New York City,Manhattan,7002054,001464,New York-Presbyterian Hospital - Columbia Presbyterian Center,70 or Older,104,M,White,Not Span/Hispanic,7,Emergency,Home w/ Home Health Services,2019,INJ008,"TRAUMATIC BRAIN INJURY (TBI); CONCUSSION, INITIAL ENCOUNTER",CNS004,INTRACRANIAL EPIDURAL AND SUBDURAL SPACE DRAINAGE,020,CRANIOTOMY FOR TRAUMA,01,DISEASES AND DISORDERS OF THE NERVOUS SYSTEM,3,Major,Major,Surgical,Medicare,Medicare,Self-Pay,,,true,171699.15,64157.85
New York City,Queens,7003010,001637,New York - Presbyterian/Queens,50 to 69,113,M,Other Race,Not Span/Hispanic,5,Emergency,Skilled Nursing Home,2019,INJ008,"TRAUMATIC BRAIN INJURY (TBI); CONCUSSION, INITIAL ENCOUNTER",CNS004,INTRACRANIAL EPIDURAL AND SUBDURAL SPACE DRAINAGE,020,CRANIOTOMY FOR TRAUMA,01,DISEASES AND DISORDERS OF THE NERVOUS SYSTEM,2,Moderate,Moderate,Surgical,Blue Cross/Blue Shield,Self-Pay,,,,true,57477.61,18333.53
Central NY,Oneida,3202003,000599,Faxton-St Lukes Healthcare St Lukes Division,70 or Older,135,F,White,Not Span/Hispanic,8,Emergency,Home or Self Care,2019,INJ008,"TRAUMATIC BRAIN INJURY (TBI); CONCUSSION, INITIAL ENCOUNTER",CNS004,INTRACRANIAL EPIDURAL AND SUBDURAL SPACE DRAINAGE,020,CRANIOTOMY FOR TRAUMA,01,DISEASES AND DISORDERS OF THE NERVOUS SYSTEM,3,Major,Major,Surgical,Medicare,,,,,true,67162.75,18079.7
Central NY,Oneida,3202003,000599,Faxton-St Lukes Healthcare St Lukes Division,30 to 49,136,M,White,Not Span/Hispanic,6,Emergency,Home or Self Care,2019,INJ008,"TRAUMATIC BRAIN INJURY (TBI); CONCUSSION, INITIAL ENCOUNTER",CNS004,INTRACRANIAL EPIDURAL AND SUBDURAL SPACE DRAINAGE,020,CRANIOTOMY FOR TRAUMA,01,DISEASES AND DISORDERS OF THE NERVOUS SYSTEM,2,Moderate,Major,Surgical,Miscellaneous/Other,Blue Cross/Blue Shield,,,,true,59746.25,15256.24
Central NY,Onondaga,3301007,000635,University Hospital SUNY Health Science Center,70 or Older,131,M,White,Not Span/Hispanic,3,Emergency,Skilled Nursing Home,2019,INJ008,"TRAUMATIC BRAIN INJURY (TBI); CONCUSSION, INITIAL ENCOUNTER",CNS004,INTRACRANIAL EPIDURAL AND SUBDURAL SPACE DRAINAGE,020,CRANIOTOMY FOR TRAUMA,01,DISEASES AND DISORDERS OF THE NERVOUS SYSTEM,3,Major,Extreme,Surgical,Medicare,Private Health Insurance,,,,false,40609.14,8834.03
Western NY,Erie,1401014,000207,Buffalo General Medical Center,70 or Older,142,F,Black/African American,Not Span/Hispanic,6,Emergency,Home or Self Care,2019,INJ008,"TRAUMATIC BRAIN INJURY (TBI); CONCUSSION, INITIAL ENCOUNTER",CNS004,INTRACRANIAL EPIDURAL AND SUBDURAL SPACE DRAINAGE,020,CRANIOTOMY FOR TRAUMA,01,DISEASES AND DISORDERS OF THE NERVOUS SYSTEM,3,Major,Major,Surgical,Medicare,Blue Cross/Blue Shield,Self-Pay,,,true,80720.06,25199.63
Finger Lakes,Monroe,2701005,000413,Strong Memorial Hospital,70 or Older,148,M,White,Not Span/Hispanic,13,Emergency,Skilled Nursing Home,2019,INJ008,"TRAUMATIC BRAIN INJURY (TBI); CONCUSSION, INITIAL ENCOUNTER",CNS004,INTRACRANIAL EPIDURAL AND SUBDURAL SPACE DRAINAGE,020,CRANIOTOMY FOR TRAUMA,01,DISEASES AND DISORDERS OF THE NERVOUS SYSTEM,4,Extreme,Extreme,Surgical,Medicare,,,,,true,66953.18,31506.84
Long Island,Suffolk,5123000,000885,Long Island Community Hospital,70 or Older,OOS,F,White,Not Span/Hispanic,27,Emergency,Skilled Nursing Home,2019,INJ008,"TRAUMATIC BRAIN INJURY (TBI); CONCUSSION, INITIAL ENCOUNTER",CNS004,INTRACRANIAL EPIDURAL AND SUBDURAL SPACE DRAINAGE,020,CRANIOTOMY FOR TRAUMA,01,DISEASES AND DISORDERS OF THE NERVOUS SYSTEM,4,Extreme,Extreme,Surgical,Medicare,Medicare,Blue Cross/Blue Shield,,,true,488433.46,72925.5
Central NY,Onondaga,3301007,000635,University Hospital SUNY Health Science Center,70 or Older,136,F,White,Not Span/Hispanic,37,Emergency,Skilled Nursing Home,2019,INJ008,"TRAUMATIC BRAIN INJURY (TBI); CONCUSSION, INITIAL ENCOUNTER",CNS004,INTRACRANIAL EPIDURAL AND SUBDURAL SPACE DRAINAGE,020,CRANIOTOMY FOR TRAUMA,01,DISEASES AND DISORDERS OF THE NERVOUS SYSTEM,4,Extreme,Extreme,Surgical,Medicare,Private Health Insurance,,,,false,566436,150736.81
Long Island,Nassau,2951001,000541,North Shore University Hospital,70 or Older,116,F,Black/African American,Not Span/Hispanic,3,Emergency,Home w/ Home Health Services,2019,INJ008,"TRAUMATIC BRAIN INJURY (TBI); CONCUSSION, INITIAL ENCOUNTER",CNS004,INTRACRANIAL EPIDURAL AND SUBDURAL SPACE DRAINAGE,020,CRANIOTOMY FOR TRAUMA,01,DISEASES AND DISORDERS OF THE NERVOUS SYSTEM,1,Minor,Moderate,Surgical,Medicare,Medicare,,,,true,67741.56,15375.92
Long Island,Suffolk,5123000,000885,Long Island Community Hospital,30 to 49,117,M,White,Not Span/Hispanic,27,Emergency,Skilled Nursing Home,2019,INJ008,"TRAUMATIC BRAIN INJURY (TBI); CONCUSSION, INITIAL ENCOUNTER",CNS004,INTRACRANIAL EPIDURAL AND SUBDURAL SPACE DRAINAGE,020,CRANIOTOMY FOR TRAUMA,01,DISEASES AND DISORDERS OF THE NERVOUS SYSTEM,4,Extreme,Extreme,Surgical,Private Health Insurance,,,,,true,433655.69,71435.84