Hospital Service Area,Hospital County,Operating Certificate Number,Permanent Facility Id,Facility Name,Age Group,Zip Code - 3 digits,Gender,Race,Ethnicity,Length of Stay,Type of Admission,Patient Disposition,Discharge Year,CCS Diagnosis Code,CCS Diagnosis Description,CCS Procedure Code,CCS Procedure Description,APR DRG Code,APR DRG Description,APR MDC Code,APR MDC Description,APR Severity of Illness Code,APR Severity of Illness Description,APR Risk of Mortality,APR Medical Surgical Description,Payment Typology 1,Payment Typology 2,Payment Typology 3,Birth Weight,Abortion Edit Indicator,Emergency Department Indicator,Total Charges,Total Costs
New York City,Kings,7002053,001304,NYU Langone Hospital-Brooklyn,50 to 69,112,M,Other Race,Not Span/Hispanic,3,Emergency,Home or Self Care,2019,INJ008,"TRAUMATIC BRAIN INJURY (TBI); CONCUSSION, INITIAL ENCOUNTER",CNS004,INTRACRANIAL EPIDURAL AND SUBDURAL SPACE DRAINAGE,020,CRANIOTOMY FOR TRAUMA,01,DISEASES AND DISORDERS OF THE NERVOUS SYSTEM,1,Minor,Minor,Surgical,Private Health Insurance,,,,,true,108989.97,27772.12
New York City,Kings,7002053,001304,NYU Langone Hospital-Brooklyn,50 to 69,112,F,Other Race,Spanish/Hispanic,7,Emergency,Home w/ Home Health Services,2019,INJ008,"TRAUMATIC BRAIN INJURY (TBI); CONCUSSION, INITIAL ENCOUNTER",CNS004,INTRACRANIAL EPIDURAL AND SUBDURAL SPACE DRAINAGE,020,CRANIOTOMY FOR TRAUMA,01,DISEASES AND DISORDERS OF THE NERVOUS SYSTEM,3,Major,Moderate,Surgical,Medicare,,,,,true,145069.7,37053.84
New York City,Kings,7002053,001304,NYU Langone Hospital-Brooklyn,50 to 69,112,M,Other Race,Unknown,6,Emergency,Home w/ Home Health Services,2019,INJ008,"TRAUMATIC BRAIN INJURY (TBI); CONCUSSION, INITIAL ENCOUNTER",CNS004,INTRACRANIAL EPIDURAL AND SUBDURAL SPACE DRAINAGE,020,CRANIOTOMY FOR TRAUMA,01,DISEASES AND DISORDERS OF THE NERVOUS SYSTEM,3,Major,Moderate,Surgical,Medicaid,,,,,true,129997.21,36211.54
New York City,Kings,7002053,001304,NYU Langone Hospital-Brooklyn,70 or Older,112,F,White,Not Span/Hispanic,4,Emergency,Inpatient Rehabilitation Facility,2019,INJ008,"TRAUMATIC BRAIN INJURY (TBI); CONCUSSION, INITIAL ENCOUNTER",CNS006,OTHER CNS DRAINAGE AND RELATED PROCEDURES,020,CRANIOTOMY FOR TRAUMA,01,DISEASES AND DISORDERS OF THE NERVOUS SYSTEM,3,Major,Major,Surgical,Medicare,Private Health Insurance,,,,true,103960.24,24336.31
New York City,Kings,7002053,001304,NYU Langone Hospital-Brooklyn,50 to 69,112,M,Other Race,Unknown,3,Emergency,Home or Self Care,2019,INJ008,"TRAUMATIC BRAIN INJURY (TBI); CONCUSSION, INITIAL ENCOUNTER",CNS004,INTRACRANIAL EPIDURAL AND SUBDURAL SPACE DRAINAGE,020,CRANIOTOMY FOR TRAUMA,01,DISEASES AND DISORDERS OF THE NERVOUS SYSTEM,1,Minor,Minor,Surgical,Private Health Insurance,,,,,true,99445.6,29562.19
New York City,Kings,7002053,001304,NYU Langone Hospital-Brooklyn,50 to 69,112,F,White,Unknown,3,Emergency,Hospice - Medical Facility,2019,INJ008,"TRAUMATIC BRAIN INJURY (TBI); CONCUSSION, INITIAL ENCOUNTER",CNS009,DECOMPRESSIVE CRANIECTOMY,020,CRANIOTOMY FOR TRAUMA,01,DISEASES AND DISORDERS OF THE NERVOUS SYSTEM,4,Extreme,Extreme,Surgical,Private Health Insurance,,,,,true,203945.88,38833.63
New York City,Kings,7002053,001304,NYU Langone Hospital-Brooklyn,50 to 69,112,M,White,Not Span/Hispanic,5,Emergency,Inpatient Rehabilitation Facility,2019,INJ008,"TRAUMATIC BRAIN INJURY (TBI); CONCUSSION, INITIAL ENCOUNTER",CNS004,INTRACRANIAL EPIDURAL AND SUBDURAL SPACE DRAINAGE,020,CRANIOTOMY FOR TRAUMA,01,DISEASES AND DISORDERS OF THE NERVOUS SYSTEM,3,Major,Extreme,Surgical,Medicare,Medicaid,,,,true,157861.88,48045.67
New York City,Kings,7002053,001304,NYU Langone Hospital-Brooklyn,70 or Older,112,M,White,Not Span/Hispanic,9,Emergency,Inpatient Rehabilitation Facility,2019,INJ008,"TRAUMATIC BRAIN INJURY (TBI); CONCUSSION, INITIAL ENCOUNTER",CNS004,INTRACRANIAL EPIDURAL AND SUBDURAL SPACE DRAINAGE,020,CRANIOTOMY FOR TRAUMA,01,DISEASES AND DISORDERS OF THE NERVOUS SYSTEM,3,Major,Moderate,Surgical,Medicare,Private Health Insurance,,,,true,295589.39,74396.74
New York City,Kings,7002053,001304,NYU Langone Hospital-Brooklyn,30 to 49,112,M,Other Race,Not Span/Hispanic,2,Emergency,Home or Self Care,2019,INJ008,"TRAUMATIC BRAIN INJURY (TBI); CONCUSSION, INITIAL ENCOUNTER",CNS004,INTRACRANIAL EPIDURAL AND SUBDURAL SPACE DRAINAGE,020,CRANIOTOMY FOR TRAUMA,01,DISEASES AND DISORDERS OF THE NERVOUS SYSTEM,1,Minor,Minor,Surgical,Private Health Insurance,,,,,true,99650.76,24115.99
New York City,Kings,7002053,001304,NYU Langone Hospital-Brooklyn,70 or Older,112,M,White,Not Span/Hispanic,3,Elective,Home w/ Home Health Services,2019,INJ008,"TRAUMATIC BRAIN INJURY (TBI); CONCUSSION, INITIAL ENCOUNTER",CNS004,INTRACRANIAL EPIDURAL AND SUBDURAL SPACE DRAINAGE,020,CRANIOTOMY FOR TRAUMA,01,DISEASES AND DISORDERS OF THE NERVOUS SYSTEM,2,Moderate,Moderate,Surgical,Medicare,Blue Cross/Blue Shield,,,,false,99752.91,26130.14
New York City,Kings,7002053,001304,NYU Langone Hospital-Brooklyn,70 or Older,112,M,White,Not Span/Hispanic,5,Elective,Home w/ Home Health Services,2019,INJ008,"TRAUMATIC BRAIN INJURY (TBI); CONCUSSION, INITIAL ENCOUNTER",CNS004,INTRACRANIAL EPIDURAL AND SUBDURAL SPACE DRAINAGE,020,CRANIOTOMY FOR TRAUMA,01,DISEASES AND DISORDERS OF THE NERVOUS SYSTEM,3,Major,Major,Surgical,Medicare,Private Health Insurance,,,,false,132058.06,32271.29
New York City,Kings,7002053,001304,NYU Langone Hospital-Brooklyn,30 to 49,112,M,Other Race,Spanish/Hispanic,6,Emergency,Home or Self Care,2019,INJ008,"TRAUMATIC BRAIN INJURY (TBI); CONCUSSION, INITIAL ENCOUNTER",CNS004,INTRACRANIAL EPIDURAL AND SUBDURAL SPACE DRAINAGE,020,CRANIOTOMY FOR TRAUMA,01,DISEASES AND DISORDERS OF THE NERVOUS SYSTEM,3,Major,Moderate,Surgical,Medicaid,,,,,true,178291.96,54116.15
New York City,Kings,7002053,001304,NYU Langone Hospital-Brooklyn,70 or Older,112,M,White,Not Span/Hispanic,9,Emergency,Hospice - Medical Facility,2019,INJ008,"TRAUMATIC BRAIN INJURY (TBI); CONCUSSION, INITIAL ENCOUNTER",CNS004,INTRACRANIAL EPIDURAL AND SUBDURAL SPACE DRAINAGE,020,CRANIOTOMY FOR TRAUMA,01,DISEASES AND DISORDERS OF THE NERVOUS SYSTEM,4,Extreme,Extreme,Surgical,Medicare,Private Health Insurance,,,,true,641353.91,124506.27
New York City,Kings,7002053,001304,NYU Langone Hospital-Brooklyn,50 to 69,103,M,White,Not Span/Hispanic,3,Elective,Home or Self Care,2019,INJ008,"TRAUMATIC BRAIN INJURY (TBI); CONCUSSION, INITIAL ENCOUNTER",CNS006,OTHER CNS DRAINAGE AND RELATED PROCEDURES,020,CRANIOTOMY FOR TRAUMA,01,DISEASES AND DISORDERS OF THE NERVOUS SYSTEM,1,Minor,Minor,Surgical,Medicare,Blue Cross/Blue Shield,,,,false,137455.74,33715.62
New York City,Kings,7002053,001304,NYU Langone Hospital-Brooklyn,30 to 49,112,M,Other Race,Spanish/Hispanic,17,Emergency,Left Against Medical Advice,2019,INJ008,"TRAUMATIC BRAIN INJURY (TBI); CONCUSSION, INITIAL ENCOUNTER",CNS009,DECOMPRESSIVE CRANIECTOMY,020,CRANIOTOMY FOR TRAUMA,01,DISEASES AND DISORDERS OF THE NERVOUS SYSTEM,4,Extreme,Extreme,Surgical,Medicaid,,,,,true,338044.46,84780.02
New York City,Kings,7002053,001304,NYU Langone Hospital-Brooklyn,50 to 69,112,M,Other Race,Not Span/Hispanic,5,Emergency,Home w/ Home Health Services,2019,INJ008,"TRAUMATIC BRAIN INJURY (TBI); CONCUSSION, INITIAL ENCOUNTER",CNS004,INTRACRANIAL EPIDURAL AND SUBDURAL SPACE DRAINAGE,020,CRANIOTOMY FOR TRAUMA,01,DISEASES AND DISORDERS OF THE NERVOUS SYSTEM,2,Moderate,Minor,Surgical,Medicare,Medicaid,,,,true,134129.49,37891.98
New York City,Kings,7002053,001304,NYU Langone Hospital-Brooklyn,50 to 69,100,M,Other Race,Unknown,3,Emergency,Expired,2019,INJ001,"FRACTURE OF HEAD AND NECK, INITIAL ENCOUNTER",CNS007,CNS EXCISION PROCEDURES,020,CRANIOTOMY FOR TRAUMA,01,DISEASES AND DISORDERS OF THE NERVOUS SYSTEM,4,Extreme,Major,Surgical,Miscellaneous/Other,,,,,true,222362.67,49556.74
New York City,Kings,7002053,001304,NYU Langone Hospital-Brooklyn,50 to 69,112,M,Other Race,Not Span/Hispanic,8,Emergency,Expired,2019,INJ008,"TRAUMATIC BRAIN INJURY (TBI); CONCUSSION, INITIAL ENCOUNTER",CNS009,DECOMPRESSIVE CRANIECTOMY,020,CRANIOTOMY FOR TRAUMA,01,DISEASES AND DISORDERS OF THE NERVOUS SYSTEM,4,Extreme,Extreme,Surgical,Private Health Insurance,,,,,true,846950.95,142926.1
