Hospital Service Area,Hospital County,Operating Certificate Number,Permanent Facility Id,Facility Name,Age Group,Zip Code - 3 digits,Gender,Race,Ethnicity,Length of Stay,Type of Admission,Patient Disposition,Discharge Year,CCS Diagnosis Code,CCS Diagnosis Description,CCS Procedure Code,CCS Procedure Description,APR DRG Code,APR DRG Description,APR MDC Code,APR MDC Description,APR Severity of Illness Code,APR Severity of Illness Description,APR Risk of Mortality,APR Medical Surgical Description,Payment Typology 1,Payment Typology 2,Payment Typology 3,Birth Weight,Abortion Edit Indicator,Emergency Department Indicator,Total Charges,Total Costs
New York City,Manhattan,7002001,001438,Bellevue Hospital Center,70 or Older,100,M,White,Not Span/Hispanic,11,Emergency,Inpatient Rehabilitation Facility,2019,INJ008,"TRAUMATIC BRAIN INJURY (TBI); CONCUSSION, INITIAL ENCOUNTER",CNS004,INTRACRANIAL EPIDURAL AND SUBDURAL SPACE DRAINAGE,020,CRANIOTOMY FOR TRAUMA,01,DISEASES AND DISORDERS OF THE NERVOUS SYSTEM,2,Moderate,Moderate,Surgical,Medicare,Medicare,,,,true,82613.27,54904.78
New York City,Manhattan,7002001,001438,Bellevue Hospital Center,18 to 29,117,M,Other Race,Not Span/Hispanic,7,Emergency,Expired,2019,INJ008,"TRAUMATIC BRAIN INJURY (TBI); CONCUSSION, INITIAL ENCOUNTER",CNS006,OTHER CNS DRAINAGE AND RELATED PROCEDURES,020,CRANIOTOMY FOR TRAUMA,01,DISEASES AND DISORDERS OF THE NERVOUS SYSTEM,4,Extreme,Extreme,Surgical,Blue Cross/Blue Shield,,,,,true,79310.05,52709.46
New York City,Manhattan,7002001,001438,Bellevue Hospital Center,70 or Older,100,M,Other Race,Spanish/Hispanic,9,Emergency,Home or Self Care,2019,INJ008,"TRAUMATIC BRAIN INJURY (TBI); CONCUSSION, INITIAL ENCOUNTER",CNS004,INTRACRANIAL EPIDURAL AND SUBDURAL SPACE DRAINAGE,020,CRANIOTOMY FOR TRAUMA,01,DISEASES AND DISORDERS OF THE NERVOUS SYSTEM,1,Minor,Major,Surgical,Medicaid,,,,,true,53597.15,35620.67
New York City,Manhattan,7002001,001438,Bellevue Hospital Center,18 to 29,112,M,Other Race,Not Span/Hispanic,22,Emergency,Home or Self Care,2019,INJ008,"TRAUMATIC BRAIN INJURY (TBI); CONCUSSION, INITIAL ENCOUNTER",CNS004,INTRACRANIAL EPIDURAL AND SUBDURAL SPACE DRAINAGE,020,CRANIOTOMY FOR TRAUMA,01,DISEASES AND DISORDERS OF THE NERVOUS SYSTEM,4,Extreme,Extreme,Surgical,Medicaid,Medicaid,,,,true,155314.97,103222.33
New York City,Manhattan,7002001,001438,Bellevue Hospital Center,18 to 29,100,M,Black/African American,Not Span/Hispanic,10,Emergency,Left Against Medical Advice,2019,INJ008,"TRAUMATIC BRAIN INJURY (TBI); CONCUSSION, INITIAL ENCOUNTER",MST012,BONE FIXATION (EXCLUDING EXTREMITIES),020,CRANIOTOMY FOR TRAUMA,01,DISEASES AND DISORDERS OF THE NERVOUS SYSTEM,2,Moderate,Minor,Surgical,Miscellaneous/Other,Medicaid,,,,true,89125.65,59232.91
New York City,Manhattan,7002001,001438,Bellevue Hospital Center,50 to 69,112,M,Black/African American,Not Span/Hispanic,35,Emergency,Skilled Nursing Home,2019,INJ008,"TRAUMATIC BRAIN INJURY (TBI); CONCUSSION, INITIAL ENCOUNTER",ESA003,MECHANICAL VENTILATION,020,CRANIOTOMY FOR TRAUMA,01,DISEASES AND DISORDERS OF THE NERVOUS SYSTEM,4,Extreme,Extreme,Surgical,Medicaid,Medicaid,,,,false,201148.28,133683.15
New York City,Manhattan,7002001,001438,Bellevue Hospital Center,70 or Older,104,M,Other Race,Spanish/Hispanic,2,Emergency,Home or Self Care,2019,INJ008,"TRAUMATIC BRAIN INJURY (TBI); CONCUSSION, INITIAL ENCOUNTER",CNS004,INTRACRANIAL EPIDURAL AND SUBDURAL SPACE DRAINAGE,020,CRANIOTOMY FOR TRAUMA,01,DISEASES AND DISORDERS OF THE NERVOUS SYSTEM,1,Minor,Minor,Surgical,Medicaid,,,,,false,19087.12,12685.3
New York City,Manhattan,7002001,001438,Bellevue Hospital Center,70 or Older,112,F,Other Race,Spanish/Hispanic,4,Emergency,Expired,2019,INJ008,"TRAUMATIC BRAIN INJURY (TBI); CONCUSSION, INITIAL ENCOUNTER",CNS014,"CNS PROCEDURES, NEC",020,CRANIOTOMY FOR TRAUMA,01,DISEASES AND DISORDERS OF THE NERVOUS SYSTEM,3,Major,Major,Surgical,Medicare,Medicare,Medicaid,,,false,34435.26,22885.67
New York City,Manhattan,7002001,001438,Bellevue Hospital Center,70 or Older,100,M,Other Race,Not Span/Hispanic,18,Emergency,Skilled Nursing Home,2019,INJ008,"TRAUMATIC BRAIN INJURY (TBI); CONCUSSION, INITIAL ENCOUNTER",CNS004,INTRACRANIAL EPIDURAL AND SUBDURAL SPACE DRAINAGE,020,CRANIOTOMY FOR TRAUMA,01,DISEASES AND DISORDERS OF THE NERVOUS SYSTEM,4,Extreme,Extreme,Surgical,Medicare,,,,,true,144424.1,95984.26
New York City,Manhattan,7002001,001438,Bellevue Hospital Center,50 to 69,109,M,White,Not Span/Hispanic,28,Urgent,Skilled Nursing Home,2019,INJ008,"TRAUMATIC BRAIN INJURY (TBI); CONCUSSION, INITIAL ENCOUNTER",CNS004,INTRACRANIAL EPIDURAL AND SUBDURAL SPACE DRAINAGE,020,CRANIOTOMY FOR TRAUMA,01,DISEASES AND DISORDERS OF THE NERVOUS SYSTEM,4,Extreme,Extreme,Surgical,Medicare,,,,,false,336099.15,223371.5
New York City,Manhattan,7002001,001438,Bellevue Hospital Center,70 or Older,100,M,Other Race,Spanish/Hispanic,10,Emergency,Inpatient Rehabilitation Facility,2019,INJ008,"TRAUMATIC BRAIN INJURY (TBI); CONCUSSION, INITIAL ENCOUNTER",CNS004,INTRACRANIAL EPIDURAL AND SUBDURAL SPACE DRAINAGE,020,CRANIOTOMY FOR TRAUMA,01,DISEASES AND DISORDERS OF THE NERVOUS SYSTEM,4,Extreme,Extreme,Surgical,Medicare,,,,,true,137468.64,91361.66
New York City,Manhattan,7002001,001438,Bellevue Hospital Center,30 to 49,112,M,Black/African American,Not Span/Hispanic,6,Urgent,Left Against Medical Advice,2019,INJ001,"FRACTURE OF HEAD AND NECK, INITIAL ENCOUNTER",MST012,BONE FIXATION (EXCLUDING EXTREMITIES),020,CRANIOTOMY FOR TRAUMA,01,DISEASES AND DISORDERS OF THE NERVOUS SYSTEM,2,Moderate,Minor,Surgical,Self-Pay,,,,,false,79991.18,53162.14
New York City,Manhattan,7002001,001438,Bellevue Hospital Center,50 to 69,113,M,Black/African American,Not Span/Hispanic,4,Emergency,Court/Law Enforcement,2019,INJ008,"TRAUMATIC BRAIN INJURY (TBI); CONCUSSION, INITIAL ENCOUNTER",CNS014,"CNS PROCEDURES, NEC",020,CRANIOTOMY FOR TRAUMA,01,DISEASES AND DISORDERS OF THE NERVOUS SYSTEM,2,Moderate,Minor,Surgical,Medicaid,,,,,true,31470.32,20915.17
New York City,Manhattan,7002001,001438,Bellevue Hospital Center,50 to 69,112,M,Other Race,Spanish/Hispanic,4,Urgent,Inpatient Rehabilitation Facility,2019,INJ008,"TRAUMATIC BRAIN INJURY (TBI); CONCUSSION, INITIAL ENCOUNTER",CNS006,OTHER CNS DRAINAGE AND RELATED PROCEDURES,020,CRANIOTOMY FOR TRAUMA,01,DISEASES AND DISORDERS OF THE NERVOUS SYSTEM,1,Minor,Minor,Surgical,Medicaid,,,,,false,64555.02,42903.27
New York City,Manhattan,7002001,001438,Bellevue Hospital Center,30 to 49,115,M,Multi-racial,Unknown,29,Trauma,Inpatient Rehabilitation Facility,2019,INJ008,"TRAUMATIC BRAIN INJURY (TBI); CONCUSSION, INITIAL ENCOUNTER",CNS009,DECOMPRESSIVE CRANIECTOMY,020,CRANIOTOMY FOR TRAUMA,01,DISEASES AND DISORDERS OF THE NERVOUS SYSTEM,4,Extreme,Extreme,Surgical,Medicaid,Federal/State/Local/VA,,,,true,367554.11,244276.46
New York City,Manhattan,7002001,001438,Bellevue Hospital Center,50 to 69,100,M,White,Not Span/Hispanic,6,Emergency,Expired,2019,INJ008,"TRAUMATIC BRAIN INJURY (TBI); CONCUSSION, INITIAL ENCOUNTER",CNS009,DECOMPRESSIVE CRANIECTOMY,020,CRANIOTOMY FOR TRAUMA,01,DISEASES AND DISORDERS OF THE NERVOUS SYSTEM,2,Moderate,Major,Surgical,Private Health Insurance,,,,,true,113945.14,75727.94
New York City,Manhattan,7002001,001438,Bellevue Hospital Center,50 to 69,112,M,Other Race,Not Span/Hispanic,3,Urgent,Expired,2019,INJ008,"TRAUMATIC BRAIN INJURY (TBI); CONCUSSION, INITIAL ENCOUNTER",CNS005,VENTRICULOSTOMY [PERCUTANEOUS APPROACH],020,CRANIOTOMY FOR TRAUMA,01,DISEASES AND DISORDERS OF THE NERVOUS SYSTEM,4,Extreme,Major,Surgical,Medicaid,,,,,false,33076.83,21982.86
New York City,Manhattan,7002001,001438,Bellevue Hospital Center,30 to 49,104,M,Other Race,Spanish/Hispanic,19,Emergency,Inpatient Rehabilitation Facility,2019,INJ008,"TRAUMATIC BRAIN INJURY (TBI); CONCUSSION, INITIAL ENCOUNTER",CNS006,OTHER CNS DRAINAGE AND RELATED PROCEDURES,020,CRANIOTOMY FOR TRAUMA,01,DISEASES AND DISORDERS OF THE NERVOUS SYSTEM,4,Extreme,Extreme,Surgical,Medicaid,,,,,true,192171.51,127717.19
New York City,Manhattan,7002001,001438,Bellevue Hospital Center,70 or Older,100,M,Other Race,Unknown,7,Emergency,Expired,2019,INJ008,"TRAUMATIC BRAIN INJURY (TBI); CONCUSSION, INITIAL ENCOUNTER",CNS005,VENTRICULOSTOMY [PERCUTANEOUS APPROACH],020,CRANIOTOMY FOR TRAUMA,01,DISEASES AND DISORDERS OF THE NERVOUS SYSTEM,4,Extreme,Extreme,Surgical,Medicare,Medicaid,,,,true,156228.11,103829.2
New York City,Manhattan,7002001,001438,Bellevue Hospital Center,50 to 69,104,M,Other Race,Not Span/Hispanic,6,Emergency,Left Against Medical Advice,2019,INJ008,"TRAUMATIC BRAIN INJURY (TBI); CONCUSSION, INITIAL ENCOUNTER",CNS006,OTHER CNS DRAINAGE AND RELATED PROCEDURES,020,CRANIOTOMY FOR TRAUMA,01,DISEASES AND DISORDERS OF THE NERVOUS SYSTEM,3,Major,Moderate,Surgical,Self-Pay,,,,,true,107885.23,71700.52
New York City,Manhattan,7002001,001438,Bellevue Hospital Center,30 to 49,112,M,Black/African American,Not Span/Hispanic,3,Urgent,Home or Self Care,2019,INJ008,"TRAUMATIC BRAIN INJURY (TBI); CONCUSSION, INITIAL ENCOUNTER",CNS004,INTRACRANIAL EPIDURAL AND SUBDURAL SPACE DRAINAGE,020,CRANIOTOMY FOR TRAUMA,01,DISEASES AND DISORDERS OF THE NERVOUS SYSTEM,1,Minor,Minor,Surgical,Medicare,Medicaid,,,,false,28743.22,19102.74
New York City,Manhattan,7002001,001438,Bellevue Hospital Center,30 to 49,100,M,Black/African American,Not Span/Hispanic,24,Emergency,Inpatient Rehabilitation Facility,2019,INJ008,"TRAUMATIC BRAIN INJURY (TBI); CONCUSSION, INITIAL ENCOUNTER",CNS009,DECOMPRESSIVE CRANIECTOMY,020,CRANIOTOMY FOR TRAUMA,01,DISEASES AND DISORDERS OF THE NERVOUS SYSTEM,4,Extreme,Moderate,Surgical,Medicaid,,,,,true,402559.42,267540.99
New York City,Manhattan,7002001,001438,Bellevue Hospital Center,50 to 69,100,M,White,Not Span/Hispanic,27,Emergency,Skilled Nursing Home,2019,INJ008,"TRAUMATIC BRAIN INJURY (TBI); CONCUSSION, INITIAL ENCOUNTER",CNS004,INTRACRANIAL EPIDURAL AND SUBDURAL SPACE DRAINAGE,020,CRANIOTOMY FOR TRAUMA,01,DISEASES AND DISORDERS OF THE NERVOUS SYSTEM,4,Extreme,Extreme,Surgical,Private Health Insurance,,,,,false,212688.48,141352.76
New York City,Manhattan,7002001,001438,Bellevue Hospital Center,70 or Older,100,M,White,Unknown,10,Emergency,Home w/ Home Health Services,2019,INJ008,"TRAUMATIC BRAIN INJURY (TBI); CONCUSSION, INITIAL ENCOUNTER",CAR026,PACEMAKER AND DEFIBRILLATOR PROCEDURES,020,CRANIOTOMY FOR TRAUMA,01,DISEASES AND DISORDERS OF THE NERVOUS SYSTEM,3,Major,Major,Surgical,Medicare,Private Health Insurance,,,,true,111559.16,74142.22
