Hospital Service Area,Hospital County,Operating Certificate Number,Permanent Facility Id,Facility Name,Age Group,Zip Code - 3 digits,Gender,Race,Ethnicity,Length of Stay,Type of Admission,Patient Disposition,Discharge Year,CCS Diagnosis Code,CCS Diagnosis Description,CCS Procedure Code,CCS Procedure Description,APR DRG Code,APR DRG Description,APR MDC Code,APR MDC Description,APR Severity of Illness Code,APR Severity of Illness Description,APR Risk of Mortality,APR Medical Surgical Description,Payment Typology 1,Payment Typology 2,Payment Typology 3,Birth Weight,Abortion Edit Indicator,Emergency Department Indicator,Total Charges,Total Costs
New York City,Bronx,7000006,003058,Montefiore Med Center - Jack D Weiler Hosp of A Einstein College Div,50 to 69,104,M,Other Race,Spanish/Hispanic,3,Emergency,Home or Self Care,2020,CIR003,NONRHEUMATIC AND UNSPECIFIED VALVE DISORDERS,IMG008,ULTRASONOGRAPHY,200,CARDIAC STRUCTURAL & VALVULAR DISORDERS,05,DISEASES AND DISORDERS OF THE CIRCULATORY SYSTEM,3,Major,Extreme,Medical,Medicaid,,,,,Y,68582.88,12344.93
Hudson Valley,Westchester,5904001,001072,Montefiore New Rochelle Hospital,70 or Older,108,F,White,Unknown,3,Emergency,Skilled Nursing Home,2020,CIR003,NONRHEUMATIC AND UNSPECIFIED VALVE DISORDERS,ADM017,ADMINISTRATION OF NUTRITIONAL AND ELECTROLYTIC SUBSTANCES,200,CARDIAC STRUCTURAL & VALVULAR DISORDERS,05,DISEASES AND DISORDERS OF THE CIRCULATORY SYSTEM,1,Minor,Moderate,Medical,Medicare,Medicare,Medicaid,,,Y,24071.46,6687.5
New York City,Bronx,7000006,003058,Montefiore Med Center - Jack D Weiler Hosp of A Einstein College Div,50 to 69,104,F,Black/African American,Not Span/Hispanic,5,Emergency,Home w/ Home Health Services,2020,CIR001,CHRONIC RHEUMATIC HEART DISEASE,ADM017,ADMINISTRATION OF NUTRITIONAL AND ELECTROLYTIC SUBSTANCES,200,CARDIAC STRUCTURAL & VALVULAR DISORDERS,05,DISEASES AND DISORDERS OF THE CIRCULATORY SYSTEM,2,Moderate,Major,Medical,Medicaid,,,,,Y,95865.06,15904.93
New York City,Manhattan,7002032,001469,Mount Sinai Morningside,70 or Older,100,F,Other Race,Spanish/Hispanic,4,Emergency,Home w/ Home Health Services,2020,CIR003,NONRHEUMATIC AND UNSPECIFIED VALVE DISORDERS,CAR024,VENOUS AND ARTERIAL CATHETER PLACEMENT,200,CARDIAC STRUCTURAL & VALVULAR DISORDERS,05,DISEASES AND DISORDERS OF THE CIRCULATORY SYSTEM,2,Moderate,Moderate,Medical,Medicare,Medicaid,Self-Pay,,,Y,52562.17,11309.39
New York City,Manhattan,7002024,001456,Mount Sinai Hospital,50 to 69,112,F,Black/African American,Not Span/Hispanic,9,Urgent,Skilled Nursing Home,2020,CIR003,NONRHEUMATIC AND UNSPECIFIED VALVE DISORDERS,IMG008,ULTRASONOGRAPHY,200,CARDIAC STRUCTURAL & VALVULAR DISORDERS,05,DISEASES AND DISORDERS OF THE CIRCULATORY SYSTEM,3,Major,Major,Medical,Medicare,Medicare,Medicaid,,,N,114457.88,29365.36
New York City,Manhattan,7002024,001456,Mount Sinai Hospital,70 or Older,111,M,White,Not Span/Hispanic,11,Urgent,Skilled Nursing Home,2020,CIR003,NONRHEUMATIC AND UNSPECIFIED VALVE DISORDERS,ADM021,"ADMINISTRATION OF THERAPEUTIC SUBSTANCES, NEC",200,CARDIAC STRUCTURAL & VALVULAR DISORDERS,05,DISEASES AND DISORDERS OF THE CIRCULATORY SYSTEM,3,Major,Major,Medical,Medicare,Private Health Insurance,Self-Pay,,,N,133252.94,31791.72
New York City,Bronx,7000006,003058,Montefiore Med Center - Jack D Weiler Hosp of A Einstein College Div,70 or Older,104,M,Other Race,Spanish/Hispanic,3,Emergency,Home or Self Care,2020,CIR003,NONRHEUMATIC AND UNSPECIFIED VALVE DISORDERS,MAM007,ELECTROCARDIOGRAM (ECG),200,CARDIAC STRUCTURAL & VALVULAR DISORDERS,05,DISEASES AND DISORDERS OF THE CIRCULATORY SYSTEM,3,Major,Major,Medical,Medicare,Private Health Insurance,,,,Y,64613.46,9941.81
New York City,Bronx,7000006,003058,Montefiore Med Center - Jack D Weiler Hosp of A Einstein College Div,70 or Older,104,F,Black/African American,Not Span/Hispanic,4,Emergency,Home w/ Home Health Services,2020,CIR003,NONRHEUMATIC AND UNSPECIFIED VALVE DISORDERS,IMG008,ULTRASONOGRAPHY,200,CARDIAC STRUCTURAL & VALVULAR DISORDERS,05,DISEASES AND DISORDERS OF THE CIRCULATORY SYSTEM,3,Major,Major,Medical,Medicare,Medicaid,,,,Y,52387.26,7108.31
New York City,Bronx,7000006,001169,Montefiore Medical Center - Henry & Lucy Moses Div,70 or Older,104,F,White,Not Span/Hispanic,8,Emergency,Home or Self Care,2020,CIR001,CHRONIC RHEUMATIC HEART DISEASE,MAM008,CARDIAC MONITORING,200,CARDIAC STRUCTURAL & VALVULAR DISORDERS,05,DISEASES AND DISORDERS OF THE CIRCULATORY SYSTEM,3,Major,Minor,Medical,Medicare,Blue Cross/Blue Shield,Medicaid,,,Y,169233.85,33692.57
New York City,Bronx,7000006,001168,Montefiore Medical Center-Wakefield Hospital,70 or Older,100,F,Other Race,Spanish/Hispanic,2,Emergency,Home or Self Care,2020,CIR003,NONRHEUMATIC AND UNSPECIFIED VALVE DISORDERS,IMG008,ULTRASONOGRAPHY,200,CARDIAC STRUCTURAL & VALVULAR DISORDERS,05,DISEASES AND DISORDERS OF THE CIRCULATORY SYSTEM,2,Moderate,Moderate,Medical,Medicare,,,,,Y,45774.73,7761.29
New York City,Manhattan,7002054,001464,New York-Presbyterian Hospital - Columbia Presbyterian Center,50 to 69,117,F,Other Race,Not Span/Hispanic,2,Emergency,Home or Self Care,2020,CIR003,NONRHEUMATIC AND UNSPECIFIED VALVE DISORDERS,,,200,CARDIAC STRUCTURAL & VALVULAR DISORDERS,05,DISEASES AND DISORDERS OF THE CIRCULATORY SYSTEM,1,Minor,Minor,Medical,Blue Cross/Blue Shield,Self-Pay,,,,N,29790.61,7339.95
New York City,Manhattan,7002054,001464,New York-Presbyterian Hospital - Columbia Presbyterian Center,50 to 69,107,M,White,Not Span/Hispanic,11,Emergency,Home or Self Care,2020,CIR003,NONRHEUMATIC AND UNSPECIFIED VALVE DISORDERS,ESA001,HEMODIALYSIS,200,CARDIAC STRUCTURAL & VALVULAR DISORDERS,05,DISEASES AND DISORDERS OF THE CIRCULATORY SYSTEM,3,Major,Major,Medical,Medicare,Blue Cross/Blue Shield,Self-Pay,,,N,213855.69,101211.46
New York City,Manhattan,7002054,001464,New York-Presbyterian Hospital - Columbia Presbyterian Center,50 to 69,OOS,F,Other Race,Spanish/Hispanic,3,Emergency,Left Against Medical Advice,2020,MAL001,CARDIAC AND CIRCULATORY CONGENITAL ANOMALIES,,,200,CARDIAC STRUCTURAL & VALVULAR DISORDERS,05,DISEASES AND DISORDERS OF THE CIRCULATORY SYSTEM,1,Minor,Moderate,Medical,Private Health Insurance,Self-Pay,,,,Y,44854.92,9704.63
New York City,Queens,7003010,001637,New York - Presbyterian/Queens,70 or Older,114,F,White,Not Span/Hispanic,1,Emergency,Home w/ Home Health Services,2020,CIR001,CHRONIC RHEUMATIC HEART DISEASE,ESA004,NON-INVASIVE VENTILATION,200,CARDIAC STRUCTURAL & VALVULAR DISORDERS,05,DISEASES AND DISORDERS OF THE CIRCULATORY SYSTEM,2,Moderate,Moderate,Medical,Medicare,Medicaid,Self-Pay,,,Y,13520.87,3161.31
New York City,Bronx,7000006,003058,Montefiore Med Center - Jack D Weiler Hosp of A Einstein College Div,70 or Older,104,F,Other Race,Spanish/Hispanic,9,Emergency,Home w/ Home Health Services,2020,CIR001,CHRONIC RHEUMATIC HEART DISEASE,IMG008,ULTRASONOGRAPHY,200,CARDIAC STRUCTURAL & VALVULAR DISORDERS,05,DISEASES AND DISORDERS OF THE CIRCULATORY SYSTEM,3,Major,Major,Medical,Medicare,,,,,Y,146146.02,26673.31
New York City,Queens,7003010,001637,New York - Presbyterian/Queens,50 to 69,113,F,Other Race,Not Span/Hispanic,4,Emergency,Home or Self Care,2020,CIR001,CHRONIC RHEUMATIC HEART DISEASE,ADM017,ADMINISTRATION OF NUTRITIONAL AND ELECTROLYTIC SUBSTANCES,200,CARDIAC STRUCTURAL & VALVULAR DISORDERS,05,DISEASES AND DISORDERS OF THE CIRCULATORY SYSTEM,3,Major,Moderate,Medical,Medicaid,Self-Pay,,,,Y,33065.18,8712.96
New York City,Kings,7001037,001320,University Hospital of Brooklyn,70 or Older,112,F,Black/African American,Not Span/Hispanic,4,Emergency,Home w/ Home Health Services,2020,CIR003,NONRHEUMATIC AND UNSPECIFIED VALVE DISORDERS,ADM021,"ADMINISTRATION OF THERAPEUTIC SUBSTANCES, NEC",200,CARDIAC STRUCTURAL & VALVULAR DISORDERS,05,DISEASES AND DISORDERS OF THE CIRCULATORY SYSTEM,2,Moderate,Moderate,Medical,Medicare,Medicare,Medicaid,,,Y,20421,8013.5
New York City,Manhattan,7002054,001458,New York-Presbyterian Hospital - New York Weill Cornell Center,70 or Older,114,F,Other Race,Not Span/Hispanic,5,Elective,Home or Self Care,2020,CIR001,CHRONIC RHEUMATIC HEART DISEASE,IMG008,ULTRASONOGRAPHY,200,CARDIAC STRUCTURAL & VALVULAR DISORDERS,05,DISEASES AND DISORDERS OF THE CIRCULATORY SYSTEM,2,Moderate,Moderate,Medical,Medicare,Medicaid,Self-Pay,,,N,90849.4,43697.2
New York City,Manhattan,7002054,001458,New York-Presbyterian Hospital - New York Weill Cornell Center,70 or Older,100,F,White,Not Span/Hispanic,5,Emergency,Home or Self Care,2020,CIR003,NONRHEUMATIC AND UNSPECIFIED VALVE DISORDERS,,,200,CARDIAC STRUCTURAL & VALVULAR DISORDERS,05,DISEASES AND DISORDERS OF THE CIRCULATORY SYSTEM,3,Major,Major,Medical,Medicare,Private Health Insurance,Self-Pay,,,Y,99187.71,40122.35
New York City,Manhattan,7002054,001458,New York-Presbyterian Hospital - New York Weill Cornell Center,70 or Older,100,M,White,Not Span/Hispanic,3,Emergency,Home w/ Home Health Services,2020,CIR003,NONRHEUMATIC AND UNSPECIFIED VALVE DISORDERS,ADM017,ADMINISTRATION OF NUTRITIONAL AND ELECTROLYTIC SUBSTANCES,200,CARDIAC STRUCTURAL & VALVULAR DISORDERS,05,DISEASES AND DISORDERS OF THE CIRCULATORY SYSTEM,3,Major,Moderate,Medical,Medicare,Private Health Insurance,Self-Pay,,,Y,67702.94,15644.69
New York City,Manhattan,7002054,001458,New York-Presbyterian Hospital - New York Weill Cornell Center,30 to 49,100,M,White,Not Span/Hispanic,2,Emergency,Home or Self Care,2020,CIR004,ENDOCARDITIS AND ENDOCARDIAL DISEASE,ADM021,"ADMINISTRATION OF THERAPEUTIC SUBSTANCES, NEC",200,CARDIAC STRUCTURAL & VALVULAR DISORDERS,05,DISEASES AND DISORDERS OF THE CIRCULATORY SYSTEM,3,Major,Moderate,Medical,Medicaid,Self-Pay,,,,Y,31838.47,7004.46
New York City,Manhattan,7002024,001456,Mount Sinai Hospital,18 to 29,OOS,F,Other Race,Not Span/Hispanic,3,Urgent,Home or Self Care,2020,MAL001,CARDIAC AND CIRCULATORY CONGENITAL ANOMALIES,,,200,CARDIAC STRUCTURAL & VALVULAR DISORDERS,05,DISEASES AND DISORDERS OF THE CIRCULATORY SYSTEM,3,Major,Major,Medical,Private Health Insurance,Medicaid,Self-Pay,,,N,60807.56,11043.45
Long Island,Nassau,2950002,000528,Nassau University Medical Center,70 or Older,115,M,White,Unknown,3,Emergency,Short-term Hospital,2020,CIR003,NONRHEUMATIC AND UNSPECIFIED VALVE DISORDERS,IMG008,ULTRASONOGRAPHY,200,CARDIAC STRUCTURAL & VALVULAR DISORDERS,05,DISEASES AND DISORDERS OF THE CIRCULATORY SYSTEM,2,Moderate,Major,Medical,Medicare,Self-Pay,,,,N,24083.26,7697.63
Long Island,Nassau,2950002,000528,Nassau University Medical Center,70 or Older,115,M,White,Not Span/Hispanic,12,Emergency,Skilled Nursing Home,2020,CIR003,NONRHEUMATIC AND UNSPECIFIED VALVE DISORDERS,URN006,BLADDER CATHETERIZATION AND DRAINAGE,200,CARDIAC STRUCTURAL & VALVULAR DISORDERS,05,DISEASES AND DISORDERS OF THE CIRCULATORY SYSTEM,3,Major,Major,Medical,Medicare,Medicare,Self-Pay,,,N,81389.32,26758.58
New York City,Kings,7002002,001324,Mount Sinai Brooklyn,70 or Older,112,F,White,Unknown,8,Emergency,Skilled Nursing Home,2020,CIR003,NONRHEUMATIC AND UNSPECIFIED VALVE DISORDERS,IMG008,ULTRASONOGRAPHY,200,CARDIAC STRUCTURAL & VALVULAR DISORDERS,05,DISEASES AND DISORDERS OF THE CIRCULATORY SYSTEM,3,Major,Major,Medical,Medicare,Private Health Insurance,Self-Pay,,,Y,96753.11,11758.38
Western NY,Erie,1401005,000210,Erie County Medical Center,70 or Older,142,F,Black/African American,Not Span/Hispanic,2,Emergency,Home or Self Care,2020,CIR001,CHRONIC RHEUMATIC HEART DISEASE,ESA001,HEMODIALYSIS,200,CARDIAC STRUCTURAL & VALVULAR DISORDERS,05,DISEASES AND DISORDERS OF THE CIRCULATORY SYSTEM,3,Major,Major,Medical,Medicare,Federal/State/Local/VA,,,,Y,18749.5,7108.67
Western NY,Erie,1401005,000210,Erie County Medical Center,30 to 49,140,M,White,Not Span/Hispanic,2,Emergency,Home or Self Care,2020,CIR003,NONRHEUMATIC AND UNSPECIFIED VALVE DISORDERS,,,200,CARDIAC STRUCTURAL & VALVULAR DISORDERS,05,DISEASES AND DISORDERS OF THE CIRCULATORY SYSTEM,2,Moderate,Moderate,Medical,Private Health Insurance,,,,,Y,13738.05,5492.29
New York City,Manhattan,7002032,001469,Mount Sinai Morningside,70 or Older,100,M,Other Race,Spanish/Hispanic,5,Emergency,Home w/ Home Health Services,2020,MAL001,CARDIAC AND CIRCULATORY CONGENITAL ANOMALIES,IMG004,FLUOROSCOPY OF NON-CIRCULATORY ORGANS,200,CARDIAC STRUCTURAL & VALVULAR DISORDERS,05,DISEASES AND DISORDERS OF THE CIRCULATORY SYSTEM,2,Moderate,Moderate,Medical,Medicare,Medicaid,Self-Pay,,,Y,90008.58,23940.97
Hudson Valley,Westchester,5902002,001046,Winifred Masterson Burke Rehabilitation Hospital,70 or Older,104,M,White,Not Span/Hispanic,7,Elective,Home or Self Care,2020,CIR001,CHRONIC RHEUMATIC HEART DISEASE,,,200,CARDIAC STRUCTURAL & VALVULAR DISORDERS,05,DISEASES AND DISORDERS OF THE CIRCULATORY SYSTEM,2,Moderate,Minor,Medical,Medicare,Blue Cross/Blue Shield,,,,N,20413.31,9681.63
New York City,Bronx,7000006,001169,Montefiore Medical Center - Henry & Lucy Moses Div,50 to 69,104,M,Other Race,Spanish/Hispanic,3,Emergency,Skilled Nursing Home,2020,CIR003,NONRHEUMATIC AND UNSPECIFIED VALVE DISORDERS,,,200,CARDIAC STRUCTURAL & VALVULAR DISORDERS,05,DISEASES AND DISORDERS OF THE CIRCULATORY SYSTEM,2,Moderate,Major,Medical,Medicaid,,,,,Y,50489.53,9007.94
New York City,Bronx,7000006,003058,Montefiore Med Center - Jack D Weiler Hosp of A Einstein College Div,70 or Older,104,F,Black/African American,Not Span/Hispanic,3,Emergency,Home or Self Care,2020,CIR003,NONRHEUMATIC AND UNSPECIFIED VALVE DISORDERS,IMG008,ULTRASONOGRAPHY,200,CARDIAC STRUCTURAL & VALVULAR DISORDERS,05,DISEASES AND DISORDERS OF THE CIRCULATORY SYSTEM,2,Moderate,Moderate,Medical,Medicare,,,,,N,53176.88,10009.66
New York City,Bronx,7000006,003058,Montefiore Med Center - Jack D Weiler Hosp of A Einstein College Div,50 to 69,104,M,Black/African American,Not Span/Hispanic,4,Emergency,Home or Self Care,2020,CIR003,NONRHEUMATIC AND UNSPECIFIED VALVE DISORDERS,ADM017,ADMINISTRATION OF NUTRITIONAL AND ELECTROLYTIC SUBSTANCES,200,CARDIAC STRUCTURAL & VALVULAR DISORDERS,05,DISEASES AND DISORDERS OF THE CIRCULATORY SYSTEM,2,Moderate,Moderate,Medical,Medicaid,,,,,Y,51145.78,8786.05
New York City,Manhattan,7002053,001463,NYU Langone Hospitals,70 or Older,100,F,White,Not Span/Hispanic,3,Emergency,Hospice - Home,2020,CIR003,NONRHEUMATIC AND UNSPECIFIED VALVE DISORDERS,,,200,CARDIAC STRUCTURAL & VALVULAR DISORDERS,05,DISEASES AND DISORDERS OF THE CIRCULATORY SYSTEM,2,Moderate,Major,Medical,Medicare,,,,,Y,51488.35,16537.36
New York City,Manhattan,7002053,001463,NYU Langone Hospitals,70 or Older,114,F,Other Race,Not Span/Hispanic,3,Emergency,Home or Self Care,2020,CIR003,NONRHEUMATIC AND UNSPECIFIED VALVE DISORDERS,,,200,CARDIAC STRUCTURAL & VALVULAR DISORDERS,05,DISEASES AND DISORDERS OF THE CIRCULATORY SYSTEM,2,Moderate,Major,Medical,Private Health Insurance,Medicaid,,,,N,48877.55,12293.62
New York City,Bronx,7000001,001178,BronxCare Hospital Center,50 to 69,104,M,Black/African American,Not Span/Hispanic,8,Emergency,Left Against Medical Advice,2020,CIR003,NONRHEUMATIC AND UNSPECIFIED VALVE DISORDERS,,,200,CARDIAC STRUCTURAL & VALVULAR DISORDERS,05,DISEASES AND DISORDERS OF THE CIRCULATORY SYSTEM,3,Major,Moderate,Medical,Medicaid,Medicaid,,,,Y,31096.64,41572.96
New York City,Bronx,7000001,001178,BronxCare Hospital Center,70 or Older,104,F,Black/African American,Not Span/Hispanic,6,Emergency,Home or Self Care,2020,CIR003,NONRHEUMATIC AND UNSPECIFIED VALVE DISORDERS,,,200,CARDIAC STRUCTURAL & VALVULAR DISORDERS,05,DISEASES AND DISORDERS OF THE CIRCULATORY SYSTEM,3,Major,Major,Medical,Medicare,Medicaid,,,,Y,20960.82,28444.12
Finger Lakes,Monroe,2701005,000413,Strong Memorial Hospital,18 to 29,146,F,Black/African American,Not Span/Hispanic,2,Emergency,Left Against Medical Advice,2020,CIR001,CHRONIC RHEUMATIC HEART DISEASE,,,200,CARDIAC STRUCTURAL & VALVULAR DISORDERS,05,DISEASES AND DISORDERS OF THE CIRCULATORY SYSTEM,1,Minor,Minor,Medical,Medicaid,,,,,Y,7487.76,3256.45
New York City,Bronx,7000006,001169,Montefiore Medical Center - Henry & Lucy Moses Div,70 or Older,100,F,Other Race,Spanish/Hispanic,8,Emergency,Home w/ Home Health Services,2020,CIR003,NONRHEUMATIC AND UNSPECIFIED VALVE DISORDERS,ADM015,ADMINISTRATION OF ANTIBIOTICS,200,CARDIAC STRUCTURAL & VALVULAR DISORDERS,05,DISEASES AND DISORDERS OF THE CIRCULATORY SYSTEM,2,Moderate,Moderate,Medical,Medicare,,,,,Y,146993.94,25588.13
Finger Lakes,Monroe,2701003,000411,Rochester General Hospital,70 or Older,146,M,Black/African American,Not Span/Hispanic,7,Emergency,Home w/ Home Health Services,2020,CIR003,NONRHEUMATIC AND UNSPECIFIED VALVE DISORDERS,ENT015,DENTAL PROCEDURES,200,CARDIAC STRUCTURAL & VALVULAR DISORDERS,05,DISEASES AND DISORDERS OF THE CIRCULATORY SYSTEM,3,Major,Minor,Medical,Blue Cross/Blue Shield,Medicare,,,,Y,32844.22,12612.39
New York City,Bronx,7000006,001169,Montefiore Medical Center - Henry & Lucy Moses Div,70 or Older,104,M,Other Race,Spanish/Hispanic,12,Emergency,Home or Self Care,2020,CIR003,NONRHEUMATIC AND UNSPECIFIED VALVE DISORDERS,MAM006,PACEMAKER AND DEFIBRILLATOR INTERROGATION,200,CARDIAC STRUCTURAL & VALVULAR DISORDERS,05,DISEASES AND DISORDERS OF THE CIRCULATORY SYSTEM,3,Major,Major,Medical,Medicare,Private Health Insurance,,,,Y,194854.57,35909.52
New York City,Kings,7001033,001315,Kingsbrook Jewish Medical Center,50 to 69,112,M,Black/African American,Not Span/Hispanic,2,Emergency,Short-term Hospital,2020,CIR003,NONRHEUMATIC AND UNSPECIFIED VALVE DISORDERS,ESA001,HEMODIALYSIS,200,CARDIAC STRUCTURAL & VALVULAR DISORDERS,05,DISEASES AND DISORDERS OF THE CIRCULATORY SYSTEM,2,Moderate,Major,Medical,Medicare,Medicaid,Self-Pay,,,Y,34459.38,10989.49
New York City,Manhattan,7002032,001469,Mount Sinai Morningside,70 or Older,100,F,White,Not Span/Hispanic,4,Emergency,Home w/ Home Health Services,2020,CIR003,NONRHEUMATIC AND UNSPECIFIED VALVE DISORDERS,IMG008,ULTRASONOGRAPHY,200,CARDIAC STRUCTURAL & VALVULAR DISORDERS,05,DISEASES AND DISORDERS OF THE CIRCULATORY SYSTEM,3,Major,Moderate,Medical,Medicare,Medicare,Self-Pay,,,Y,46929.83,10259.95
New York City,Manhattan,7002053,001463,NYU Langone Hospitals,18 to 29,112,M,Black/African American,Not Span/Hispanic,4,Emergency,Home or Self Care,2020,MAL001,CARDIAC AND CIRCULATORY CONGENITAL ANOMALIES,,,200,CARDIAC STRUCTURAL & VALVULAR DISORDERS,05,DISEASES AND DISORDERS OF THE CIRCULATORY SYSTEM,2,Moderate,Major,Medical,Private Health Insurance,,,,,Y,60389.93,16036.91
New York City,Bronx,7000006,001168,Montefiore Medical Center-Wakefield Hospital,70 or Older,104,F,Other Race,Not Span/Hispanic,2,Emergency,Home w/ Home Health Services,2020,CIR003,NONRHEUMATIC AND UNSPECIFIED VALVE DISORDERS,IMG008,ULTRASONOGRAPHY,200,CARDIAC STRUCTURAL & VALVULAR DISORDERS,05,DISEASES AND DISORDERS OF THE CIRCULATORY SYSTEM,2,Moderate,Moderate,Medical,Medicare,Medicaid,,,,Y,38324.94,6235.5
New York City,Manhattan,7002024,001456,Mount Sinai Hospital,70 or Older,115,M,White,Unknown,7,Urgent,Home or Self Care,2020,CIR003,NONRHEUMATIC AND UNSPECIFIED VALVE DISORDERS,IMG006,COMPUTERIZED TOMOGRAPHY (CT) WITH CONTRAST,200,CARDIAC STRUCTURAL & VALVULAR DISORDERS,05,DISEASES AND DISORDERS OF THE CIRCULATORY SYSTEM,2,Moderate,Major,Medical,Medicare,Blue Cross/Blue Shield,Self-Pay,,,N,109736.97,27183.28
Long Island,Nassau,2908000,000511,NYU Langone Hospital-Long Island,70 or Older,115,F,White,Not Span/Hispanic,4,Emergency,Home or Self Care,2020,CIR001,CHRONIC RHEUMATIC HEART DISEASE,,,200,CARDIAC STRUCTURAL & VALVULAR DISORDERS,05,DISEASES AND DISORDERS OF THE CIRCULATORY SYSTEM,2,Moderate,Moderate,Medical,Medicare,Blue Cross/Blue Shield,,,,Y,61151.32,16121.08
Long Island,Nassau,2908000,000511,NYU Langone Hospital-Long Island,70 or Older,115,M,White,Not Span/Hispanic,3,Urgent,Home or Self Care,2020,CIR003,NONRHEUMATIC AND UNSPECIFIED VALVE DISORDERS,,,200,CARDIAC STRUCTURAL & VALVULAR DISORDERS,05,DISEASES AND DISORDERS OF THE CIRCULATORY SYSTEM,2,Moderate,Moderate,Medical,Medicare,Private Health Insurance,,,,N,58440.53,13468.68
Central NY,Tompkins,5401001,000977,Cayuga Medical Center at Ithaca,70 or Older,148,F,White,Not Span/Hispanic,5,Emergency,Skilled Nursing Home,2020,CIR003,NONRHEUMATIC AND UNSPECIFIED VALVE DISORDERS,,,200,CARDIAC STRUCTURAL & VALVULAR DISORDERS,05,DISEASES AND DISORDERS OF THE CIRCULATORY SYSTEM,3,Major,Major,Medical,Medicare,Blue Cross/Blue Shield,Self-Pay,,,Y,12119.35,8446.79
Hudson Valley,Dutchess,5957001,000180,Mid-Hudson Valley Division of Westchester Medical Center,70 or Older,126,M,White,Not Span/Hispanic,5,Emergency,Short-term Hospital,2020,CIR003,NONRHEUMATIC AND UNSPECIFIED VALVE DISORDERS,,,200,CARDIAC STRUCTURAL & VALVULAR DISORDERS,05,DISEASES AND DISORDERS OF THE CIRCULATORY SYSTEM,2,Moderate,Moderate,Medical,Medicare,Medicare,,,,Y,45282.3,6653.29
New York City,Bronx,7000006,001169,Montefiore Medical Center - Henry & Lucy Moses Div,30 to 49,104,F,Black/African American,Spanish/Hispanic,8,Emergency,Home or Self Care,2020,CIR001,CHRONIC RHEUMATIC HEART DISEASE,IMG008,ULTRASONOGRAPHY,200,CARDIAC STRUCTURAL & VALVULAR DISORDERS,05,DISEASES AND DISORDERS OF THE CIRCULATORY SYSTEM,2,Moderate,Moderate,Medical,Medicaid,,,,,Y,119735.33,20096.75
Central NY,Onondaga,3301008,000636,Crouse Hospital,0 to 17,138,M,White,Not Span/Hispanic,1,Urgent,Home or Self Care,2020,MAL001,CARDIAC AND CIRCULATORY CONGENITAL ANOMALIES,,,200,CARDIAC STRUCTURAL & VALVULAR DISORDERS,05,DISEASES AND DISORDERS OF THE CIRCULATORY SYSTEM,2,Moderate,Moderate,Medical,Blue Cross/Blue Shield,,,03100,,N,6681.76,2897.38
Western NY,Erie,1401014,000207,Buffalo General Medical Center,70 or Older,141,M,White,Not Span/Hispanic,1,Elective,Home or Self Care,2020,CIR003,NONRHEUMATIC AND UNSPECIFIED VALVE DISORDERS,CAR021,"ARTERY, VEIN, AND GREAT VESSEL PROCEDURES, NEC",200,CARDIAC STRUCTURAL & VALVULAR DISORDERS,05,DISEASES AND DISORDERS OF THE CIRCULATORY SYSTEM,2,Moderate,Moderate,Medical,Medicare,Self-Pay,,,,N,107339.88,43609.12
Western NY,Erie,1401014,000207,Buffalo General Medical Center,30 to 49,143,F,White,Not Span/Hispanic,1,Elective,Home or Self Care,2020,CIR003,NONRHEUMATIC AND UNSPECIFIED VALVE DISORDERS,IMG008,ULTRASONOGRAPHY,200,CARDIAC STRUCTURAL & VALVULAR DISORDERS,05,DISEASES AND DISORDERS OF THE CIRCULATORY SYSTEM,2,Moderate,Moderate,Medical,Medicaid,Self-Pay,,,,N,29219.4,8824.47
Western NY,Erie,1401014,000207,Buffalo General Medical Center,70 or Older,140,M,White,Not Span/Hispanic,1,Elective,Home or Self Care,2020,CIR003,NONRHEUMATIC AND UNSPECIFIED VALVE DISORDERS,,,200,CARDIAC STRUCTURAL & VALVULAR DISORDERS,05,DISEASES AND DISORDERS OF THE CIRCULATORY SYSTEM,2,Moderate,Moderate,Medical,Medicare,Self-Pay,,,,N,14459.14,3469.4
Western NY,Erie,1401014,000207,Buffalo General Medical Center,70 or Older,142,F,White,Not Span/Hispanic,1,Elective,Home or Self Care,2020,CIR003,NONRHEUMATIC AND UNSPECIFIED VALVE DISORDERS,,,200,CARDIAC STRUCTURAL & VALVULAR DISORDERS,05,DISEASES AND DISORDERS OF THE CIRCULATORY SYSTEM,2,Moderate,Moderate,Medical,Medicare,Self-Pay,,,,N,3278.8,1503.16
Western NY,Erie,1401014,000207,Buffalo General Medical Center,70 or Older,140,F,White,Not Span/Hispanic,24,Urgent,Short-term Hospital,2020,CIR003,NONRHEUMATIC AND UNSPECIFIED VALVE DISORDERS,ESA003,MECHANICAL VENTILATION,200,CARDIAC STRUCTURAL & VALVULAR DISORDERS,05,DISEASES AND DISORDERS OF THE CIRCULATORY SYSTEM,4,Extreme,Extreme,Medical,Medicare,Self-Pay,,,,N,105335.06,36246.56
New York City,Manhattan,7002054,001464,New York-Presbyterian Hospital - Columbia Presbyterian Center,70 or Older,100,F,White,Not Span/Hispanic,15,Emergency,Home w/ Home Health Services,2020,CIR001,CHRONIC RHEUMATIC HEART DISEASE,CAR024,VENOUS AND ARTERIAL CATHETER PLACEMENT,200,CARDIAC STRUCTURAL & VALVULAR DISORDERS,05,DISEASES AND DISORDERS OF THE CIRCULATORY SYSTEM,4,Extreme,Extreme,Medical,Medicare,Private Health Insurance,Self-Pay,,,Y,248820.37,71921.34