Hospital Service Area,Hospital County,Operating Certificate Number,Permanent Facility Id,Facility Name,Age Group,Zip Code - 3 digits,Gender,Race,Ethnicity,Length of Stay,Type of Admission,Patient Disposition,Discharge Year,CCS Diagnosis Code,CCS Diagnosis Description,CCS Procedure Code,CCS Procedure Description,APR DRG Code,APR DRG Description,APR MDC Code,APR MDC Description,APR Severity of Illness Code,APR Severity of Illness Description,APR Risk of Mortality,APR Medical Surgical Description,Payment Typology 1,Payment Typology 2,Payment Typology 3,Birth Weight,Abortion Edit Indicator,Emergency Department Indicator,Total Charges,Total Costs
New York City,Manhattan,7002053,001463,NYU Langone Hospitals,70 or Older,100,F,White,Not Span/Hispanic,3,Emergency,Home w/ Home Health Services,2019,CIR017,CARDIAC DYSRHYTHMIAS,ESA006,CARDIOVERSION,201,CARDIAC ARRHYTHMIA & CONDUCTION DISORDERS,05,DISEASES AND DISORDERS OF THE CIRCULATORY SYSTEM,3,Major,Major,Medical,Medicare,Blue Cross/Blue Shield,,,,true,41239.91,12872.65
New York City,Manhattan,7002053,001463,NYU Langone Hospitals,70 or Older,111,F,Other Race,Unknown,2,Emergency,Home w/ Home Health Services,2019,CIR017,CARDIAC DYSRHYTHMIAS,,,201,CARDIAC ARRHYTHMIA & CONDUCTION DISORDERS,05,DISEASES AND DISORDERS OF THE CIRCULATORY SYSTEM,3,Major,Moderate,Medical,Medicaid,,,,,true,52841.79,17520.37
New York City,Manhattan,7002053,001463,NYU Langone Hospitals,50 to 69,112,F,White,Not Span/Hispanic,2,Emergency,Home or Self Care,2019,CIR017,CARDIAC DYSRHYTHMIAS,,,201,CARDIAC ARRHYTHMIA & CONDUCTION DISORDERS,05,DISEASES AND DISORDERS OF THE CIRCULATORY SYSTEM,2,Moderate,Minor,Medical,Medicaid,,,,,true,36828.88,10112.42
New York City,Manhattan,7002053,001463,NYU Langone Hospitals,50 to 69,112,M,Black/African American,Not Span/Hispanic,1,Emergency,Home w/ Home Health Services,2019,SYM012,CIRCULATORY SIGNS AND SYMPTOMS,,,201,CARDIAC ARRHYTHMIA & CONDUCTION DISORDERS,05,DISEASES AND DISORDERS OF THE CIRCULATORY SYSTEM,2,Moderate,Minor,Medical,Medicare,Medicaid,,,,true,47827.06,13940.16
New York City,Manhattan,7002053,001463,NYU Langone Hospitals,70 or Older,100,F,White,Not Span/Hispanic,1,Emergency,Home or Self Care,2019,CIR017,CARDIAC DYSRHYTHMIAS,,,201,CARDIAC ARRHYTHMIA & CONDUCTION DISORDERS,05,DISEASES AND DISORDERS OF THE CIRCULATORY SYSTEM,1,Minor,Minor,Medical,Blue Cross/Blue Shield,Blue Cross/Blue Shield,,,,true,16147.99,4719.08
New York City,Manhattan,7002053,001463,NYU Langone Hospitals,30 to 49,OOS,M,Other Race,Not Span/Hispanic,1,Emergency,Home or Self Care,2019,CIR017,CARDIAC DYSRHYTHMIAS,,,201,CARDIAC ARRHYTHMIA & CONDUCTION DISORDERS,05,DISEASES AND DISORDERS OF THE CIRCULATORY SYSTEM,2,Moderate,Minor,Medical,Blue Cross/Blue Shield,,,,,true,38031.98,6345.83
New York City,Manhattan,7002053,001463,NYU Langone Hospitals,30 to 49,110,M,White,Not Span/Hispanic,1,Emergency,Home or Self Care,2019,CIR017,CARDIAC DYSRHYTHMIAS,,,201,CARDIAC ARRHYTHMIA & CONDUCTION DISORDERS,05,DISEASES AND DISORDERS OF THE CIRCULATORY SYSTEM,3,Major,Moderate,Medical,Private Health Insurance,,,,,true,22346.13,5622.01
New York City,Manhattan,7002053,001463,NYU Langone Hospitals,70 or Older,100,M,White,Not Span/Hispanic,3,Emergency,Hospice - Home,2019,CIR017,CARDIAC DYSRHYTHMIAS,ESA006,CARDIOVERSION,201,CARDIAC ARRHYTHMIA & CONDUCTION DISORDERS,05,DISEASES AND DISORDERS OF THE CIRCULATORY SYSTEM,3,Major,Major,Medical,Private Health Insurance,Medicare,,,,true,60578.69,14903.19
New York City,Manhattan,7002053,001463,NYU Langone Hospitals,30 to 49,100,M,White,Not Span/Hispanic,1,Emergency,Home or Self Care,2019,CIR017,CARDIAC DYSRHYTHMIAS,ESA006,CARDIOVERSION,201,CARDIAC ARRHYTHMIA & CONDUCTION DISORDERS,05,DISEASES AND DISORDERS OF THE CIRCULATORY SYSTEM,1,Minor,Minor,Medical,Private Health Insurance,,,,,true,26699,6322.04
New York City,Manhattan,7002053,001463,NYU Langone Hospitals,30 to 49,112,M,White,Not Span/Hispanic,2,Emergency,Home or Self Care,2019,CIR017,CARDIAC DYSRHYTHMIAS,ESA006,CARDIOVERSION,201,CARDIAC ARRHYTHMIA & CONDUCTION DISORDERS,05,DISEASES AND DISORDERS OF THE CIRCULATORY SYSTEM,1,Minor,Minor,Medical,Blue Cross/Blue Shield,,,,,true,38742.54,10276.61
New York City,Manhattan,7002053,001463,NYU Langone Hospitals,70 or Older,100,M,White,Not Span/Hispanic,2,Emergency,Home w/ Home Health Services,2019,CIR017,CARDIAC DYSRHYTHMIAS,,,201,CARDIAC ARRHYTHMIA & CONDUCTION DISORDERS,05,DISEASES AND DISORDERS OF THE CIRCULATORY SYSTEM,2,Moderate,Moderate,Medical,Medicare,Blue Cross/Blue Shield,,,,true,33164.76,9566.64
New York City,Manhattan,7002053,001463,NYU Langone Hospitals,70 or Older,113,F,Black/African American,Not Span/Hispanic,3,Urgent,Home or Self Care,2019,CIR017,CARDIAC DYSRHYTHMIAS,IMG008,ULTRASONOGRAPHY,201,CARDIAC ARRHYTHMIA & CONDUCTION DISORDERS,05,DISEASES AND DISORDERS OF THE CIRCULATORY SYSTEM,2,Moderate,Major,Medical,Medicare,,,,,false,61577.16,21491.34
New York City,Manhattan,7002053,001463,NYU Langone Hospitals,70 or Older,100,F,Other Race,Not Span/Hispanic,2,Emergency,Home or Self Care,2019,CIR017,CARDIAC DYSRHYTHMIAS,ESA006,CARDIOVERSION,201,CARDIAC ARRHYTHMIA & CONDUCTION DISORDERS,05,DISEASES AND DISORDERS OF THE CIRCULATORY SYSTEM,1,Minor,Minor,Medical,Medicare,Medicare,,,,true,59975.86,13514.27
New York City,Manhattan,7002053,001463,NYU Langone Hospitals,70 or Older,100,M,White,Not Span/Hispanic,4,Emergency,Home or Self Care,2019,CIR017,CARDIAC DYSRHYTHMIAS,ESA006,CARDIOVERSION,201,CARDIAC ARRHYTHMIA & CONDUCTION DISORDERS,05,DISEASES AND DISORDERS OF THE CIRCULATORY SYSTEM,4,Extreme,Extreme,Medical,Blue Cross/Blue Shield,Medicare,,,,true,68228.25,19417.36
New York City,Manhattan,7002053,001463,NYU Langone Hospitals,70 or Older,100,F,White,Not Span/Hispanic,1,Emergency,Home or Self Care,2019,CIR017,CARDIAC DYSRHYTHMIAS,,,201,CARDIAC ARRHYTHMIA & CONDUCTION DISORDERS,05,DISEASES AND DISORDERS OF THE CIRCULATORY SYSTEM,1,Minor,Minor,Medical,Medicare,Medicare,,,,true,17353.57,4880.27
New York City,Manhattan,7002053,001463,NYU Langone Hospitals,70 or Older,100,M,White,Not Span/Hispanic,1,Urgent,Left Against Medical Advice,2019,CIR017,CARDIAC DYSRHYTHMIAS,,,201,CARDIAC ARRHYTHMIA & CONDUCTION DISORDERS,05,DISEASES AND DISORDERS OF THE CIRCULATORY SYSTEM,3,Major,Major,Medical,Medicare,Blue Cross/Blue Shield,,,,false,8356.72,3574.49
New York City,Manhattan,7002053,001463,NYU Langone Hospitals,50 to 69,104,F,Black/African American,Not Span/Hispanic,4,Emergency,Home or Self Care,2019,CIR017,CARDIAC DYSRHYTHMIAS,,,201,CARDIAC ARRHYTHMIA & CONDUCTION DISORDERS,05,DISEASES AND DISORDERS OF THE CIRCULATORY SYSTEM,3,Major,Minor,Medical,Private Health Insurance,,,,,true,51222.15,15548.02
New York City,Manhattan,7002053,001463,NYU Langone Hospitals,50 to 69,109,M,Other Race,Not Span/Hispanic,1,Emergency,Home or Self Care,2019,CIR017,CARDIAC DYSRHYTHMIAS,,,201,CARDIAC ARRHYTHMIA & CONDUCTION DISORDERS,05,DISEASES AND DISORDERS OF THE CIRCULATORY SYSTEM,1,Minor,Minor,Medical,Blue Cross/Blue Shield,,,,,true,20720.23,5279.43
New York City,Manhattan,7002053,001463,NYU Langone Hospitals,70 or Older,113,M,White,Not Span/Hispanic,2,Emergency,Home w/ Home Health Services,2019,SYM012,CIRCULATORY SIGNS AND SYMPTOMS,MAM006,PACEMAKER AND DEFIBRILLATOR INTERROGATION,201,CARDIAC ARRHYTHMIA & CONDUCTION DISORDERS,05,DISEASES AND DISORDERS OF THE CIRCULATORY SYSTEM,3,Major,Major,Medical,Medicare,Medicaid,,,,true,30767.93,9065.75
New York City,Manhattan,7002053,001463,NYU Langone Hospitals,70 or Older,113,F,White,Not Span/Hispanic,3,Emergency,Home or Self Care,2019,CIR017,CARDIAC DYSRHYTHMIAS,,,201,CARDIAC ARRHYTHMIA & CONDUCTION DISORDERS,05,DISEASES AND DISORDERS OF THE CIRCULATORY SYSTEM,2,Moderate,Moderate,Medical,Medicaid,,,,,true,37183.95,11963.45
New York City,Manhattan,7002053,001463,NYU Langone Hospitals,70 or Older,104,F,Other Race,Spanish/Hispanic,1,Emergency,Home or Self Care,2019,CIR017,CARDIAC DYSRHYTHMIAS,,,201,CARDIAC ARRHYTHMIA & CONDUCTION DISORDERS,05,DISEASES AND DISORDERS OF THE CIRCULATORY SYSTEM,1,Minor,Minor,Medical,Medicare,Medicaid,,,,true,17407.3,4944.3
New York City,Manhattan,7002053,001463,NYU Langone Hospitals,70 or Older,112,M,White,Not Span/Hispanic,1,Emergency,Home or Self Care,2019,CIR017,CARDIAC DYSRHYTHMIAS,ESA006,CARDIOVERSION,201,CARDIAC ARRHYTHMIA & CONDUCTION DISORDERS,05,DISEASES AND DISORDERS OF THE CIRCULATORY SYSTEM,2,Moderate,Minor,Medical,Medicare,Medicaid,,,,true,38182.83,12073.7
New York City,Manhattan,7002053,001463,NYU Langone Hospitals,50 to 69,,M,Other Race,Not Span/Hispanic,1,Emergency,Home or Self Care,2019,CIR017,CARDIAC DYSRHYTHMIAS,,,201,CARDIAC ARRHYTHMIA & CONDUCTION DISORDERS,05,DISEASES AND DISORDERS OF THE CIRCULATORY SYSTEM,3,Major,Major,Medical,Private Health Insurance,,,,,true,20278.37,5402.45
New York City,Manhattan,7002053,001463,NYU Langone Hospitals,50 to 69,100,M,White,Not Span/Hispanic,1,Emergency,Left Against Medical Advice,2019,SYM012,CIRCULATORY SIGNS AND SYMPTOMS,,,201,CARDIAC ARRHYTHMIA & CONDUCTION DISORDERS,05,DISEASES AND DISORDERS OF THE CIRCULATORY SYSTEM,2,Moderate,Minor,Medical,Private Health Insurance,,,,,true,28354.34,8963.45
New York City,Manhattan,7002053,001463,NYU Langone Hospitals,70 or Older,113,F,White,Not Span/Hispanic,1,Emergency,Home or Self Care,2019,CIR017,CARDIAC DYSRHYTHMIAS,,,201,CARDIAC ARRHYTHMIA & CONDUCTION DISORDERS,05,DISEASES AND DISORDERS OF THE CIRCULATORY SYSTEM,1,Minor,Moderate,Medical,Medicare,Blue Cross/Blue Shield,,,,true,13596.49,4379.76
New York City,Manhattan,7002053,001463,NYU Langone Hospitals,70 or Older,100,M,White,Not Span/Hispanic,13,Elective,Skilled Nursing Home,2019,CIR017,CARDIAC DYSRHYTHMIAS,GIS006,PARACENTESIS,201,CARDIAC ARRHYTHMIA & CONDUCTION DISORDERS,05,DISEASES AND DISORDERS OF THE CIRCULATORY SYSTEM,4,Extreme,Extreme,Medical,Medicare,Medicare,,,,false,152742.54,48094.03
New York City,Manhattan,7002053,001463,NYU Langone Hospitals,30 to 49,113,M,Other Race,Unknown,1,Emergency,Home or Self Care,2019,CIR017,CARDIAC DYSRHYTHMIAS,,,201,CARDIAC ARRHYTHMIA & CONDUCTION DISORDERS,05,DISEASES AND DISORDERS OF THE CIRCULATORY SYSTEM,1,Minor,Minor,Medical,Medicaid,,,,,true,29451.3,6493.93
New York City,Manhattan,7002053,001463,NYU Langone Hospitals,50 to 69,112,F,White,Not Span/Hispanic,1,Emergency,Home or Self Care,2019,CIR017,CARDIAC DYSRHYTHMIAS,,,201,CARDIAC ARRHYTHMIA & CONDUCTION DISORDERS,05,DISEASES AND DISORDERS OF THE CIRCULATORY SYSTEM,2,Moderate,Minor,Medical,Private Health Insurance,,,,,true,15150.02,4753.41
New York City,Manhattan,7002053,001463,NYU Langone Hospitals,50 to 69,113,M,White,Not Span/Hispanic,1,Emergency,Home or Self Care,2019,CIR017,CARDIAC DYSRHYTHMIAS,,,201,CARDIAC ARRHYTHMIA & CONDUCTION DISORDERS,05,DISEASES AND DISORDERS OF THE CIRCULATORY SYSTEM,3,Major,Moderate,Medical,Blue Cross/Blue Shield,,,,,true,58133.62,18740.38
New York City,Manhattan,7002053,001463,NYU Langone Hospitals,50 to 69,107,M,White,Not Span/Hispanic,1,Emergency,Home or Self Care,2019,CIR017,CARDIAC DYSRHYTHMIAS,IMG008,ULTRASONOGRAPHY,201,CARDIAC ARRHYTHMIA & CONDUCTION DISORDERS,05,DISEASES AND DISORDERS OF THE CIRCULATORY SYSTEM,2,Moderate,Moderate,Medical,Private Health Insurance,,,,,true,19974.39,5295.14
New York City,Manhattan,7002053,001463,NYU Langone Hospitals,70 or Older,113,F,White,Not Span/Hispanic,1,Emergency,Home or Self Care,2019,CIR017,CARDIAC DYSRHYTHMIAS,ESA006,CARDIOVERSION,201,CARDIAC ARRHYTHMIA & CONDUCTION DISORDERS,05,DISEASES AND DISORDERS OF THE CIRCULATORY SYSTEM,2,Moderate,Minor,Medical,Medicare,Medicaid,,,,true,36941.36,8003.4
New York City,Manhattan,7002053,001463,NYU Langone Hospitals,50 to 69,103,M,White,Not Span/Hispanic,2,Elective,Home or Self Care,2019,CIR017,CARDIAC DYSRHYTHMIAS,ESA006,CARDIOVERSION,201,CARDIAC ARRHYTHMIA & CONDUCTION DISORDERS,05,DISEASES AND DISORDERS OF THE CIRCULATORY SYSTEM,2,Moderate,Minor,Medical,Medicare,Blue Cross/Blue Shield,,,,false,51099.1,12364.09
New York City,Manhattan,7002053,001463,NYU Langone Hospitals,30 to 49,112,M,White,Not Span/Hispanic,5,Emergency,Home or Self Care,2019,CIR017,CARDIAC DYSRHYTHMIAS,IMG008,ULTRASONOGRAPHY,201,CARDIAC ARRHYTHMIA & CONDUCTION DISORDERS,05,DISEASES AND DISORDERS OF THE CIRCULATORY SYSTEM,3,Major,Major,Medical,Private Health Insurance,,,,,true,71638.39,26487.5
New York City,Manhattan,7002053,001463,NYU Langone Hospitals,50 to 69,115,M,White,Not Span/Hispanic,4,Emergency,Home or Self Care,2019,CIR017,CARDIAC DYSRHYTHMIAS,,,201,CARDIAC ARRHYTHMIA & CONDUCTION DISORDERS,05,DISEASES AND DISORDERS OF THE CIRCULATORY SYSTEM,2,Moderate,Moderate,Medical,Medicare,Medicare,,,,true,62645.96,17328.49
New York City,Manhattan,7002053,001463,NYU Langone Hospitals,70 or Older,100,M,White,Not Span/Hispanic,2,Emergency,Home or Self Care,2019,CIR017,CARDIAC DYSRHYTHMIAS,,,201,CARDIAC ARRHYTHMIA & CONDUCTION DISORDERS,05,DISEASES AND DISORDERS OF THE CIRCULATORY SYSTEM,2,Moderate,Major,Medical,Medicare,Blue Cross/Blue Shield,,,,true,53263.69,12668.37
New York City,Manhattan,7002053,001463,NYU Langone Hospitals,50 to 69,100,M,White,Not Span/Hispanic,1,Emergency,Home or Self Care,2019,CIR017,CARDIAC DYSRHYTHMIAS,,,201,CARDIAC ARRHYTHMIA & CONDUCTION DISORDERS,05,DISEASES AND DISORDERS OF THE CIRCULATORY SYSTEM,2,Moderate,Moderate,Medical,Blue Cross/Blue Shield,,,,,true,15137.69,4588.65
New York City,Manhattan,7002053,001463,NYU Langone Hospitals,70 or Older,100,F,White,Not Span/Hispanic,3,Emergency,Skilled Nursing Home,2019,CIR017,CARDIAC DYSRHYTHMIAS,,,201,CARDIAC ARRHYTHMIA & CONDUCTION DISORDERS,05,DISEASES AND DISORDERS OF THE CIRCULATORY SYSTEM,1,Minor,Minor,Medical,Medicare,Blue Cross/Blue Shield,,,,true,48718.05,17881.2
New York City,Manhattan,7002053,001463,NYU Langone Hospitals,70 or Older,100,F,White,Not Span/Hispanic,4,Emergency,Home or Self Care,2019,CIR017,CARDIAC DYSRHYTHMIAS,,,201,CARDIAC ARRHYTHMIA & CONDUCTION DISORDERS,05,DISEASES AND DISORDERS OF THE CIRCULATORY SYSTEM,2,Moderate,Moderate,Medical,Medicare,Blue Cross/Blue Shield,,,,true,80373.67,21329.74
New York City,Manhattan,7002053,001463,NYU Langone Hospitals,70 or Older,100,F,White,Not Span/Hispanic,1,Emergency,Home or Self Care,2019,CIR017,CARDIAC DYSRHYTHMIAS,,,201,CARDIAC ARRHYTHMIA & CONDUCTION DISORDERS,05,DISEASES AND DISORDERS OF THE CIRCULATORY SYSTEM,3,Major,Moderate,Medical,Medicare,Medicare,,,,true,15251.57,4556.94
New York City,Manhattan,7002053,001463,NYU Langone Hospitals,18 to 29,112,F,Black/African American,Not Span/Hispanic,2,Emergency,Home or Self Care,2019,CIR017,CARDIAC DYSRHYTHMIAS,,,201,CARDIAC ARRHYTHMIA & CONDUCTION DISORDERS,05,DISEASES AND DISORDERS OF THE CIRCULATORY SYSTEM,2,Moderate,Minor,Medical,Blue Cross/Blue Shield,,,,,true,37522.43,9063.81
New York City,Manhattan,7002053,001463,NYU Langone Hospitals,50 to 69,116,F,Other Race,Not Span/Hispanic,1,Emergency,Home or Self Care,2019,CIR017,CARDIAC DYSRHYTHMIAS,,,201,CARDIAC ARRHYTHMIA & CONDUCTION DISORDERS,05,DISEASES AND DISORDERS OF THE CIRCULATORY SYSTEM,2,Moderate,Moderate,Medical,Medicaid,,,,,true,28013.14,8333.96
New York City,Manhattan,7002053,001463,NYU Langone Hospitals,50 to 69,100,F,White,Not Span/Hispanic,5,Emergency,Home or Self Care,2019,CIR017,CARDIAC DYSRHYTHMIAS,MST028,"SUBCUTANEOUS TISSUE AND FASCIA PROCEDURES, NEC",201,CARDIAC ARRHYTHMIA & CONDUCTION DISORDERS,05,DISEASES AND DISORDERS OF THE CIRCULATORY SYSTEM,2,Moderate,Moderate,Medical,Medicare,Medicare,,,,true,159331.62,33455.18
New York City,Manhattan,7002053,001463,NYU Langone Hospitals,70 or Older,112,M,White,Not Span/Hispanic,1,Emergency,Home or Self Care,2019,CIR017,CARDIAC DYSRHYTHMIAS,,,201,CARDIAC ARRHYTHMIA & CONDUCTION DISORDERS,05,DISEASES AND DISORDERS OF THE CIRCULATORY SYSTEM,2,Moderate,Moderate,Medical,Private Health Insurance,Medicare,,,,true,43842.15,12411.65
New York City,Manhattan,7002053,001463,NYU Langone Hospitals,70 or Older,100,F,White,Not Span/Hispanic,1,Emergency,Home or Self Care,2019,CIR017,CARDIAC DYSRHYTHMIAS,,,201,CARDIAC ARRHYTHMIA & CONDUCTION DISORDERS,05,DISEASES AND DISORDERS OF THE CIRCULATORY SYSTEM,1,Minor,Minor,Medical,Medicare,Private Health Insurance,,,,true,30733.28,9810.11
New York City,Manhattan,7002053,001463,NYU Langone Hospitals,30 to 49,OOS,F,Black/African American,Not Span/Hispanic,1,Emergency,Home or Self Care,2019,SYM012,CIRCULATORY SIGNS AND SYMPTOMS,,,201,CARDIAC ARRHYTHMIA & CONDUCTION DISORDERS,05,DISEASES AND DISORDERS OF THE CIRCULATORY SYSTEM,1,Minor,Minor,Medical,Private Health Insurance,,,,,true,26411.35,8798.31
New York City,Manhattan,7002053,001463,NYU Langone Hospitals,50 to 69,113,F,Other Race,Not Span/Hispanic,3,Elective,Home w/ Home Health Services,2019,CIR017,CARDIAC DYSRHYTHMIAS,MAM006,PACEMAKER AND DEFIBRILLATOR INTERROGATION,201,CARDIAC ARRHYTHMIA & CONDUCTION DISORDERS,05,DISEASES AND DISORDERS OF THE CIRCULATORY SYSTEM,3,Major,Major,Medical,Medicaid,,,,,false,58601.6,14836.58
New York City,Manhattan,7002053,001463,NYU Langone Hospitals,50 to 69,107,F,White,Not Span/Hispanic,1,Emergency,Home or Self Care,2019,CIR017,CARDIAC DYSRHYTHMIAS,,,201,CARDIAC ARRHYTHMIA & CONDUCTION DISORDERS,05,DISEASES AND DISORDERS OF THE CIRCULATORY SYSTEM,1,Minor,Minor,Medical,Blue Cross/Blue Shield,,,,,true,18177.43,4993.74
New York City,Manhattan,7002053,001463,NYU Langone Hospitals,70 or Older,100,M,White,Not Span/Hispanic,4,Emergency,Home or Self Care,2019,CIR017,CARDIAC DYSRHYTHMIAS,ESA006,CARDIOVERSION,201,CARDIAC ARRHYTHMIA & CONDUCTION DISORDERS,05,DISEASES AND DISORDERS OF THE CIRCULATORY SYSTEM,3,Major,Major,Medical,Medicare,Medicare,,,,true,74039.57,24047.77
New York City,Manhattan,7002053,001463,NYU Langone Hospitals,70 or Older,OOS,M,White,Not Span/Hispanic,6,Emergency,Home w/ Home Health Services,2019,CIR017,CARDIAC DYSRHYTHMIAS,ESA006,CARDIOVERSION,201,CARDIAC ARRHYTHMIA & CONDUCTION DISORDERS,05,DISEASES AND DISORDERS OF THE CIRCULATORY SYSTEM,3,Major,Major,Medical,Medicare,Medicare,,,,false,69302.84,23378.8
New York City,Manhattan,7002053,001463,NYU Langone Hospitals,70 or Older,OOS,M,Black/African American,Not Span/Hispanic,1,Emergency,Home or Self Care,2019,SYM012,CIRCULATORY SIGNS AND SYMPTOMS,ESA001,HEMODIALYSIS,201,CARDIAC ARRHYTHMIA & CONDUCTION DISORDERS,05,DISEASES AND DISORDERS OF THE CIRCULATORY SYSTEM,3,Major,Major,Medical,Medicare,Blue Cross/Blue Shield,,,,true,54918.39,16430.64
New York City,Manhattan,7002053,001463,NYU Langone Hospitals,50 to 69,OOS,F,White,Not Span/Hispanic,1,Emergency,Home or Self Care,2019,CIR017,CARDIAC DYSRHYTHMIAS,,,201,CARDIAC ARRHYTHMIA & CONDUCTION DISORDERS,05,DISEASES AND DISORDERS OF THE CIRCULATORY SYSTEM,3,Major,Major,Medical,Private Health Insurance,,,,,true,37513.23,11801.6
New York City,Manhattan,7002053,001463,NYU Langone Hospitals,50 to 69,116,F,White,Not Span/Hispanic,1,Emergency,Home or Self Care,2019,CIR017,CARDIAC DYSRHYTHMIAS,,,201,CARDIAC ARRHYTHMIA & CONDUCTION DISORDERS,05,DISEASES AND DISORDERS OF THE CIRCULATORY SYSTEM,1,Minor,Moderate,Medical,Blue Cross/Blue Shield,Medicare,,,,true,14314.01,4499.82
New York City,Manhattan,7002053,001463,NYU Langone Hospitals,70 or Older,112,M,White,Not Span/Hispanic,8,Emergency,Home w/ Home Health Services,2019,CIR017,CARDIAC DYSRHYTHMIAS,ESA006,CARDIOVERSION,201,CARDIAC ARRHYTHMIA & CONDUCTION DISORDERS,05,DISEASES AND DISORDERS OF THE CIRCULATORY SYSTEM,3,Major,Major,Medical,Medicare,Blue Cross/Blue Shield,,,,true,98193.77,32916.93
New York City,Manhattan,7002053,001463,NYU Langone Hospitals,50 to 69,OOS,F,Black/African American,Not Span/Hispanic,1,Emergency,Home or Self Care,2019,CIR017,CARDIAC DYSRHYTHMIAS,ESA001,HEMODIALYSIS,201,CARDIAC ARRHYTHMIA & CONDUCTION DISORDERS,05,DISEASES AND DISORDERS OF THE CIRCULATORY SYSTEM,2,Moderate,Minor,Medical,Medicare,Blue Cross/Blue Shield,,,,true,20792.86,6521.45
New York City,Manhattan,7002053,001463,NYU Langone Hospitals,70 or Older,103,M,White,Not Span/Hispanic,1,Elective,Home or Self Care,2019,CIR017,CARDIAC DYSRHYTHMIAS,IMG008,ULTRASONOGRAPHY,201,CARDIAC ARRHYTHMIA & CONDUCTION DISORDERS,05,DISEASES AND DISORDERS OF THE CIRCULATORY SYSTEM,2,Moderate,Moderate,Medical,Medicaid,,,,,false,9539.75,3771.86
New York City,Manhattan,7002053,001463,NYU Langone Hospitals,30 to 49,112,M,White,Not Span/Hispanic,1,Emergency,Home or Self Care,2019,CIR017,CARDIAC DYSRHYTHMIAS,,,201,CARDIAC ARRHYTHMIA & CONDUCTION DISORDERS,05,DISEASES AND DISORDERS OF THE CIRCULATORY SYSTEM,1,Minor,Minor,Medical,Medicaid,,,,,true,24887.17,8059.91
New York City,Manhattan,7002053,001463,NYU Langone Hospitals,70 or Older,100,M,White,Not Span/Hispanic,1,Emergency,Left Against Medical Advice,2019,CIR017,CARDIAC DYSRHYTHMIAS,,,201,CARDIAC ARRHYTHMIA & CONDUCTION DISORDERS,05,DISEASES AND DISORDERS OF THE CIRCULATORY SYSTEM,4,Extreme,Major,Medical,Medicare,Blue Cross/Blue Shield,,,,true,22783.9,5679.51
New York City,Manhattan,7002053,001463,NYU Langone Hospitals,70 or Older,112,M,White,Not Span/Hispanic,1,Emergency,Home w/ Home Health Services,2019,CIR017,CARDIAC DYSRHYTHMIAS,,,201,CARDIAC ARRHYTHMIA & CONDUCTION DISORDERS,05,DISEASES AND DISORDERS OF THE CIRCULATORY SYSTEM,2,Moderate,Moderate,Medical,Medicare,Private Health Insurance,,,,true,40252.31,12702.59
New York City,Manhattan,7002053,001463,NYU Langone Hospitals,70 or Older,100,F,White,Not Span/Hispanic,4,Emergency,Home or Self Care,2019,CIR017,CARDIAC DYSRHYTHMIAS,,,201,CARDIAC ARRHYTHMIA & CONDUCTION DISORDERS,05,DISEASES AND DISORDERS OF THE CIRCULATORY SYSTEM,3,Major,Major,Medical,Medicaid,,,,,true,51623.61,16492.46
New York City,Manhattan,7002053,001463,NYU Langone Hospitals,70 or Older,100,M,Black/African American,Not Span/Hispanic,1,Emergency,Home or Self Care,2019,CIR016,CONDUCTION DISORDERS,,,201,CARDIAC ARRHYTHMIA & CONDUCTION DISORDERS,05,DISEASES AND DISORDERS OF THE CIRCULATORY SYSTEM,2,Moderate,Moderate,Medical,Medicaid,,,,,true,25005.98,5630.41
New York City,Manhattan,7002053,001463,NYU Langone Hospitals,50 to 69,100,F,White,Not Span/Hispanic,1,Emergency,Home or Self Care,2019,CIR017,CARDIAC DYSRHYTHMIAS,,,201,CARDIAC ARRHYTHMIA & CONDUCTION DISORDERS,05,DISEASES AND DISORDERS OF THE CIRCULATORY SYSTEM,1,Minor,Minor,Medical,Private Health Insurance,,,,,true,11746.95,4041.06
New York City,Manhattan,7002053,001463,NYU Langone Hospitals,50 to 69,100,M,White,Not Span/Hispanic,1,Emergency,Home or Self Care,2019,CIR017,CARDIAC DYSRHYTHMIAS,ESA006,CARDIOVERSION,201,CARDIAC ARRHYTHMIA & CONDUCTION DISORDERS,05,DISEASES AND DISORDERS OF THE CIRCULATORY SYSTEM,1,Minor,Minor,Medical,Private Health Insurance,,,,,true,28552.56,6487.9
New York City,Manhattan,7002053,001463,NYU Langone Hospitals,18 to 29,112,F,White,Not Span/Hispanic,1,Emergency,Home or Self Care,2019,SYM012,CIRCULATORY SIGNS AND SYMPTOMS,,,201,CARDIAC ARRHYTHMIA & CONDUCTION DISORDERS,05,DISEASES AND DISORDERS OF THE CIRCULATORY SYSTEM,1,Minor,Minor,Medical,Medicaid,,,,,true,23288.01,7423.38
New York City,Manhattan,7002053,001463,NYU Langone Hospitals,70 or Older,100,M,White,Not Span/Hispanic,13,Emergency,Home w/ Home Health Services,2019,CIR017,CARDIAC DYSRHYTHMIAS,ESA006,CARDIOVERSION,201,CARDIAC ARRHYTHMIA & CONDUCTION DISORDERS,05,DISEASES AND DISORDERS OF THE CIRCULATORY SYSTEM,4,Extreme,Extreme,Medical,Medicare,Medicare,,,,true,139305.95,48364.23
New York City,Manhattan,7002053,001463,NYU Langone Hospitals,50 to 69,111,M,White,Not Span/Hispanic,5,Emergency,Home or Self Care,2019,CIR017,CARDIAC DYSRHYTHMIAS,,,201,CARDIAC ARRHYTHMIA & CONDUCTION DISORDERS,05,DISEASES AND DISORDERS OF THE CIRCULATORY SYSTEM,2,Moderate,Moderate,Medical,Medicaid,,,,,true,47491.74,18281.09
New York City,Manhattan,7002053,001463,NYU Langone Hospitals,70 or Older,100,F,White,Not Span/Hispanic,7,Emergency,Skilled Nursing Home,2019,CIR017,CARDIAC DYSRHYTHMIAS,,,201,CARDIAC ARRHYTHMIA & CONDUCTION DISORDERS,05,DISEASES AND DISORDERS OF THE CIRCULATORY SYSTEM,4,Extreme,Extreme,Medical,Medicare,,,,,false,66350.12,24205.97