Hospital Service Area,Hospital County,Operating Certificate Number,Permanent Facility Id,Facility Name,Age Group,Zip Code - 3 digits,Gender,Race,Ethnicity,Length of Stay,Type of Admission,Patient Disposition,Discharge Year,CCS Diagnosis Code,CCS Diagnosis Description,CCS Procedure Code,CCS Procedure Description,APR DRG Code,APR DRG Description,APR MDC Code,APR MDC Description,APR Severity of Illness Code,APR Severity of Illness Description,APR Risk of Mortality,APR Medical Surgical Description,Payment Typology 1,Payment Typology 2,Payment Typology 3,Birth Weight,Abortion Edit Indicator,Emergency Department Indicator,Total Charges,Total Costs
Long Island,Nassau,2908000,000511,NYU Langone Hospital-Long Island,70 or Older,115,M,White,Not Span/Hispanic,5,Emergency,Skilled Nursing Home,2020,CIR017,CARDIAC DYSRHYTHMIAS,ESA006,CARDIOVERSION,201,CARDIAC ARRHYTHMIA & CONDUCTION DISORDERS,05,DISEASES AND DISORDERS OF THE CIRCULATORY SYSTEM,2,Moderate,Major,Medical,Medicare,Medicare,,,,Y,97902.77,34359.28
Long Island,Nassau,2908000,000511,NYU Langone Hospital-Long Island,50 to 69,115,F,Other Race,Spanish/Hispanic,5,Emergency,Home or Self Care,2020,CIR017,CARDIAC DYSRHYTHMIAS,,,201,CARDIAC ARRHYTHMIA & CONDUCTION DISORDERS,05,DISEASES AND DISORDERS OF THE CIRCULATORY SYSTEM,2,Moderate,Major,Medical,Private Health Insurance,,,,,Y,52211.22,17596.11
Long Island,Nassau,2908000,000511,NYU Langone Hospital-Long Island,70 or Older,110,M,White,Not Span/Hispanic,5,Emergency,Home or Self Care,2020,CIR017,CARDIAC DYSRHYTHMIAS,,,201,CARDIAC ARRHYTHMIA & CONDUCTION DISORDERS,05,DISEASES AND DISORDERS OF THE CIRCULATORY SYSTEM,2,Moderate,Moderate,Medical,Medicare,Medicare,,,,Y,99977.54,23730.25
Long Island,Nassau,2908000,000511,NYU Langone Hospital-Long Island,50 to 69,115,F,White,Not Span/Hispanic,3,Emergency,Home or Self Care,2020,CIR017,CARDIAC DYSRHYTHMIAS,,,201,CARDIAC ARRHYTHMIA & CONDUCTION DISORDERS,05,DISEASES AND DISORDERS OF THE CIRCULATORY SYSTEM,2,Moderate,Major,Medical,Blue Cross/Blue Shield,,,,,Y,44801.35,12252.4
Long Island,Nassau,2908000,000511,NYU Langone Hospital-Long Island,70 or Older,117,F,White,Not Span/Hispanic,4,Trauma,Home or Self Care,2020,SYM012,CIRCULATORY SIGNS AND SYMPTOMS,,,201,CARDIAC ARRHYTHMIA & CONDUCTION DISORDERS,05,DISEASES AND DISORDERS OF THE CIRCULATORY SYSTEM,2,Moderate,Moderate,Medical,Medicare,Medicare,,,,Y,53246.82,15513.99
Long Island,Nassau,2908000,000511,NYU Langone Hospital-Long Island,70 or Older,115,F,Black/African American,Not Span/Hispanic,3,Emergency,Skilled Nursing Home,2020,CIR017,CARDIAC DYSRHYTHMIAS,,,201,CARDIAC ARRHYTHMIA & CONDUCTION DISORDERS,05,DISEASES AND DISORDERS OF THE CIRCULATORY SYSTEM,2,Moderate,Moderate,Medical,Medicare,Medicaid,,,,Y,33351.72,11155.05
Long Island,Nassau,2908000,000511,NYU Langone Hospital-Long Island,18 to 29,115,M,Other Race,Not Span/Hispanic,1,Emergency,Home or Self Care,2020,CIR017,CARDIAC DYSRHYTHMIAS,,,201,CARDIAC ARRHYTHMIA & CONDUCTION DISORDERS,05,DISEASES AND DISORDERS OF THE CIRCULATORY SYSTEM,1,Minor,Minor,Medical,Medicaid,,,,,Y,16756.58,4445.2
Long Island,Nassau,2908000,000511,NYU Langone Hospital-Long Island,70 or Older,118,F,White,Not Span/Hispanic,1,Emergency,Home or Self Care,2020,CIR017,CARDIAC DYSRHYTHMIAS,,,201,CARDIAC ARRHYTHMIA & CONDUCTION DISORDERS,05,DISEASES AND DISORDERS OF THE CIRCULATORY SYSTEM,2,Moderate,Moderate,Medical,Medicare,Private Health Insurance,,,,Y,48303.91,12770.29
Long Island,Nassau,2908000,000511,NYU Langone Hospital-Long Island,70 or Older,110,F,White,Not Span/Hispanic,3,Emergency,Skilled Nursing Home,2020,SYM012,CIRCULATORY SIGNS AND SYMPTOMS,,,201,CARDIAC ARRHYTHMIA & CONDUCTION DISORDERS,05,DISEASES AND DISORDERS OF THE CIRCULATORY SYSTEM,2,Moderate,Moderate,Medical,Medicare,Medicare,,,,Y,36890.5,11188.52
Long Island,Nassau,2908000,000511,NYU Langone Hospital-Long Island,50 to 69,115,M,White,Not Span/Hispanic,1,Emergency,Home or Self Care,2020,CIR017,CARDIAC DYSRHYTHMIAS,,,201,CARDIAC ARRHYTHMIA & CONDUCTION DISORDERS,05,DISEASES AND DISORDERS OF THE CIRCULATORY SYSTEM,1,Minor,Minor,Medical,Private Health Insurance,,,,,Y,27936.06,7302.48
Long Island,Nassau,2908000,000511,NYU Langone Hospital-Long Island,70 or Older,115,M,White,Not Span/Hispanic,5,Emergency,Home or Self Care,2020,SYM012,CIRCULATORY SIGNS AND SYMPTOMS,,,201,CARDIAC ARRHYTHMIA & CONDUCTION DISORDERS,05,DISEASES AND DISORDERS OF THE CIRCULATORY SYSTEM,2,Moderate,Moderate,Medical,Medicare,Medicare,,,,Y,69904.68,20330.43
Long Island,Nassau,2908000,000511,NYU Langone Hospital-Long Island,70 or Older,117,M,White,Not Span/Hispanic,1,Emergency,Home or Self Care,2020,CIR017,CARDIAC DYSRHYTHMIAS,,,201,CARDIAC ARRHYTHMIA & CONDUCTION DISORDERS,05,DISEASES AND DISORDERS OF THE CIRCULATORY SYSTEM,2,Moderate,Moderate,Medical,Medicare,Private Health Insurance,,,,Y,45896.37,11785.94
Long Island,Nassau,2908000,000511,NYU Langone Hospital-Long Island,70 or Older,115,M,White,Spanish/Hispanic,5,Emergency,Home w/ Home Health Services,2020,CIR017,CARDIAC DYSRHYTHMIAS,,,201,CARDIAC ARRHYTHMIA & CONDUCTION DISORDERS,05,DISEASES AND DISORDERS OF THE CIRCULATORY SYSTEM,2,Moderate,Major,Medical,Medicare,Medicare,,,,Y,52517.05,18177.15
Long Island,Nassau,2908000,000511,NYU Langone Hospital-Long Island,50 to 69,115,M,White,Not Span/Hispanic,2,Emergency,Home or Self Care,2020,CIR017,CARDIAC DYSRHYTHMIAS,,,201,CARDIAC ARRHYTHMIA & CONDUCTION DISORDERS,05,DISEASES AND DISORDERS OF THE CIRCULATORY SYSTEM,3,Major,Major,Medical,Blue Cross/Blue Shield,,,,,Y,28765.15,7784.64
Long Island,Nassau,2908000,000511,NYU Langone Hospital-Long Island,70 or Older,117,M,White,Not Span/Hispanic,3,Emergency,Home or Self Care,2020,CIR017,CARDIAC DYSRHYTHMIAS,ESA006,CARDIOVERSION,201,CARDIAC ARRHYTHMIA & CONDUCTION DISORDERS,05,DISEASES AND DISORDERS OF THE CIRCULATORY SYSTEM,2,Moderate,Moderate,Medical,Medicare,Medicaid,,,,Y,51334.42,13332.44
Long Island,Nassau,2908000,000511,NYU Langone Hospital-Long Island,18 to 29,115,M,Other Race,Spanish/Hispanic,4,Emergency,Home or Self Care,2020,SYM012,CIRCULATORY SIGNS AND SYMPTOMS,,,201,CARDIAC ARRHYTHMIA & CONDUCTION DISORDERS,05,DISEASES AND DISORDERS OF THE CIRCULATORY SYSTEM,1,Minor,Moderate,Medical,Medicaid,,,,,Y,47571.44,16427.87
Long Island,Nassau,2908000,000511,NYU Langone Hospital-Long Island,70 or Older,115,M,White,Not Span/Hispanic,3,Emergency,Skilled Nursing Home,2020,CIR017,CARDIAC DYSRHYTHMIAS,SKB006,SKIN LACERATION REPAIR (EXCLUDING PERINEUM),201,CARDIAC ARRHYTHMIA & CONDUCTION DISORDERS,05,DISEASES AND DISORDERS OF THE CIRCULATORY SYSTEM,1,Minor,Moderate,Medical,Medicare,,,,,Y,42959.9,13840.68
Long Island,Nassau,2908000,000511,NYU Langone Hospital-Long Island,70 or Older,117,M,White,Not Span/Hispanic,3,Elective,Home or Self Care,2020,CIR017,CARDIAC DYSRHYTHMIAS,GIS002,COLONOSCOPY AND PROCTOSCOPY WITH BIOPSY,201,CARDIAC ARRHYTHMIA & CONDUCTION DISORDERS,05,DISEASES AND DISORDERS OF THE CIRCULATORY SYSTEM,2,Moderate,Moderate,Medical,Medicare,Private Health Insurance,,,,N,165777.94,28436.82
Long Island,Nassau,2908000,000511,NYU Langone Hospital-Long Island,70 or Older,115,F,Black/African American,Not Span/Hispanic,1,Emergency,Home or Self Care,2020,CIR017,CARDIAC DYSRHYTHMIAS,,,201,CARDIAC ARRHYTHMIA & CONDUCTION DISORDERS,05,DISEASES AND DISORDERS OF THE CIRCULATORY SYSTEM,2,Moderate,Moderate,Medical,Medicare,Blue Cross/Blue Shield,,,,Y,36678.38,10182.07
Long Island,Nassau,2908000,000511,NYU Langone Hospital-Long Island,70 or Older,115,F,White,Not Span/Hispanic,6,Emergency,Skilled Nursing Home,2020,CIR017,CARDIAC DYSRHYTHMIAS,ESA006,CARDIOVERSION,201,CARDIAC ARRHYTHMIA & CONDUCTION DISORDERS,05,DISEASES AND DISORDERS OF THE CIRCULATORY SYSTEM,3,Major,Major,Medical,Medicare,Medicare,,,,Y,76657.56,22240.53
Long Island,Nassau,2908000,000511,NYU Langone Hospital-Long Island,70 or Older,110,M,White,Not Span/Hispanic,6,Emergency,Skilled Nursing Home,2020,CIR017,CARDIAC DYSRHYTHMIAS,,,201,CARDIAC ARRHYTHMIA & CONDUCTION DISORDERS,05,DISEASES AND DISORDERS OF THE CIRCULATORY SYSTEM,3,Major,Major,Medical,Medicare,Blue Cross/Blue Shield,,,,Y,82350.71,26253.79
Long Island,Nassau,2908000,000511,NYU Langone Hospital-Long Island,70 or Older,110,F,White,Not Span/Hispanic,4,Emergency,Home or Self Care,2020,CIR017,CARDIAC DYSRHYTHMIAS,IMG008,ULTRASONOGRAPHY,201,CARDIAC ARRHYTHMIA & CONDUCTION DISORDERS,05,DISEASES AND DISORDERS OF THE CIRCULATORY SYSTEM,2,Moderate,Moderate,Medical,Blue Cross/Blue Shield,Medicare,,,,Y,56922.81,16477.99
Long Island,Nassau,2908000,000511,NYU Langone Hospital-Long Island,50 to 69,115,M,White,Not Span/Hispanic,3,Emergency,Home or Self Care,2020,CIR017,CARDIAC DYSRHYTHMIAS,MST001,ARTHROCENTESIS,201,CARDIAC ARRHYTHMIA & CONDUCTION DISORDERS,05,DISEASES AND DISORDERS OF THE CIRCULATORY SYSTEM,1,Minor,Minor,Medical,Medicare,Blue Cross/Blue Shield,,,,Y,37047.53,11543.52
Long Island,Nassau,2908000,000511,NYU Langone Hospital-Long Island,70 or Older,115,M,White,Not Span/Hispanic,2,Emergency,Home or Self Care,2020,CIR017,CARDIAC DYSRHYTHMIAS,,,201,CARDIAC ARRHYTHMIA & CONDUCTION DISORDERS,05,DISEASES AND DISORDERS OF THE CIRCULATORY SYSTEM,2,Moderate,Moderate,Medical,Medicare,Medicare,,,,Y,36723.71,9917.46
Long Island,Nassau,2908000,000511,NYU Langone Hospital-Long Island,50 to 69,115,F,White,Not Span/Hispanic,3,Emergency,Home or Self Care,2020,CIR017,CARDIAC DYSRHYTHMIAS,,,201,CARDIAC ARRHYTHMIA & CONDUCTION DISORDERS,05,DISEASES AND DISORDERS OF THE CIRCULATORY SYSTEM,3,Major,Major,Medical,Medicaid,,,,,Y,35603.73,11475.69
Long Island,Nassau,2908000,000511,NYU Langone Hospital-Long Island,30 to 49,115,F,White,Not Span/Hispanic,1,Emergency,Home or Self Care,2020,CIR017,CARDIAC DYSRHYTHMIAS,,,201,CARDIAC ARRHYTHMIA & CONDUCTION DISORDERS,05,DISEASES AND DISORDERS OF THE CIRCULATORY SYSTEM,2,Moderate,Minor,Medical,Medicare,,,,,Y,20647.64,4909.76
Long Island,Nassau,2908000,000511,NYU Langone Hospital-Long Island,50 to 69,115,F,White,Not Span/Hispanic,2,Emergency,Home or Self Care,2020,CIR017,CARDIAC DYSRHYTHMIAS,ESA006,CARDIOVERSION,201,CARDIAC ARRHYTHMIA & CONDUCTION DISORDERS,05,DISEASES AND DISORDERS OF THE CIRCULATORY SYSTEM,2,Moderate,Minor,Medical,Private Health Insurance,,,,,Y,29223.43,8273.29
Long Island,Nassau,2908000,000511,NYU Langone Hospital-Long Island,18 to 29,114,M,White,Not Span/Hispanic,1,Emergency,Home or Self Care,2020,CIR017,CARDIAC DYSRHYTHMIAS,OTR004,ISOLATION PROCEDURES,201,CARDIAC ARRHYTHMIA & CONDUCTION DISORDERS,05,DISEASES AND DISORDERS OF THE CIRCULATORY SYSTEM,1,Minor,Minor,Medical,Blue Cross/Blue Shield,,,,,Y,17703.42,4452.54
Long Island,Nassau,2908000,000511,NYU Langone Hospital-Long Island,50 to 69,117,M,White,Not Span/Hispanic,1,Emergency,Home or Self Care,2020,CIR017,CARDIAC DYSRHYTHMIAS,,,201,CARDIAC ARRHYTHMIA & CONDUCTION DISORDERS,05,DISEASES AND DISORDERS OF THE CIRCULATORY SYSTEM,1,Minor,Minor,Medical,Blue Cross/Blue Shield,,,,,Y,18241.23,4632.43
Long Island,Nassau,2908000,000511,NYU Langone Hospital-Long Island,50 to 69,110,M,White,Not Span/Hispanic,2,Emergency,Home or Self Care,2020,CIR017,CARDIAC DYSRHYTHMIAS,,,201,CARDIAC ARRHYTHMIA & CONDUCTION DISORDERS,05,DISEASES AND DISORDERS OF THE CIRCULATORY SYSTEM,1,Minor,Moderate,Medical,Blue Cross/Blue Shield,,,,,Y,32993.11,8793.54
Long Island,Nassau,2908000,000511,NYU Langone Hospital-Long Island,50 to 69,115,M,White,Not Span/Hispanic,1,Emergency,Home or Self Care,2020,CIR017,CARDIAC DYSRHYTHMIAS,,,201,CARDIAC ARRHYTHMIA & CONDUCTION DISORDERS,05,DISEASES AND DISORDERS OF THE CIRCULATORY SYSTEM,2,Moderate,Minor,Medical,Blue Cross/Blue Shield,,,,,Y,20232.9,4949.36
Long Island,Nassau,2908000,000511,NYU Langone Hospital-Long Island,50 to 69,117,M,White,Not Span/Hispanic,2,Emergency,Home or Self Care,2020,CIR017,CARDIAC DYSRHYTHMIAS,,,201,CARDIAC ARRHYTHMIA & CONDUCTION DISORDERS,05,DISEASES AND DISORDERS OF THE CIRCULATORY SYSTEM,2,Moderate,Minor,Medical,Blue Cross/Blue Shield,,,,,Y,21565.55,7325.41
Long Island,Nassau,2908000,000511,NYU Langone Hospital-Long Island,70 or Older,115,F,White,Not Span/Hispanic,6,Emergency,Expired,2020,CIR017,CARDIAC DYSRHYTHMIAS,,,201,CARDIAC ARRHYTHMIA & CONDUCTION DISORDERS,05,DISEASES AND DISORDERS OF THE CIRCULATORY SYSTEM,4,Extreme,Major,Medical,Medicare,Medicare,,,,Y,106871.27,38591.79
Long Island,Nassau,2908000,000511,NYU Langone Hospital-Long Island,50 to 69,117,F,Other Race,Not Span/Hispanic,3,Emergency,Home or Self Care,2020,CIR017,CARDIAC DYSRHYTHMIAS,,,201,CARDIAC ARRHYTHMIA & CONDUCTION DISORDERS,05,DISEASES AND DISORDERS OF THE CIRCULATORY SYSTEM,1,Minor,Minor,Medical,Blue Cross/Blue Shield,,,,,Y,38466.5,11619.65
Long Island,Nassau,2908000,000511,NYU Langone Hospital-Long Island,70 or Older,117,M,White,Not Span/Hispanic,2,Emergency,Home w/ Home Health Services,2020,CIR017,CARDIAC DYSRHYTHMIAS,,,201,CARDIAC ARRHYTHMIA & CONDUCTION DISORDERS,05,DISEASES AND DISORDERS OF THE CIRCULATORY SYSTEM,4,Extreme,Major,Medical,Medicare,Blue Cross/Blue Shield,,,,Y,36377.17,9193.98
Long Island,Nassau,2908000,000511,NYU Langone Hospital-Long Island,50 to 69,110,M,White,Not Span/Hispanic,1,Emergency,Left Against Medical Advice,2020,CIR016,CONDUCTION DISORDERS,,,201,CARDIAC ARRHYTHMIA & CONDUCTION DISORDERS,05,DISEASES AND DISORDERS OF THE CIRCULATORY SYSTEM,3,Major,Major,Medical,Medicare,,,,,Y,30935.55,5957.42
Long Island,Nassau,2908000,000511,NYU Langone Hospital-Long Island,50 to 69,118,F,Other Race,Spanish/Hispanic,1,Emergency,Home or Self Care,2020,SYM012,CIRCULATORY SIGNS AND SYMPTOMS,,,201,CARDIAC ARRHYTHMIA & CONDUCTION DISORDERS,05,DISEASES AND DISORDERS OF THE CIRCULATORY SYSTEM,2,Moderate,Moderate,Medical,Private Health Insurance,,,,,Y,24754.55,5473.35
Long Island,Nassau,2908000,000511,NYU Langone Hospital-Long Island,30 to 49,113,M,White,Unknown,7,Emergency,Home or Self Care,2020,CIR017,CARDIAC DYSRHYTHMIAS,ESA006,CARDIOVERSION,201,CARDIAC ARRHYTHMIA & CONDUCTION DISORDERS,05,DISEASES AND DISORDERS OF THE CIRCULATORY SYSTEM,3,Major,Moderate,Medical,Medicaid,,,,,Y,215749.66,46707.52
Long Island,Nassau,2908000,000511,NYU Langone Hospital-Long Island,70 or Older,110,M,White,Not Span/Hispanic,2,Emergency,Home or Self Care,2020,CIR017,CARDIAC DYSRHYTHMIAS,MAM004,CARDIAC STRESS TESTS,201,CARDIAC ARRHYTHMIA & CONDUCTION DISORDERS,05,DISEASES AND DISORDERS OF THE CIRCULATORY SYSTEM,2,Moderate,Major,Medical,Medicare,Medicaid,,,,Y,50767.27,14551.22
Long Island,Nassau,2908000,000511,NYU Langone Hospital-Long Island,30 to 49,117,F,Other Race,Not Span/Hispanic,1,Emergency,Home or Self Care,2020,CIR017,CARDIAC DYSRHYTHMIAS,,,201,CARDIAC ARRHYTHMIA & CONDUCTION DISORDERS,05,DISEASES AND DISORDERS OF THE CIRCULATORY SYSTEM,1,Minor,Minor,Medical,Medicaid,,,,,Y,19776.42,4878.65
Long Island,Nassau,2908000,000511,NYU Langone Hospital-Long Island,70 or Older,115,M,White,Not Span/Hispanic,5,Emergency,Hospice - Home,2020,CIR017,CARDIAC DYSRHYTHMIAS,,,201,CARDIAC ARRHYTHMIA & CONDUCTION DISORDERS,05,DISEASES AND DISORDERS OF THE CIRCULATORY SYSTEM,4,Extreme,Extreme,Medical,Medicare,Medicare,Medicaid,,,Y,65276.34,21122.79
Long Island,Nassau,2908000,000511,NYU Langone Hospital-Long Island,50 to 69,117,F,Black/African American,Not Span/Hispanic,1,Emergency,Home or Self Care,2020,CIR017,CARDIAC DYSRHYTHMIAS,ESA006,CARDIOVERSION,201,CARDIAC ARRHYTHMIA & CONDUCTION DISORDERS,05,DISEASES AND DISORDERS OF THE CIRCULATORY SYSTEM,2,Moderate,Moderate,Medical,Private Health Insurance,,,,,Y,45146.94,11422.96
Long Island,Nassau,2908000,000511,NYU Langone Hospital-Long Island,50 to 69,115,F,White,Not Span/Hispanic,1,Emergency,Home or Self Care,2020,CIR017,CARDIAC DYSRHYTHMIAS,,,201,CARDIAC ARRHYTHMIA & CONDUCTION DISORDERS,05,DISEASES AND DISORDERS OF THE CIRCULATORY SYSTEM,1,Minor,Minor,Medical,Blue Cross/Blue Shield,,,,,Y,20393.97,4968.62
Long Island,Nassau,2908000,000511,NYU Langone Hospital-Long Island,50 to 69,117,F,White,Not Span/Hispanic,3,Emergency,Left Against Medical Advice,2020,CIR017,CARDIAC DYSRHYTHMIAS,ESA001,HEMODIALYSIS,201,CARDIAC ARRHYTHMIA & CONDUCTION DISORDERS,05,DISEASES AND DISORDERS OF THE CIRCULATORY SYSTEM,3,Major,Major,Medical,Medicare,Medicaid,,,,Y,64319.47,20344.98
Long Island,Nassau,2908000,000511,NYU Langone Hospital-Long Island,70 or Older,117,F,White,Not Span/Hispanic,3,Emergency,Home or Self Care,2020,CIR017,CARDIAC DYSRHYTHMIAS,,,201,CARDIAC ARRHYTHMIA & CONDUCTION DISORDERS,05,DISEASES AND DISORDERS OF THE CIRCULATORY SYSTEM,2,Moderate,Moderate,Medical,Medicare,,,,,Y,61136.82,13914.75
Long Island,Nassau,2908000,000511,NYU Langone Hospital-Long Island,70 or Older,110,F,White,Not Span/Hispanic,6,Emergency,Home or Self Care,2020,CIR017,CARDIAC DYSRHYTHMIAS,MST028,"SUBCUTANEOUS TISSUE AND FASCIA PROCEDURES, NEC",201,CARDIAC ARRHYTHMIA & CONDUCTION DISORDERS,05,DISEASES AND DISORDERS OF THE CIRCULATORY SYSTEM,3,Major,Major,Medical,Medicare,Medicare,,,,Y,216711.8,38506.02
Long Island,Nassau,2908000,000511,NYU Langone Hospital-Long Island,70 or Older,115,F,White,Not Span/Hispanic,4,Emergency,Home w/ Home Health Services,2020,CIR017,CARDIAC DYSRHYTHMIAS,ESA006,CARDIOVERSION,201,CARDIAC ARRHYTHMIA & CONDUCTION DISORDERS,05,DISEASES AND DISORDERS OF THE CIRCULATORY SYSTEM,4,Extreme,Extreme,Medical,Private Health Insurance,,,,,Y,52246.62,15610.35
Long Island,Nassau,2908000,000511,NYU Langone Hospital-Long Island,70 or Older,113,M,White,Not Span/Hispanic,3,Emergency,Home w/ Home Health Services,2020,CIR017,CARDIAC DYSRHYTHMIAS,MST028,"SUBCUTANEOUS TISSUE AND FASCIA PROCEDURES, NEC",201,CARDIAC ARRHYTHMIA & CONDUCTION DISORDERS,05,DISEASES AND DISORDERS OF THE CIRCULATORY SYSTEM,2,Moderate,Major,Medical,Medicare,Blue Cross/Blue Shield,,,,Y,126401.09,23970.6
Long Island,Nassau,2908000,000511,NYU Langone Hospital-Long Island,50 to 69,115,M,White,Not Span/Hispanic,1,Emergency,Left Against Medical Advice,2020,CIR017,CARDIAC DYSRHYTHMIAS,,,201,CARDIAC ARRHYTHMIA & CONDUCTION DISORDERS,05,DISEASES AND DISORDERS OF THE CIRCULATORY SYSTEM,1,Minor,Minor,Medical,Self-Pay,,,,,Y,20176.06,4799.9
Long Island,Nassau,2908000,000511,NYU Langone Hospital-Long Island,70 or Older,110,M,Black/African American,Not Span/Hispanic,2,Emergency,Home or Self Care,2020,SYM012,CIRCULATORY SIGNS AND SYMPTOMS,,,201,CARDIAC ARRHYTHMIA & CONDUCTION DISORDERS,05,DISEASES AND DISORDERS OF THE CIRCULATORY SYSTEM,3,Major,Moderate,Medical,Medicaid,,,,,Y,37699.39,8986.91
Long Island,Nassau,2908000,000511,NYU Langone Hospital-Long Island,70 or Older,117,M,White,Not Span/Hispanic,4,Emergency,Home or Self Care,2020,CIR017,CARDIAC DYSRHYTHMIAS,MAM004,CARDIAC STRESS TESTS,201,CARDIAC ARRHYTHMIA & CONDUCTION DISORDERS,05,DISEASES AND DISORDERS OF THE CIRCULATORY SYSTEM,2,Moderate,Major,Medical,Medicare,,,,,Y,58306.43,15801.87
Long Island,Nassau,2908000,000511,NYU Langone Hospital-Long Island,18 to 29,117,F,White,Not Span/Hispanic,1,Emergency,Home or Self Care,2020,SYM012,CIRCULATORY SIGNS AND SYMPTOMS,,,201,CARDIAC ARRHYTHMIA & CONDUCTION DISORDERS,05,DISEASES AND DISORDERS OF THE CIRCULATORY SYSTEM,1,Minor,Minor,Medical,Private Health Insurance,,,,,Y,28285.49,5815.84
Long Island,Nassau,2908000,000511,NYU Langone Hospital-Long Island,70 or Older,110,F,White,Not Span/Hispanic,7,Emergency,Home w/ Home Health Services,2020,CIR017,CARDIAC DYSRHYTHMIAS,ADM010,VACCINATIONS,201,CARDIAC ARRHYTHMIA & CONDUCTION DISORDERS,05,DISEASES AND DISORDERS OF THE CIRCULATORY SYSTEM,2,Moderate,Major,Medical,Medicare,Federal/State/Local/VA,,,,Y,113939.21,34030.93
Long Island,Nassau,2908000,000511,NYU Langone Hospital-Long Island,70 or Older,115,F,Black/African American,Not Span/Hispanic,4,Emergency,Home or Self Care,2020,CIR017,CARDIAC DYSRHYTHMIAS,ESA006,CARDIOVERSION,201,CARDIAC ARRHYTHMIA & CONDUCTION DISORDERS,05,DISEASES AND DISORDERS OF THE CIRCULATORY SYSTEM,3,Major,Major,Medical,Medicaid,,,,,Y,56522.67,16214.74
Long Island,Nassau,2908000,000511,NYU Langone Hospital-Long Island,70 or Older,117,M,White,Not Span/Hispanic,3,Emergency,Home or Self Care,2020,CIR017,CARDIAC DYSRHYTHMIAS,MAM004,CARDIAC STRESS TESTS,201,CARDIAC ARRHYTHMIA & CONDUCTION DISORDERS,05,DISEASES AND DISORDERS OF THE CIRCULATORY SYSTEM,1,Minor,Moderate,Medical,Medicare,Medicare,,,,Y,59523.86,17567.67
Long Island,Nassau,2908000,000511,NYU Langone Hospital-Long Island,50 to 69,110,M,White,Not Span/Hispanic,1,Emergency,Home or Self Care,2020,SYM012,CIRCULATORY SIGNS AND SYMPTOMS,,,201,CARDIAC ARRHYTHMIA & CONDUCTION DISORDERS,05,DISEASES AND DISORDERS OF THE CIRCULATORY SYSTEM,2,Moderate,Moderate,Medical,Private Health Insurance,,,,,Y,21574.1,5052.77
Long Island,Nassau,2908000,000511,NYU Langone Hospital-Long Island,70 or Older,117,M,White,Not Span/Hispanic,1,Emergency,Home or Self Care,2020,CIR017,CARDIAC DYSRHYTHMIAS,ESA006,CARDIOVERSION,201,CARDIAC ARRHYTHMIA & CONDUCTION DISORDERS,05,DISEASES AND DISORDERS OF THE CIRCULATORY SYSTEM,2,Moderate,Major,Medical,Medicare,Blue Cross/Blue Shield,,,,Y,22166.7,5061.81
Long Island,Nassau,2908000,000511,NYU Langone Hospital-Long Island,30 to 49,112,F,Black/African American,Not Span/Hispanic,7,Emergency,Home or Self Care,2020,CIR017,CARDIAC DYSRHYTHMIAS,ESA006,CARDIOVERSION,201,CARDIAC ARRHYTHMIA & CONDUCTION DISORDERS,05,DISEASES AND DISORDERS OF THE CIRCULATORY SYSTEM,3,Major,Major,Medical,Medicare,,,,,Y,79725.79,26037.29
Long Island,Nassau,2908000,000511,NYU Langone Hospital-Long Island,50 to 69,110,F,White,Not Span/Hispanic,2,Emergency,Home or Self Care,2020,CIR017,CARDIAC DYSRHYTHMIAS,SUD001,SUBSTANCE USE DETOXIFICATION,201,CARDIAC ARRHYTHMIA & CONDUCTION DISORDERS,05,DISEASES AND DISORDERS OF THE CIRCULATORY SYSTEM,2,Moderate,Moderate,Medical,Private Health Insurance,,,,,Y,25478.06,8055.71
Long Island,Nassau,2908000,000511,NYU Langone Hospital-Long Island,70 or Older,115,F,White,Not Span/Hispanic,1,Emergency,Home or Self Care,2020,CIR017,CARDIAC DYSRHYTHMIAS,ESA006,CARDIOVERSION,201,CARDIAC ARRHYTHMIA & CONDUCTION DISORDERS,05,DISEASES AND DISORDERS OF THE CIRCULATORY SYSTEM,1,Minor,Minor,Medical,Medicare,Blue Cross/Blue Shield,,,,Y,49521.44,11455.34
Long Island,Nassau,2908000,000511,NYU Langone Hospital-Long Island,50 to 69,117,F,White,Not Span/Hispanic,1,Emergency,Home or Self Care,2020,CIR017,CARDIAC DYSRHYTHMIAS,,,201,CARDIAC ARRHYTHMIA & CONDUCTION DISORDERS,05,DISEASES AND DISORDERS OF THE CIRCULATORY SYSTEM,1,Minor,Minor,Medical,Private Health Insurance,,,,,Y,19403.45,4862.57
Long Island,Nassau,2908000,000511,NYU Langone Hospital-Long Island,30 to 49,110,F,White,Not Span/Hispanic,1,Emergency,Home or Self Care,2020,CIR017,CARDIAC DYSRHYTHMIAS,,,201,CARDIAC ARRHYTHMIA & CONDUCTION DISORDERS,05,DISEASES AND DISORDERS OF THE CIRCULATORY SYSTEM,1,Minor,Minor,Medical,Private Health Insurance,,,,,Y,24535.77,5462.22
Long Island,Nassau,2908000,000511,NYU Langone Hospital-Long Island,70 or Older,117,F,White,Not Span/Hispanic,6,Elective,Home w/ Home Health Services,2020,CIR017,CARDIAC DYSRHYTHMIAS,IMG008,ULTRASONOGRAPHY,201,CARDIAC ARRHYTHMIA & CONDUCTION DISORDERS,05,DISEASES AND DISORDERS OF THE CIRCULATORY SYSTEM,2,Moderate,Moderate,Medical,Medicare,Medicare,,,,N,63710.43,21738
Long Island,Nassau,2908000,000511,NYU Langone Hospital-Long Island,70 or Older,113,F,White,Not Span/Hispanic,1,Emergency,Home or Self Care,2020,CIR017,CARDIAC DYSRHYTHMIAS,ESA006,CARDIOVERSION,201,CARDIAC ARRHYTHMIA & CONDUCTION DISORDERS,05,DISEASES AND DISORDERS OF THE CIRCULATORY SYSTEM,2,Moderate,Major,Medical,Medicare,Private Health Insurance,,,,Y,48704.8,12587.5
Long Island,Nassau,2908000,000511,NYU Langone Hospital-Long Island,50 to 69,113,M,White,Not Span/Hispanic,2,Emergency,Home or Self Care,2020,CIR017,CARDIAC DYSRHYTHMIAS,,,201,CARDIAC ARRHYTHMIA & CONDUCTION DISORDERS,05,DISEASES AND DISORDERS OF THE CIRCULATORY SYSTEM,2,Moderate,Major,Medical,Medicare,,,,,Y,31600.58,8515.87