Hospital Service Area,Hospital County,Operating Certificate Number,Permanent Facility Id,Facility Name,Age Group,Zip Code - 3 digits,Gender,Race,Ethnicity,Length of Stay,Type of Admission,Patient Disposition,Discharge Year,CCS Diagnosis Code,CCS Diagnosis Description,CCS Procedure Code,CCS Procedure Description,APR DRG Code,APR DRG Description,APR MDC Code,APR MDC Description,APR Severity of Illness Code,APR Severity of Illness Description,APR Risk of Mortality,APR Medical Surgical Description,Payment Typology 1,Payment Typology 2,Payment Typology 3,Birth Weight,Abortion Edit Indicator,Emergency Department Indicator,Total Charges,Total Costs
Hudson Valley,Westchester,5902001,001045,White Plains Hospital Center,50 to 69,106,M,Black/African American,Not Span/Hispanic,1,Emergency,Home or Self Care,2019,CIR012,NONSPECIFIC CHEST PAIN,,,203,CHEST PAIN,05,DISEASES AND DISORDERS OF THE CIRCULATORY SYSTEM,2,Moderate,Minor,Medical,Medicare,,,,,true,26740,5209.08
Hudson Valley,Westchester,5902001,001045,White Plains Hospital Center,50 to 69,105,F,Black/African American,Not Span/Hispanic,1,Emergency,Home or Self Care,2019,CIR012,NONSPECIFIC CHEST PAIN,,,203,CHEST PAIN,05,DISEASES AND DISORDERS OF THE CIRCULATORY SYSTEM,2,Moderate,Minor,Medical,Private Health Insurance,,,,,true,27380,3322.29
Hudson Valley,Westchester,5902001,001045,White Plains Hospital Center,30 to 49,105,M,Black/African American,Not Span/Hispanic,1,Emergency,Left Against Medical Advice,2019,CIR012,NONSPECIFIC CHEST PAIN,,,203,CHEST PAIN,05,DISEASES AND DISORDERS OF THE CIRCULATORY SYSTEM,1,Minor,Minor,Medical,Medicaid,,,,,true,8273,2355.66
New York City,Richmond,7004003,001737,Staten Island University Hospital Prince's Bay,70 or Older,103,F,White,Spanish/Hispanic,1,Emergency,Home or Self Care,2019,CIR012,NONSPECIFIC CHEST PAIN,,,203,CHEST PAIN,05,DISEASES AND DISORDERS OF THE CIRCULATORY SYSTEM,2,Moderate,Moderate,Medical,Medicare,Medicaid,,,,false,11010.9,2607.01
New York City,Kings,7002053,001304,NYU Langone Hospital-Brooklyn,50 to 69,112,M,Other Race,Spanish/Hispanic,1,Emergency,Home or Self Care,2019,CIR012,NONSPECIFIC CHEST PAIN,,,203,CHEST PAIN,05,DISEASES AND DISORDERS OF THE CIRCULATORY SYSTEM,1,Minor,Minor,Medical,Medicaid,,,,,true,23160.33,5629.32
New York City,Kings,7002053,001304,NYU Langone Hospital-Brooklyn,70 or Older,112,F,White,Not Span/Hispanic,3,Emergency,Facility w/ Custodial/Supportive Care,2019,CIR012,NONSPECIFIC CHEST PAIN,,,203,CHEST PAIN,05,DISEASES AND DISORDERS OF THE CIRCULATORY SYSTEM,1,Minor,Minor,Medical,Medicare,Medicaid,,,,true,80832.66,22830.58
Western NY,Erie,1401013,000292,Sisters of Charity Hospital - St. Joseph Campus,70 or Older,142,F,White,Not Span/Hispanic,1,Emergency,Home or Self Care,2019,CIR012,NONSPECIFIC CHEST PAIN,,,203,CHEST PAIN,05,DISEASES AND DISORDERS OF THE CIRCULATORY SYSTEM,1,Minor,Minor,Medical,Medicare,Medicare,Blue Cross/Blue Shield,,,false,3660.37,1397.16
New York City,Kings,7001016,001301,Kings County Hospital Center,30 to 49,112,M,Black/African American,Not Span/Hispanic,1,Emergency,Home or Self Care,2019,CIR012,NONSPECIFIC CHEST PAIN,,,203,CHEST PAIN,05,DISEASES AND DISORDERS OF THE CIRCULATORY SYSTEM,1,Minor,Minor,Medical,Medicaid,,,,,true,9505.12,6752.07
Long Island,Nassau,2908000,000511,NYU Langone Hospital-Long Island,30 to 49,115,F,Other Race,Spanish/Hispanic,1,Emergency,Home or Self Care,2019,CIR012,NONSPECIFIC CHEST PAIN,,,203,CHEST PAIN,05,DISEASES AND DISORDERS OF THE CIRCULATORY SYSTEM,1,Minor,Minor,Medical,Medicaid,Medicaid,,,,true,28647.18,3650.02
New York City,Bronx,7000008,001172,Lincoln Medical & Mental Health Center,30 to 49,104,M,Black/African American,Not Span/Hispanic,1,Emergency,Home or Self Care,2019,CIR012,NONSPECIFIC CHEST PAIN,ADM021,"ADMINISTRATION OF THERAPEUTIC SUBSTANCES, NEC",203,CHEST PAIN,05,DISEASES AND DISORDERS OF THE CIRCULATORY SYSTEM,2,Moderate,Moderate,Medical,Medicaid,Medicaid,,,,false,6394.43,3776.28
New York City,Bronx,7000006,001169,Montefiore Medical Center - Henry & Lucy Moses Div,70 or Older,104,M,White,Unknown,1,Emergency,Home or Self Care,2019,CIR012,NONSPECIFIC CHEST PAIN,,,203,CHEST PAIN,05,DISEASES AND DISORDERS OF THE CIRCULATORY SYSTEM,2,Moderate,Minor,Medical,Medicare,Private Health Insurance,,,,true,25183.49,5313.87
New York City,Manhattan,7002054,001458,New York-Presbyterian Hospital - New York Weill Cornell Center,70 or Older,100,M,White,Not Span/Hispanic,1,Emergency,Home or Self Care,2019,CIR012,NONSPECIFIC CHEST PAIN,ADM021,"ADMINISTRATION OF THERAPEUTIC SUBSTANCES, NEC",203,CHEST PAIN,05,DISEASES AND DISORDERS OF THE CIRCULATORY SYSTEM,2,Moderate,Minor,Medical,Blue Cross/Blue Shield,Medicare,Self-Pay,,,true,27355.4,7135.13
New York City,Kings,7001021,001306,New York - Presbyterian Brooklyn Methodist Hospital,70 or Older,112,M,White,Not Span/Hispanic,4,Emergency,Home w/ Home Health Services,2019,CIR012,NONSPECIFIC CHEST PAIN,,,203,CHEST PAIN,05,DISEASES AND DISORDERS OF THE CIRCULATORY SYSTEM,3,Major,Major,Medical,Medicare,Self-Pay,,,,true,39194.44,8317.52
New York City,Manhattan,7002001,001438,Bellevue Hospital Center,70 or Older,113,M,Other Race,Spanish/Hispanic,3,Emergency,Home or Self Care,2019,CIR012,NONSPECIFIC CHEST PAIN,MAM004,CARDIAC STRESS TESTS,203,CHEST PAIN,05,DISEASES AND DISORDERS OF THE CIRCULATORY SYSTEM,2,Moderate,Minor,Medical,Medicare,Medicare,Medicaid,,,true,25073.96,16664.15
New York City,Manhattan,7002001,001438,Bellevue Hospital Center,70 or Older,101,M,Other Race,Spanish/Hispanic,4,Emergency,Home or Self Care,2019,CIR012,NONSPECIFIC CHEST PAIN,IMG008,ULTRASONOGRAPHY,203,CHEST PAIN,05,DISEASES AND DISORDERS OF THE CIRCULATORY SYSTEM,2,Moderate,Moderate,Medical,Private Health Insurance,Medicare,,,,true,22971,15266.53
New York City,Manhattan,7002001,001438,Bellevue Hospital Center,30 to 49,100,M,Other Race,Not Span/Hispanic,1,Emergency,Home or Self Care,2019,MUS028,OTHER SPECIFIED BONE DISEASE AND MUSCULOSKELETAL DEFORMITIES,IMG009,PLAIN RADIOGRAPHY,203,CHEST PAIN,05,DISEASES AND DISORDERS OF THE CIRCULATORY SYSTEM,1,Minor,Minor,Medical,Self-Pay,,,,,true,7322.31,4866.41
New York City,Manhattan,7002001,001438,Bellevue Hospital Center,50 to 69,113,M,Other Race,Not Span/Hispanic,2,Emergency,Home or Self Care,2019,CIR012,NONSPECIFIC CHEST PAIN,MAM007,ELECTROCARDIOGRAM (ECG),203,CHEST PAIN,05,DISEASES AND DISORDERS OF THE CIRCULATORY SYSTEM,2,Moderate,Minor,Medical,Medicare,Medicaid,,,,true,20251.71,13459.29
Finger Lakes,Wayne,5820000,001028,Newark-Wayne Community Hospital,50 to 69,145,F,White,Not Span/Hispanic,2,Emergency,Home w/ Home Health Services,2019,MUS028,OTHER SPECIFIED BONE DISEASE AND MUSCULOSKELETAL DEFORMITIES,,,203,CHEST PAIN,05,DISEASES AND DISORDERS OF THE CIRCULATORY SYSTEM,2,Moderate,Minor,Medical,Medicare,Medicaid,,,,true,5649.12,1535.58
Finger Lakes,Wayne,5820000,001028,Newark-Wayne Community Hospital,70 or Older,145,F,White,Not Span/Hispanic,3,Emergency,Short-term Hospital,2019,CIR012,NONSPECIFIC CHEST PAIN,,,203,CHEST PAIN,05,DISEASES AND DISORDERS OF THE CIRCULATORY SYSTEM,2,Moderate,Moderate,Medical,Medicare,,,,,true,8586.28,2576.5
New York City,Kings,7001021,001306,New York - Presbyterian Brooklyn Methodist Hospital,30 to 49,112,M,White,Not Span/Hispanic,1,Emergency,Home or Self Care,2019,CIR012,NONSPECIFIC CHEST PAIN,,,203,CHEST PAIN,05,DISEASES AND DISORDERS OF THE CIRCULATORY SYSTEM,2,Moderate,Moderate,Medical,Medicaid,Self-Pay,,,,true,8978.14,2068.57
New York City,Richmond,7004003,001740,Staten Island University Hosp-North,18 to 29,103,F,White,Not Span/Hispanic,2,Emergency,Home or Self Care,2019,CIR012,NONSPECIFIC CHEST PAIN,,,203,CHEST PAIN,05,DISEASES AND DISORDERS OF THE CIRCULATORY SYSTEM,2,Moderate,Minor,Medical,Blue Cross/Blue Shield,,,,,true,27314.32,6160.07
New York City,Manhattan,7002024,001456,Mount Sinai Hospital,70 or Older,100,F,Black/African American,Not Span/Hispanic,2,Emergency,Home or Self Care,2019,CIR012,NONSPECIFIC CHEST PAIN,,,203,CHEST PAIN,05,DISEASES AND DISORDERS OF THE CIRCULATORY SYSTEM,3,Major,Moderate,Medical,Medicare,Blue Cross/Blue Shield,Self-Pay,,,true,25736.07,7985.44
New York City,Kings,7001002,001286,Brookdale Hospital Medical Center,70 or Older,112,F,Black/African American,Not Span/Hispanic,4,Emergency,Skilled Nursing Home,2019,CIR012,NONSPECIFIC CHEST PAIN,,,203,CHEST PAIN,05,DISEASES AND DISORDERS OF THE CIRCULATORY SYSTEM,2,Moderate,Moderate,Medical,Medicare,Medicaid,,,,true,18045.5,9192.21
New York City,Bronx,7000014,001176,SBH Health System,50 to 69,104,M,White,Spanish/Hispanic,1,Emergency,Home or Self Care,2019,CIR012,NONSPECIFIC CHEST PAIN,,,203,CHEST PAIN,05,DISEASES AND DISORDERS OF THE CIRCULATORY SYSTEM,2,Moderate,Minor,Medical,Medicaid,Medicaid,,,,true,8025.87,2210.24
Hudson Valley,Westchester,5902001,001045,White Plains Hospital Center,30 to 49,105,M,Black/African American,Not Span/Hispanic,1,Emergency,Left Against Medical Advice,2019,CIR012,NONSPECIFIC CHEST PAIN,,,203,CHEST PAIN,05,DISEASES AND DISORDERS OF THE CIRCULATORY SYSTEM,1,Minor,Minor,Medical,Medicaid,,,,,true,20248,3539.88
Hudson Valley,Westchester,5902001,001045,White Plains Hospital Center,50 to 69,,M,Other Race,Not Span/Hispanic,1,Emergency,Home or Self Care,2019,CIR012,NONSPECIFIC CHEST PAIN,,,203,CHEST PAIN,05,DISEASES AND DISORDERS OF THE CIRCULATORY SYSTEM,1,Minor,Minor,Medical,Private Health Insurance,,,,,true,15042,2359.47
New York City,Queens,7003010,001637,New York - Presbyterian/Queens,50 to 69,113,F,Black/African American,Not Span/Hispanic,3,Emergency,Home or Self Care,2019,CIR012,NONSPECIFIC CHEST PAIN,ADM021,"ADMINISTRATION OF THERAPEUTIC SUBSTANCES, NEC",203,CHEST PAIN,05,DISEASES AND DISORDERS OF THE CIRCULATORY SYSTEM,2,Moderate,Minor,Medical,Private Health Insurance,Self-Pay,,,,true,39396.34,9417.5
Western NY,Erie,1401013,000292,Sisters of Charity Hospital - St. Joseph Campus,50 to 69,142,F,Black/African American,Not Span/Hispanic,1,Emergency,Home or Self Care,2019,CIR012,NONSPECIFIC CHEST PAIN,,,203,CHEST PAIN,05,DISEASES AND DISORDERS OF THE CIRCULATORY SYSTEM,1,Minor,Minor,Medical,Medicare,Medicare,Medicaid,,,true,9454.92,3318.95
New York City,Manhattan,7002054,001458,New York-Presbyterian Hospital - New York Weill Cornell Center,70 or Older,100,F,White,Not Span/Hispanic,3,Emergency,Skilled Nursing Home,2019,CIR012,NONSPECIFIC CHEST PAIN,MAM008,CARDIAC MONITORING,203,CHEST PAIN,05,DISEASES AND DISORDERS OF THE CIRCULATORY SYSTEM,3,Major,Major,Medical,Medicare,Self-Pay,,,,true,40811.29,9459.69
New York City,Bronx,7000006,001169,Montefiore Medical Center - Henry & Lucy Moses Div,30 to 49,104,F,Other Race,Spanish/Hispanic,1,Emergency,Home or Self Care,2019,CIR012,NONSPECIFIC CHEST PAIN,,,203,CHEST PAIN,05,DISEASES AND DISORDERS OF THE CIRCULATORY SYSTEM,1,Minor,Minor,Medical,Medicaid,,,,,true,18163.51,2724.82
Long Island,Suffolk,5154001,000925,Good Samaritan Hospital Medical Center,30 to 49,117,F,Black/African American,Not Span/Hispanic,2,Emergency,Home or Self Care,2019,CIR012,NONSPECIFIC CHEST PAIN,,,203,CHEST PAIN,05,DISEASES AND DISORDERS OF THE CIRCULATORY SYSTEM,1,Minor,Minor,Medical,Blue Cross/Blue Shield,,,,,true,29883,5358.35
Long Island,Nassau,2952005,000552,Plainview Hospital,50 to 69,117,F,White,Not Span/Hispanic,2,Emergency,Home or Self Care,2019,CIR012,NONSPECIFIC CHEST PAIN,,,203,CHEST PAIN,05,DISEASES AND DISORDERS OF THE CIRCULATORY SYSTEM,2,Moderate,Minor,Medical,Blue Cross/Blue Shield,,,,,true,26093.58,5254.2
New York City,Kings,7002053,001304,NYU Langone Hospital-Brooklyn,50 to 69,112,M,White,Not Span/Hispanic,2,Emergency,Left Against Medical Advice,2019,CIR012,NONSPECIFIC CHEST PAIN,IMG008,ULTRASONOGRAPHY,203,CHEST PAIN,05,DISEASES AND DISORDERS OF THE CIRCULATORY SYSTEM,1,Minor,Minor,Medical,Medicaid,,,,,true,25063.38,8178.08
Hudson Valley,Dutchess,1302001,000181,Vassar Brothers Medical Center,30 to 49,126,M,Other Race,Spanish/Hispanic,2,Emergency,Home or Self Care,2019,CIR012,NONSPECIFIC CHEST PAIN,,,203,CHEST PAIN,05,DISEASES AND DISORDERS OF THE CIRCULATORY SYSTEM,2,Moderate,Minor,Medical,Self-Pay,,,,,false,10495.57,3116.52
Hudson Valley,Westchester,5902001,001045,White Plains Hospital Center,50 to 69,105,F,Black/African American,Not Span/Hispanic,1,Emergency,Home or Self Care,2019,CIR012,NONSPECIFIC CHEST PAIN,,,203,CHEST PAIN,05,DISEASES AND DISORDERS OF THE CIRCULATORY SYSTEM,1,Minor,Minor,Medical,Private Health Insurance,,,,,true,16271,2675.14
Finger Lakes,Wayne,5820000,001028,Newark-Wayne Community Hospital,50 to 69,145,F,White,Not Span/Hispanic,4,Emergency,Short-term Hospital,2019,CIR012,NONSPECIFIC CHEST PAIN,,,203,CHEST PAIN,05,DISEASES AND DISORDERS OF THE CIRCULATORY SYSTEM,1,Minor,Minor,Medical,Blue Cross/Blue Shield,,,,,true,18449.42,5572.89
Hudson Valley,Westchester,5902001,001045,White Plains Hospital Center,50 to 69,106,F,Black/African American,Not Span/Hispanic,1,Emergency,Home or Self Care,2019,CIR012,NONSPECIFIC CHEST PAIN,,,203,CHEST PAIN,05,DISEASES AND DISORDERS OF THE CIRCULATORY SYSTEM,2,Moderate,Minor,Medical,Private Health Insurance,,,,,true,32851,6511.2
New York City,Bronx,7000006,001169,Montefiore Medical Center - Henry & Lucy Moses Div,50 to 69,104,F,Other Race,Spanish/Hispanic,2,Emergency,Home or Self Care,2019,CIR012,NONSPECIFIC CHEST PAIN,,,203,CHEST PAIN,05,DISEASES AND DISORDERS OF THE CIRCULATORY SYSTEM,1,Minor,Minor,Medical,Blue Cross/Blue Shield,,,,,true,31175.67,6497.49
New York City,Kings,7001002,001286,Brookdale Hospital Medical Center,50 to 69,112,F,Other Race,Spanish/Hispanic,2,Emergency,Home w/ Home Health Services,2019,CIR012,NONSPECIFIC CHEST PAIN,,,203,CHEST PAIN,05,DISEASES AND DISORDERS OF THE CIRCULATORY SYSTEM,2,Moderate,Major,Medical,Medicare,Medicaid,,,,true,7952.44,3523.65
Capital/Adirond,Albany,0101004,000005,St. Peter's Hospital,50 to 69,120,M,White,Not Span/Hispanic,3,Emergency,Home w/ Home Health Services,2019,CIR012,NONSPECIFIC CHEST PAIN,,,203,CHEST PAIN,05,DISEASES AND DISORDERS OF THE CIRCULATORY SYSTEM,3,Major,Major,Medical,Private Health Insurance,,,,,true,27618.33,7355.58
New York City,Bronx,7000001,001178,BronxCare Hospital Center,50 to 69,104,F,Other Race,Spanish/Hispanic,1,Emergency,Home or Self Care,2019,CIR012,NONSPECIFIC CHEST PAIN,,,203,CHEST PAIN,05,DISEASES AND DISORDERS OF THE CIRCULATORY SYSTEM,1,Minor,Minor,Medical,Miscellaneous/Other,Medicare,Medicaid,,,true,9118.21,8333.77
New York City,Kings,7001046,001309,Interfaith Medical Center,50 to 69,112,F,Black/African American,Not Span/Hispanic,3,Emergency,Home or Self Care,2019,CIR012,NONSPECIFIC CHEST PAIN,,,203,CHEST PAIN,05,DISEASES AND DISORDERS OF THE CIRCULATORY SYSTEM,1,Minor,Minor,Medical,Medicaid,Medicaid,,,,true,29416.59,10394.67
New York City,Bronx,7000006,001169,Montefiore Medical Center - Henry & Lucy Moses Div,30 to 49,104,F,Black/African American,Not Span/Hispanic,4,Emergency,Home or Self Care,2019,CIR012,NONSPECIFIC CHEST PAIN,,,203,CHEST PAIN,05,DISEASES AND DISORDERS OF THE CIRCULATORY SYSTEM,2,Moderate,Minor,Medical,Medicaid,,,,,true,89514.21,16178.49
Southern Tier,Broome,0303001,000042,United Health Services Hospitals Inc. - Binghamton General Hospital,50 to 69,138,F,White,Not Span/Hispanic,1,Emergency,Home or Self Care,2019,CIR012,NONSPECIFIC CHEST PAIN,,,203,CHEST PAIN,05,DISEASES AND DISORDERS OF THE CIRCULATORY SYSTEM,2,Moderate,Moderate,Medical,Medicare,Medicare,Private Health Insurance,,,true,5510.6,2240.43
New York City,Bronx,7000001,001178,BronxCare Hospital Center,30 to 49,104,F,Other Race,Spanish/Hispanic,5,Emergency,Home or Self Care,2019,CIR012,NONSPECIFIC CHEST PAIN,,,203,CHEST PAIN,05,DISEASES AND DISORDERS OF THE CIRCULATORY SYSTEM,3,Major,Moderate,Medical,Medicare,Medicare,Medicaid,,,true,15967.27,20208.2
New York City,Richmond,7004003,001737,Staten Island University Hospital Prince's Bay,70 or Older,103,F,White,Not Span/Hispanic,1,Emergency,Facility w/ Custodial/Supportive Care,2019,CIR012,NONSPECIFIC CHEST PAIN,,,203,CHEST PAIN,05,DISEASES AND DISORDERS OF THE CIRCULATORY SYSTEM,1,Minor,Moderate,Medical,Medicare,Medicaid,,,,false,10317,2623.11
New York City,Queens,7003010,001637,New York - Presbyterian/Queens,70 or Older,113,F,Other Race,Spanish/Hispanic,6,Emergency,Skilled Nursing Home,2019,CIR012,NONSPECIFIC CHEST PAIN,ADM021,"ADMINISTRATION OF THERAPEUTIC SUBSTANCES, NEC",203,CHEST PAIN,05,DISEASES AND DISORDERS OF THE CIRCULATORY SYSTEM,2,Moderate,Moderate,Medical,Medicare,Medicaid,Self-Pay,,,true,56425.78,14918.05
New York City,Bronx,7000001,001178,BronxCare Hospital Center,50 to 69,100,M,Other Race,Unknown,2,Emergency,Psychiatric Hospital or Unit of Hosp,2019,CIR012,NONSPECIFIC CHEST PAIN,,,203,CHEST PAIN,05,DISEASES AND DISORDERS OF THE CIRCULATORY SYSTEM,2,Moderate,Moderate,Medical,Private Health Insurance,,,,,true,11007.85,11630.38
New York City,Bronx,7000001,001178,BronxCare Hospital Center,70 or Older,104,F,Other Race,Spanish/Hispanic,2,Emergency,Home or Self Care,2019,CIR012,NONSPECIFIC CHEST PAIN,,,203,CHEST PAIN,05,DISEASES AND DISORDERS OF THE CIRCULATORY SYSTEM,2,Moderate,Moderate,Medical,Miscellaneous/Other,Medicare,Medicaid,,,true,10407.99,11253.68
New York City,Manhattan,7002001,001438,Bellevue Hospital Center,70 or Older,100,M,Other Race,Spanish/Hispanic,1,Emergency,Home or Self Care,2019,CIR012,NONSPECIFIC CHEST PAIN,MAM007,ELECTROCARDIOGRAM (ECG),203,CHEST PAIN,05,DISEASES AND DISORDERS OF THE CIRCULATORY SYSTEM,2,Moderate,Moderate,Medical,Self-Pay,,,,,true,7239.3,4811.24
New York City,Bronx,7000024,001186,North Central Bronx Hospital,50 to 69,104,F,Black/African American,Not Span/Hispanic,2,Emergency,Home or Self Care,2019,CIR012,NONSPECIFIC CHEST PAIN,,,203,CHEST PAIN,05,DISEASES AND DISORDERS OF THE CIRCULATORY SYSTEM,2,Moderate,Minor,Medical,Medicaid,Medicaid,,,,true,14948.05,8973.45
New York City,Kings,7001021,001306,New York - Presbyterian Brooklyn Methodist Hospital,50 to 69,112,F,Black/African American,Not Span/Hispanic,1,Emergency,Home w/ Home Health Services,2019,CIR012,NONSPECIFIC CHEST PAIN,,,203,CHEST PAIN,05,DISEASES AND DISORDERS OF THE CIRCULATORY SYSTEM,1,Minor,Minor,Medical,"Managed Care, Unspecified",Medicaid,Self-Pay,,,true,18145.92,3501.36
New York City,Richmond,7004003,001737,Staten Island University Hospital Prince's Bay,50 to 69,103,M,White,Not Span/Hispanic,1,Emergency,Home or Self Care,2019,CIR012,NONSPECIFIC CHEST PAIN,,,203,CHEST PAIN,05,DISEASES AND DISORDERS OF THE CIRCULATORY SYSTEM,2,Moderate,Moderate,Medical,Private Health Insurance,,,,,true,17456,3514.22
New York City,Manhattan,7002054,001437,New York-Presbyterian/Lower Manhattan Hospital,50 to 69,OOS,F,Black/African American,Not Span/Hispanic,3,Emergency,Home or Self Care,2019,CIR012,NONSPECIFIC CHEST PAIN,ADM021,"ADMINISTRATION OF THERAPEUTIC SUBSTANCES, NEC",203,CHEST PAIN,05,DISEASES AND DISORDERS OF THE CIRCULATORY SYSTEM,1,Minor,Minor,Medical,"Managed Care, Unspecified",Self-Pay,,,,true,37515.76,8277.25
New York City,Bronx,7000002,001165,Jacobi Medical Center,50 to 69,104,M,Other Race,Unknown,2,Emergency,Home or Self Care,2019,CIR012,NONSPECIFIC CHEST PAIN,,,203,CHEST PAIN,05,DISEASES AND DISORDERS OF THE CIRCULATORY SYSTEM,3,Major,Moderate,Medical,Private Health Insurance,,,,,true,14677.19,8683.76
New York City,Bronx,7000006,001168,Montefiore Medical Center-Wakefield Hospital,30 to 49,104,F,Other Race,Spanish/Hispanic,1,Emergency,Home or Self Care,2019,CIR012,NONSPECIFIC CHEST PAIN,ADM021,"ADMINISTRATION OF THERAPEUTIC SUBSTANCES, NEC",203,CHEST PAIN,05,DISEASES AND DISORDERS OF THE CIRCULATORY SYSTEM,1,Minor,Minor,Medical,Blue Cross/Blue Shield,,,,,true,33881.4,6977.59
New York City,Queens,7003004,001630,Long Island Jewish Medical Center,50 to 69,OOS,M,Black/African American,Not Span/Hispanic,1,Emergency,Left Against Medical Advice,2019,CIR012,NONSPECIFIC CHEST PAIN,,,203,CHEST PAIN,05,DISEASES AND DISORDERS OF THE CIRCULATORY SYSTEM,1,Minor,Minor,Medical,Private Health Insurance,Self-Pay,,,,false,8370,1543.89
Hudson Valley,Dutchess,5957001,000180,Mid-Hudson Valley Division of Westchester Medical Center,30 to 49,125,F,White,Not Span/Hispanic,2,Emergency,Home or Self Care,2019,CIR012,NONSPECIFIC CHEST PAIN,,,203,CHEST PAIN,05,DISEASES AND DISORDERS OF THE CIRCULATORY SYSTEM,1,Minor,Minor,Medical,Blue Cross/Blue Shield,,,,,true,82999.49,14338.58
New York City,Manhattan,7002053,001463,NYU Langone Hospitals,50 to 69,112,M,White,Not Span/Hispanic,1,Emergency,Home w/ Home Health Services,2019,CIR012,NONSPECIFIC CHEST PAIN,ESA004,NON-INVASIVE VENTILATION,203,CHEST PAIN,05,DISEASES AND DISORDERS OF THE CIRCULATORY SYSTEM,3,Major,Major,Medical,Medicaid,,,,,true,28511.6,6012.92
Central NY,Oneida,3202003,000599,Faxton-St Lukes Healthcare St Lukes Division,50 to 69,134,F,White,Not Span/Hispanic,1,Emergency,Home or Self Care,2019,CIR012,NONSPECIFIC CHEST PAIN,,,203,CHEST PAIN,05,DISEASES AND DISORDERS OF THE CIRCULATORY SYSTEM,2,Moderate,Moderate,Medical,Blue Cross/Blue Shield,,,,,true,11236.32,1770.63
Central NY,Oneida,3202003,000599,Faxton-St Lukes Healthcare St Lukes Division,70 or Older,134,F,White,Not Span/Hispanic,1,Emergency,Home or Self Care,2019,CIR012,NONSPECIFIC CHEST PAIN,,,203,CHEST PAIN,05,DISEASES AND DISORDERS OF THE CIRCULATORY SYSTEM,2,Moderate,Moderate,Medical,Medicare,Blue Cross/Blue Shield,Private Health Insurance,,,true,12880.72,2621.37
New York City,Kings,7001021,001306,New York - Presbyterian Brooklyn Methodist Hospital,50 to 69,112,M,Black/African American,Not Span/Hispanic,2,Emergency,Home or Self Care,2019,CIR012,NONSPECIFIC CHEST PAIN,,,203,CHEST PAIN,05,DISEASES AND DISORDERS OF THE CIRCULATORY SYSTEM,1,Minor,Minor,Medical,Blue Cross/Blue Shield,Self-Pay,,,,true,19562.15,4401.61
New York City,Manhattan,7002032,001466,Mount Sinai West,50 to 69,100,F,Black/African American,Not Span/Hispanic,6,Emergency,Home or Self Care,2019,MUS028,OTHER SPECIFIED BONE DISEASE AND MUSCULOSKELETAL DEFORMITIES,IMG008,ULTRASONOGRAPHY,203,CHEST PAIN,05,DISEASES AND DISORDERS OF THE CIRCULATORY SYSTEM,3,Major,Moderate,Medical,Medicare,Medicaid,Self-Pay,,,true,66716.21,16276.38
New York City,Manhattan,7002054,001464,New York-Presbyterian Hospital - Columbia Presbyterian Center,50 to 69,112,F,Multi-racial,Not Span/Hispanic,4,Emergency,Psychiatric Hospital or Unit of Hosp,2019,CIR012,NONSPECIFIC CHEST PAIN,,,203,CHEST PAIN,05,DISEASES AND DISORDERS OF THE CIRCULATORY SYSTEM,2,Moderate,Moderate,Medical,Medicaid,Medicaid,Self-Pay,,,true,53797.02,11891.12
New York City,Kings,7001021,001306,New York - Presbyterian Brooklyn Methodist Hospital,50 to 69,112,F,Black/African American,Not Span/Hispanic,3,Emergency,Skilled Nursing Home,2019,CIR012,NONSPECIFIC CHEST PAIN,ESA001,HEMODIALYSIS,203,CHEST PAIN,05,DISEASES AND DISORDERS OF THE CIRCULATORY SYSTEM,3,Major,Major,Medical,Medicare,Medicaid,Self-Pay,,,true,21448.01,6183.61
New York City,Manhattan,7002054,001464,New York-Presbyterian Hospital - Columbia Presbyterian Center,30 to 49,100,F,Black/African American,Not Span/Hispanic,4,Emergency,Home or Self Care,2019,CIR012,NONSPECIFIC CHEST PAIN,,,203,CHEST PAIN,05,DISEASES AND DISORDERS OF THE CIRCULATORY SYSTEM,1,Minor,Minor,Medical,Blue Cross/Blue Shield,Self-Pay,,,,true,54451.15,12872.92
New York City,Kings,7002053,001304,NYU Langone Hospital-Brooklyn,50 to 69,112,F,Black/African American,Not Span/Hispanic,1,Emergency,Home or Self Care,2019,CIR012,NONSPECIFIC CHEST PAIN,,,203,CHEST PAIN,05,DISEASES AND DISORDERS OF THE CIRCULATORY SYSTEM,1,Minor,Minor,Medical,Blue Cross/Blue Shield,,,,,true,15096.04,4586.57
New York City,Kings,7002053,001304,NYU Langone Hospital-Brooklyn,70 or Older,112,F,White,Not Span/Hispanic,1,Emergency,Home or Self Care,2019,CIR012,NONSPECIFIC CHEST PAIN,IMG008,ULTRASONOGRAPHY,203,CHEST PAIN,05,DISEASES AND DISORDERS OF THE CIRCULATORY SYSTEM,2,Moderate,Moderate,Medical,Medicare,,,,,true,37073.02,7423.69