Hospital Service Area,Hospital County,Operating Certificate Number,Permanent Facility Id,Facility Name,Age Group,Zip Code - 3 digits,Gender,Race,Ethnicity,Length of Stay,Type of Admission,Patient Disposition,Discharge Year,CCS Diagnosis Code,CCS Diagnosis Description,CCS Procedure Code,CCS Procedure Description,APR DRG Code,APR DRG Description,APR MDC Code,APR MDC Description,APR Severity of Illness Code,APR Severity of Illness Description,APR Risk of Mortality,APR Medical Surgical Description,Payment Typology 1,Payment Typology 2,Payment Typology 3,Birth Weight,Abortion Edit Indicator,Emergency Department Indicator,Total Charges,Total Costs
New York City,Manhattan,7002053,001463,NYU Langone Hospitals,50 to 69,112,M,White,Not Span/Hispanic,1,Emergency,Home w/ Home Health Services,2019,CIR012,NONSPECIFIC CHEST PAIN,ESA004,NON-INVASIVE VENTILATION,203,CHEST PAIN,05,DISEASES AND DISORDERS OF THE CIRCULATORY SYSTEM,3,Major,Major,Medical,Medicaid,,,,,true,28511.6,6012.92
New York City,Manhattan,7002053,001463,NYU Langone Hospitals,50 to 69,103,M,White,Not Span/Hispanic,1,Emergency,Home or Self Care,2019,CIR012,NONSPECIFIC CHEST PAIN,,,203,CHEST PAIN,05,DISEASES AND DISORDERS OF THE CIRCULATORY SYSTEM,1,Minor,Minor,Medical,Blue Cross/Blue Shield,,,,,true,43183.83,11136.82
New York City,Manhattan,7002053,001463,NYU Langone Hospitals,70 or Older,112,M,Other Race,Spanish/Hispanic,1,Emergency,Home or Self Care,2019,CIR012,NONSPECIFIC CHEST PAIN,,,203,CHEST PAIN,05,DISEASES AND DISORDERS OF THE CIRCULATORY SYSTEM,3,Major,Major,Medical,Medicare,,,,,true,35621.96,9355.02
New York City,Manhattan,7002053,001463,NYU Langone Hospitals,18 to 29,112,F,Black/African American,Not Span/Hispanic,1,Emergency,Home or Self Care,2019,MUS028,OTHER SPECIFIED BONE DISEASE AND MUSCULOSKELETAL DEFORMITIES,,,203,CHEST PAIN,05,DISEASES AND DISORDERS OF THE CIRCULATORY SYSTEM,2,Moderate,Moderate,Medical,Private Health Insurance,,,,,true,19102.93,5243.3
New York City,Manhattan,7002053,001463,NYU Langone Hospitals,50 to 69,OOS,F,White,Not Span/Hispanic,1,Emergency,Home or Self Care,2019,CIR012,NONSPECIFIC CHEST PAIN,,,203,CHEST PAIN,05,DISEASES AND DISORDERS OF THE CIRCULATORY SYSTEM,1,Minor,Minor,Medical,Private Health Insurance,,,,,true,31958.54,9725.58
New York City,Manhattan,7002053,001463,NYU Langone Hospitals,30 to 49,112,M,Black/African American,Not Span/Hispanic,1,Emergency,Home or Self Care,2019,CIR012,NONSPECIFIC CHEST PAIN,,,203,CHEST PAIN,05,DISEASES AND DISORDERS OF THE CIRCULATORY SYSTEM,2,Moderate,Minor,Medical,Private Health Insurance,,,,,true,17523.28,4821.32
New York City,Manhattan,7002053,001463,NYU Langone Hospitals,30 to 49,OOS,F,Other Race,Unknown,1,Emergency,Left Against Medical Advice,2019,CIR012,NONSPECIFIC CHEST PAIN,,,203,CHEST PAIN,05,DISEASES AND DISORDERS OF THE CIRCULATORY SYSTEM,2,Moderate,Minor,Medical,Self-Pay,,,,,true,14192.33,4465.1
New York City,Manhattan,7002053,001463,NYU Langone Hospitals,50 to 69,112,F,White,Not Span/Hispanic,1,Emergency,Home or Self Care,2019,CIR012,NONSPECIFIC CHEST PAIN,,,203,CHEST PAIN,05,DISEASES AND DISORDERS OF THE CIRCULATORY SYSTEM,1,Minor,Minor,Medical,Private Health Insurance,,,,,true,32105.55,7391.52
New York City,Manhattan,7002053,001463,NYU Langone Hospitals,70 or Older,114,F,Black/African American,Not Span/Hispanic,1,Emergency,Home w/ Home Health Services,2019,CIR012,NONSPECIFIC CHEST PAIN,,,203,CHEST PAIN,05,DISEASES AND DISORDERS OF THE CIRCULATORY SYSTEM,2,Moderate,Moderate,Medical,Medicare,Blue Cross/Blue Shield,,,,true,53019.72,18245.4
New York City,Manhattan,7002053,001463,NYU Langone Hospitals,30 to 49,112,F,White,Not Span/Hispanic,1,Emergency,Home or Self Care,2019,CIR012,NONSPECIFIC CHEST PAIN,,,203,CHEST PAIN,05,DISEASES AND DISORDERS OF THE CIRCULATORY SYSTEM,1,Minor,Minor,Medical,Medicaid,,,,,true,34391.04,11651.92
New York City,Manhattan,7002053,001463,NYU Langone Hospitals,50 to 69,100,F,White,Spanish/Hispanic,1,Emergency,Home or Self Care,2019,CIR012,NONSPECIFIC CHEST PAIN,,,203,CHEST PAIN,05,DISEASES AND DISORDERS OF THE CIRCULATORY SYSTEM,2,Moderate,Minor,Medical,Private Health Insurance,,,,,true,31333.42,8760.39
New York City,Manhattan,7002053,001463,NYU Langone Hospitals,50 to 69,103,M,Black/African American,Not Span/Hispanic,1,Emergency,Home or Self Care,2019,CIR012,NONSPECIFIC CHEST PAIN,,,203,CHEST PAIN,05,DISEASES AND DISORDERS OF THE CIRCULATORY SYSTEM,1,Minor,Minor,Medical,Blue Cross/Blue Shield,,,,,true,21799.32,5430.08
New York City,Manhattan,7002053,001463,NYU Langone Hospitals,30 to 49,114,F,Other Race,Not Span/Hispanic,1,Emergency,Home or Self Care,2019,CIR012,NONSPECIFIC CHEST PAIN,,,203,CHEST PAIN,05,DISEASES AND DISORDERS OF THE CIRCULATORY SYSTEM,1,Minor,Minor,Medical,Medicaid,,,,,true,71003.97,11537.29
New York City,Manhattan,7002053,001463,NYU Langone Hospitals,30 to 49,OOS,M,White,Not Span/Hispanic,1,Emergency,Home or Self Care,2019,CIR012,NONSPECIFIC CHEST PAIN,,,203,CHEST PAIN,05,DISEASES AND DISORDERS OF THE CIRCULATORY SYSTEM,1,Minor,Minor,Medical,Private Health Insurance,,,,,true,20291.18,5436.08
New York City,Manhattan,7002053,001463,NYU Langone Hospitals,50 to 69,111,F,White,Not Span/Hispanic,1,Emergency,Home or Self Care,2019,CIR012,NONSPECIFIC CHEST PAIN,,,203,CHEST PAIN,05,DISEASES AND DISORDERS OF THE CIRCULATORY SYSTEM,1,Minor,Minor,Medical,Blue Cross/Blue Shield,,,,,true,15155.21,4617.1
New York City,Manhattan,7002053,001463,NYU Langone Hospitals,30 to 49,112,F,White,Not Span/Hispanic,1,Emergency,Home or Self Care,2019,CIR012,NONSPECIFIC CHEST PAIN,,,203,CHEST PAIN,05,DISEASES AND DISORDERS OF THE CIRCULATORY SYSTEM,2,Moderate,Minor,Medical,Private Health Insurance,,,,,true,38853.18,10185.1
New York City,Manhattan,7002053,001463,NYU Langone Hospitals,70 or Older,111,F,White,Not Span/Hispanic,1,Emergency,Home or Self Care,2019,CIR012,NONSPECIFIC CHEST PAIN,,,203,CHEST PAIN,05,DISEASES AND DISORDERS OF THE CIRCULATORY SYSTEM,1,Minor,Minor,Medical,Medicaid,,,,,true,27979.59,8177
New York City,Manhattan,7002053,001463,NYU Langone Hospitals,50 to 69,112,F,Black/African American,Not Span/Hispanic,1,Emergency,Home or Self Care,2019,CIR012,NONSPECIFIC CHEST PAIN,,,203,CHEST PAIN,05,DISEASES AND DISORDERS OF THE CIRCULATORY SYSTEM,1,Minor,Minor,Medical,Private Health Insurance,,,,,true,29641.58,8783.68
New York City,Manhattan,7002053,001463,NYU Langone Hospitals,50 to 69,100,M,Black/African American,Not Span/Hispanic,1,Emergency,Home or Self Care,2019,MUS028,OTHER SPECIFIED BONE DISEASE AND MUSCULOSKELETAL DEFORMITIES,,,203,CHEST PAIN,05,DISEASES AND DISORDERS OF THE CIRCULATORY SYSTEM,3,Major,Moderate,Medical,Medicaid,,,,,true,16777.83,4547.33
New York City,Manhattan,7002053,001463,NYU Langone Hospitals,30 to 49,113,M,White,Not Span/Hispanic,2,Emergency,Home or Self Care,2019,CIR012,NONSPECIFIC CHEST PAIN,MAM011,ELECTROENCEPHALOGRAM (EEG),203,CHEST PAIN,05,DISEASES AND DISORDERS OF THE CIRCULATORY SYSTEM,2,Moderate,Minor,Medical,Private Health Insurance,,,,,true,39155.54,8936.26
New York City,Manhattan,7002053,001463,NYU Langone Hospitals,50 to 69,112,F,Other Race,Not Span/Hispanic,1,Emergency,Home or Self Care,2019,CIR012,NONSPECIFIC CHEST PAIN,,,203,CHEST PAIN,05,DISEASES AND DISORDERS OF THE CIRCULATORY SYSTEM,2,Moderate,Minor,Medical,Medicaid,,,,,true,21554.68,5563.15
New York City,Manhattan,7002053,001463,NYU Langone Hospitals,50 to 69,117,F,Black/African American,Not Span/Hispanic,1,Emergency,Home or Self Care,2019,CIR012,NONSPECIFIC CHEST PAIN,,,203,CHEST PAIN,05,DISEASES AND DISORDERS OF THE CIRCULATORY SYSTEM,1,Minor,Minor,Medical,Blue Cross/Blue Shield,,,,,true,16226.75,4631.42
New York City,Manhattan,7002053,001463,NYU Langone Hospitals,50 to 69,113,F,Other Race,Not Span/Hispanic,1,Emergency,Home or Self Care,2019,CIR012,NONSPECIFIC CHEST PAIN,,,203,CHEST PAIN,05,DISEASES AND DISORDERS OF THE CIRCULATORY SYSTEM,1,Minor,Minor,Medical,Blue Cross/Blue Shield,,,,,true,15300.15,4619.36
New York City,Manhattan,7002053,001463,NYU Langone Hospitals,30 to 49,100,M,Black/African American,Not Span/Hispanic,1,Emergency,Home or Self Care,2019,CIR012,NONSPECIFIC CHEST PAIN,,,203,CHEST PAIN,05,DISEASES AND DISORDERS OF THE CIRCULATORY SYSTEM,2,Moderate,Minor,Medical,Private Health Insurance,,,,,true,23857.75,5836.54
New York City,Manhattan,7002053,001463,NYU Langone Hospitals,50 to 69,,F,Other Race,Not Span/Hispanic,1,Emergency,Home or Self Care,2019,CIR012,NONSPECIFIC CHEST PAIN,,,203,CHEST PAIN,05,DISEASES AND DISORDERS OF THE CIRCULATORY SYSTEM,1,Minor,Minor,Medical,Medicaid,,,,,true,24510.46,7715.05
New York City,Manhattan,7002053,001463,NYU Langone Hospitals,50 to 69,112,F,Other Race,Not Span/Hispanic,1,Emergency,Home or Self Care,2019,CIR012,NONSPECIFIC CHEST PAIN,MAM006,PACEMAKER AND DEFIBRILLATOR INTERROGATION,203,CHEST PAIN,05,DISEASES AND DISORDERS OF THE CIRCULATORY SYSTEM,2,Moderate,Moderate,Medical,Medicaid,,,,,true,24114.71,6001.9
New York City,Manhattan,7002053,001463,NYU Langone Hospitals,50 to 69,103,F,White,Not Span/Hispanic,1,Emergency,Home or Self Care,2019,CIR012,NONSPECIFIC CHEST PAIN,,,203,CHEST PAIN,05,DISEASES AND DISORDERS OF THE CIRCULATORY SYSTEM,1,Minor,Minor,Medical,Private Health Insurance,,,,,true,19391.69,5232.55
New York City,Manhattan,7002053,001463,NYU Langone Hospitals,50 to 69,113,F,White,Not Span/Hispanic,1,Emergency,Home or Self Care,2019,CIR012,NONSPECIFIC CHEST PAIN,,,203,CHEST PAIN,05,DISEASES AND DISORDERS OF THE CIRCULATORY SYSTEM,1,Minor,Minor,Medical,Private Health Insurance,,,,,true,24883.67,5868.26
New York City,Manhattan,7002053,001463,NYU Langone Hospitals,30 to 49,104,M,Black/African American,Not Span/Hispanic,1,Emergency,Home or Self Care,2019,CIR012,NONSPECIFIC CHEST PAIN,,,203,CHEST PAIN,05,DISEASES AND DISORDERS OF THE CIRCULATORY SYSTEM,2,Moderate,Minor,Medical,Blue Cross/Blue Shield,,,,,true,16346.27,4788.9
New York City,Manhattan,7002053,001463,NYU Langone Hospitals,30 to 49,OOS,F,Other Race,Not Span/Hispanic,1,Emergency,Home or Self Care,2019,CIR012,NONSPECIFIC CHEST PAIN,,,203,CHEST PAIN,05,DISEASES AND DISORDERS OF THE CIRCULATORY SYSTEM,1,Minor,Minor,Medical,Private Health Insurance,,,,,true,16962.42,4877.42
New York City,Manhattan,7002053,001463,NYU Langone Hospitals,30 to 49,112,M,Black/African American,Not Span/Hispanic,1,Emergency,Home or Self Care,2019,CIR012,NONSPECIFIC CHEST PAIN,,,203,CHEST PAIN,05,DISEASES AND DISORDERS OF THE CIRCULATORY SYSTEM,2,Moderate,Minor,Medical,Private Health Insurance,,,,,true,19960.79,5230.6
New York City,Manhattan,7002053,001463,NYU Langone Hospitals,50 to 69,104,M,Black/African American,Not Span/Hispanic,2,Emergency,Home or Self Care,2019,CIR012,NONSPECIFIC CHEST PAIN,,,203,CHEST PAIN,05,DISEASES AND DISORDERS OF THE CIRCULATORY SYSTEM,2,Moderate,Moderate,Medical,Private Health Insurance,Medicaid,,,,true,41586.7,12634.48
New York City,Manhattan,7002053,001463,NYU Langone Hospitals,30 to 49,OOS,F,Other Race,Spanish/Hispanic,1,Emergency,Home or Self Care,2019,CIR012,NONSPECIFIC CHEST PAIN,,,203,CHEST PAIN,05,DISEASES AND DISORDERS OF THE CIRCULATORY SYSTEM,2,Moderate,Minor,Medical,Private Health Insurance,,,,,true,24356.33,6082.66
New York City,Manhattan,7002053,001463,NYU Langone Hospitals,30 to 49,112,F,Black/African American,Not Span/Hispanic,1,Emergency,Home or Self Care,2019,CIR012,NONSPECIFIC CHEST PAIN,,,203,CHEST PAIN,05,DISEASES AND DISORDERS OF THE CIRCULATORY SYSTEM,2,Moderate,Minor,Medical,Private Health Insurance,,,,,true,20311.88,5508.32
New York City,Manhattan,7002053,001463,NYU Langone Hospitals,50 to 69,100,F,Other Race,Not Span/Hispanic,1,Emergency,Home or Self Care,2019,CIR012,NONSPECIFIC CHEST PAIN,,,203,CHEST PAIN,05,DISEASES AND DISORDERS OF THE CIRCULATORY SYSTEM,2,Moderate,Minor,Medical,Private Health Insurance,,,,,true,22043.01,5639.57
New York City,Manhattan,7002053,001463,NYU Langone Hospitals,30 to 49,113,F,Black/African American,Not Span/Hispanic,1,Emergency,Home or Self Care,2019,CIR012,NONSPECIFIC CHEST PAIN,,,203,CHEST PAIN,05,DISEASES AND DISORDERS OF THE CIRCULATORY SYSTEM,2,Moderate,Minor,Medical,Private Health Insurance,,,,,true,13866.12,4297.53
New York City,Manhattan,7002053,001463,NYU Langone Hospitals,50 to 69,OOS,F,Black/African American,Not Span/Hispanic,1,Emergency,Home or Self Care,2019,CIR012,NONSPECIFIC CHEST PAIN,,,203,CHEST PAIN,05,DISEASES AND DISORDERS OF THE CIRCULATORY SYSTEM,1,Minor,Minor,Medical,Private Health Insurance,,,,,true,21547.61,7156.37
New York City,Manhattan,7002053,001463,NYU Langone Hospitals,70 or Older,100,M,White,Not Span/Hispanic,3,Emergency,Home or Self Care,2019,CIR012,NONSPECIFIC CHEST PAIN,,,203,CHEST PAIN,05,DISEASES AND DISORDERS OF THE CIRCULATORY SYSTEM,2,Moderate,Moderate,Medical,Medicare,Medicare,,,,true,99641.89,23150.4
New York City,Manhattan,7002053,001463,NYU Langone Hospitals,50 to 69,104,F,Black/African American,Not Span/Hispanic,1,Emergency,Home or Self Care,2019,CIR012,NONSPECIFIC CHEST PAIN,,,203,CHEST PAIN,05,DISEASES AND DISORDERS OF THE CIRCULATORY SYSTEM,1,Minor,Minor,Medical,Private Health Insurance,,,,,true,24358.66,5670.27
New York City,Manhattan,7002053,001463,NYU Langone Hospitals,50 to 69,OOS,F,Other Race,Not Span/Hispanic,1,Emergency,Home or Self Care,2019,CIR012,NONSPECIFIC CHEST PAIN,,,203,CHEST PAIN,05,DISEASES AND DISORDERS OF THE CIRCULATORY SYSTEM,1,Minor,Minor,Medical,Private Health Insurance,,,,,true,15984.34,4587.63
New York City,Manhattan,7002053,001463,NYU Langone Hospitals,50 to 69,103,F,White,Unknown,1,Emergency,Home or Self Care,2019,CIR012,NONSPECIFIC CHEST PAIN,,,203,CHEST PAIN,05,DISEASES AND DISORDERS OF THE CIRCULATORY SYSTEM,1,Minor,Minor,Medical,Private Health Insurance,,,,,true,22397.86,8016.5
New York City,Manhattan,7002053,001463,NYU Langone Hospitals,50 to 69,OOS,F,Black/African American,Not Span/Hispanic,1,Emergency,Home or Self Care,2019,CIR012,NONSPECIFIC CHEST PAIN,,,203,CHEST PAIN,05,DISEASES AND DISORDERS OF THE CIRCULATORY SYSTEM,3,Major,Moderate,Medical,Private Health Insurance,,,,,true,36306.07,7429.79
New York City,Manhattan,7002053,001463,NYU Langone Hospitals,50 to 69,115,M,White,Not Span/Hispanic,1,Emergency,Home or Self Care,2019,CIR012,NONSPECIFIC CHEST PAIN,,,203,CHEST PAIN,05,DISEASES AND DISORDERS OF THE CIRCULATORY SYSTEM,1,Minor,Minor,Medical,Blue Cross/Blue Shield,,,,,true,28597.49,8636.4
New York City,Manhattan,7002053,001463,NYU Langone Hospitals,50 to 69,112,F,Black/African American,Not Span/Hispanic,1,Emergency,Home or Self Care,2019,CIR012,NONSPECIFIC CHEST PAIN,,,203,CHEST PAIN,05,DISEASES AND DISORDERS OF THE CIRCULATORY SYSTEM,1,Minor,Minor,Medical,Blue Cross/Blue Shield,,,,,true,22455.7,5559.77
New York City,Manhattan,7002053,001463,NYU Langone Hospitals,50 to 69,104,F,Black/African American,Not Span/Hispanic,1,Emergency,Home or Self Care,2019,CIR012,NONSPECIFIC CHEST PAIN,,,203,CHEST PAIN,05,DISEASES AND DISORDERS OF THE CIRCULATORY SYSTEM,1,Minor,Minor,Medical,Private Health Insurance,,,,,true,18621.03,5157.72
New York City,Manhattan,7002053,001463,NYU Langone Hospitals,50 to 69,112,M,Black/African American,Not Span/Hispanic,1,Emergency,Home or Self Care,2019,CIR012,NONSPECIFIC CHEST PAIN,,,203,CHEST PAIN,05,DISEASES AND DISORDERS OF THE CIRCULATORY SYSTEM,2,Moderate,Minor,Medical,Blue Cross/Blue Shield,,,,,true,27771.37,9482.02
New York City,Manhattan,7002053,001463,NYU Langone Hospitals,70 or Older,100,F,White,Not Span/Hispanic,1,Emergency,Home w/ Home Health Services,2019,CIR012,NONSPECIFIC CHEST PAIN,,,203,CHEST PAIN,05,DISEASES AND DISORDERS OF THE CIRCULATORY SYSTEM,2,Moderate,Moderate,Medical,Medicare,Medicaid,,,,true,21525.51,5832.69
New York City,Manhattan,7002053,001463,NYU Langone Hospitals,18 to 29,100,M,Other Race,Spanish/Hispanic,4,Emergency,Home or Self Care,2019,CIR012,NONSPECIFIC CHEST PAIN,ESA001,HEMODIALYSIS,203,CHEST PAIN,05,DISEASES AND DISORDERS OF THE CIRCULATORY SYSTEM,3,Major,Major,Medical,Blue Cross/Blue Shield,Medicaid,,,,true,65902.23,18831.76
New York City,Manhattan,7002053,001463,NYU Langone Hospitals,30 to 49,OOS,M,White,Not Span/Hispanic,1,Emergency,Home or Self Care,2019,CIR012,NONSPECIFIC CHEST PAIN,,,203,CHEST PAIN,05,DISEASES AND DISORDERS OF THE CIRCULATORY SYSTEM,1,Minor,Minor,Medical,Private Health Insurance,,,,,true,37298.66,9032.63
New York City,Manhattan,7002053,001463,NYU Langone Hospitals,50 to 69,,M,White,Spanish/Hispanic,1,Emergency,Home or Self Care,2019,CIR012,NONSPECIFIC CHEST PAIN,,,203,CHEST PAIN,05,DISEASES AND DISORDERS OF THE CIRCULATORY SYSTEM,2,Moderate,Moderate,Medical,Blue Cross/Blue Shield,,,,,true,15214.07,4535.94
New York City,Manhattan,7002053,001463,NYU Langone Hospitals,18 to 29,117,F,Other Race,Spanish/Hispanic,4,Emergency,Home or Self Care,2019,CIR012,NONSPECIFIC CHEST PAIN,CAR025,PLACEMENT OF TUNNELED OR IMPLANTABLE PORTION OF A VASCULAR ACCESS DEVICE,203,CHEST PAIN,05,DISEASES AND DISORDERS OF THE CIRCULATORY SYSTEM,3,Major,Minor,Medical,Private Health Insurance,,,,,true,88275.59,26948.74
New York City,Manhattan,7002053,001463,NYU Langone Hospitals,70 or Older,100,M,White,Not Span/Hispanic,1,Emergency,Home or Self Care,2019,CIR012,NONSPECIFIC CHEST PAIN,,,203,CHEST PAIN,05,DISEASES AND DISORDERS OF THE CIRCULATORY SYSTEM,2,Moderate,Moderate,Medical,Blue Cross/Blue Shield,,,,,true,27623.76,8498.11
New York City,Manhattan,7002053,001463,NYU Langone Hospitals,18 to 29,OOS,M,White,Not Span/Hispanic,1,Emergency,Home or Self Care,2019,CIR012,NONSPECIFIC CHEST PAIN,MAM004,CARDIAC STRESS TESTS,203,CHEST PAIN,05,DISEASES AND DISORDERS OF THE CIRCULATORY SYSTEM,2,Moderate,Minor,Medical,Private Health Insurance,,,,,true,21655.81,5579.97
New York City,Manhattan,7002053,001463,NYU Langone Hospitals,50 to 69,112,F,Other Race,Unknown,1,Emergency,Home or Self Care,2019,CIR012,NONSPECIFIC CHEST PAIN,,,203,CHEST PAIN,05,DISEASES AND DISORDERS OF THE CIRCULATORY SYSTEM,1,Minor,Minor,Medical,Private Health Insurance,,,,,true,15330.96,4617.33
New York City,Manhattan,7002053,001463,NYU Langone Hospitals,50 to 69,100,F,White,Not Span/Hispanic,1,Emergency,Home or Self Care,2019,CIR012,NONSPECIFIC CHEST PAIN,,,203,CHEST PAIN,05,DISEASES AND DISORDERS OF THE CIRCULATORY SYSTEM,1,Minor,Minor,Medical,Private Health Insurance,,,,,true,21502.48,5300.58
New York City,Manhattan,7002053,001463,NYU Langone Hospitals,70 or Older,100,F,White,Not Span/Hispanic,1,Emergency,Home w/ Home Health Services,2019,CIR012,NONSPECIFIC CHEST PAIN,,,203,CHEST PAIN,05,DISEASES AND DISORDERS OF THE CIRCULATORY SYSTEM,2,Moderate,Moderate,Medical,Medicare,,,,,true,39202.23,12822.04
New York City,Manhattan,7002053,001463,NYU Langone Hospitals,70 or Older,112,M,White,Not Span/Hispanic,2,Emergency,Home or Self Care,2019,CIR012,NONSPECIFIC CHEST PAIN,,,203,CHEST PAIN,05,DISEASES AND DISORDERS OF THE CIRCULATORY SYSTEM,3,Major,Major,Medical,Medicare,Medicaid,,,,true,76042.54,20442.67
New York City,Manhattan,7002053,001463,NYU Langone Hospitals,70 or Older,112,M,White,Not Span/Hispanic,3,Emergency,Skilled Nursing Home,2019,CIR012,NONSPECIFIC CHEST PAIN,,,203,CHEST PAIN,05,DISEASES AND DISORDERS OF THE CIRCULATORY SYSTEM,3,Major,Major,Medical,Medicare,Medicaid,,,,true,59129.41,18171.53
New York City,Manhattan,7002053,001463,NYU Langone Hospitals,50 to 69,112,F,Black/African American,Not Span/Hispanic,2,Emergency,Home or Self Care,2019,CIR012,NONSPECIFIC CHEST PAIN,,,203,CHEST PAIN,05,DISEASES AND DISORDERS OF THE CIRCULATORY SYSTEM,1,Minor,Minor,Medical,Medicare,Blue Cross/Blue Shield,,,,true,53781.51,18264.83
New York City,Manhattan,7002053,001463,NYU Langone Hospitals,50 to 69,112,F,Other Race,Spanish/Hispanic,1,Emergency,Home or Self Care,2019,CIR012,NONSPECIFIC CHEST PAIN,,,203,CHEST PAIN,05,DISEASES AND DISORDERS OF THE CIRCULATORY SYSTEM,2,Moderate,Moderate,Medical,Medicare,Medicaid,,,,true,14827.33,4484.67
New York City,Manhattan,7002053,001463,NYU Langone Hospitals,30 to 49,100,F,Multi-racial,Spanish/Hispanic,1,Emergency,Home or Self Care,2019,CIR012,NONSPECIFIC CHEST PAIN,,,203,CHEST PAIN,05,DISEASES AND DISORDERS OF THE CIRCULATORY SYSTEM,2,Moderate,Minor,Medical,Medicare,Medicaid,,,,true,47415.35,7701.41
New York City,Manhattan,7002053,001463,NYU Langone Hospitals,50 to 69,114,M,Black/African American,Not Span/Hispanic,1,Emergency,Home or Self Care,2019,CIR012,NONSPECIFIC CHEST PAIN,,,203,CHEST PAIN,05,DISEASES AND DISORDERS OF THE CIRCULATORY SYSTEM,2,Moderate,Minor,Medical,Private Health Insurance,,,,,true,25341.21,8412.33
New York City,Manhattan,7002053,001463,NYU Langone Hospitals,30 to 49,113,M,Other Race,Not Span/Hispanic,1,Emergency,Home or Self Care,2019,CIR012,NONSPECIFIC CHEST PAIN,,,203,CHEST PAIN,05,DISEASES AND DISORDERS OF THE CIRCULATORY SYSTEM,2,Moderate,Minor,Medical,Private Health Insurance,,,,,true,22772.62,5634.27
New York City,Manhattan,7002053,001463,NYU Langone Hospitals,30 to 49,100,M,White,Not Span/Hispanic,4,Emergency,Home or Self Care,2019,CIR012,NONSPECIFIC CHEST PAIN,,,203,CHEST PAIN,05,DISEASES AND DISORDERS OF THE CIRCULATORY SYSTEM,2,Moderate,Minor,Medical,Self-Pay,,,,,true,62769.14,15322.82
New York City,Manhattan,7002053,001463,NYU Langone Hospitals,50 to 69,100,M,White,Not Span/Hispanic,1,Emergency,Home or Self Care,2019,CIR012,NONSPECIFIC CHEST PAIN,,,203,CHEST PAIN,05,DISEASES AND DISORDERS OF THE CIRCULATORY SYSTEM,1,Minor,Minor,Medical,Private Health Insurance,,,,,true,16696.02,4812.46
New York City,Manhattan,7002053,001463,NYU Langone Hospitals,70 or Older,112,F,White,Not Span/Hispanic,1,Emergency,Home w/ Home Health Services,2019,CIR012,NONSPECIFIC CHEST PAIN,,,203,CHEST PAIN,05,DISEASES AND DISORDERS OF THE CIRCULATORY SYSTEM,2,Moderate,Moderate,Medical,Medicaid,,,,,true,32386.74,6674.88
New York City,Manhattan,7002053,001463,NYU Langone Hospitals,50 to 69,112,F,Black/African American,Not Span/Hispanic,1,Emergency,Home or Self Care,2019,CIR012,NONSPECIFIC CHEST PAIN,,,203,CHEST PAIN,05,DISEASES AND DISORDERS OF THE CIRCULATORY SYSTEM,1,Minor,Minor,Medical,Private Health Insurance,,,,,true,33506.26,10364.31
New York City,Manhattan,7002053,001463,NYU Langone Hospitals,30 to 49,112,F,Black/African American,Not Span/Hispanic,1,Emergency,Home or Self Care,2019,MUS028,OTHER SPECIFIED BONE DISEASE AND MUSCULOSKELETAL DEFORMITIES,,,203,CHEST PAIN,05,DISEASES AND DISORDERS OF THE CIRCULATORY SYSTEM,2,Moderate,Minor,Medical,Self-Pay,,,,,true,24789.98,7727.35
New York City,Manhattan,7002053,001463,NYU Langone Hospitals,18 to 29,117,F,Other Race,Not Span/Hispanic,2,Emergency,Home or Self Care,2019,CIR012,NONSPECIFIC CHEST PAIN,,,203,CHEST PAIN,05,DISEASES AND DISORDERS OF THE CIRCULATORY SYSTEM,3,Major,Major,Medical,Medicaid,,,,,true,25728.66,8345.68
New York City,Manhattan,7002053,001463,NYU Langone Hospitals,30 to 49,112,M,Other Race,Not Span/Hispanic,1,Emergency,Home or Self Care,2019,CIR012,NONSPECIFIC CHEST PAIN,,,203,CHEST PAIN,05,DISEASES AND DISORDERS OF THE CIRCULATORY SYSTEM,1,Minor,Minor,Medical,Private Health Insurance,,,,,true,22736.05,5336.22
New York City,Manhattan,7002053,001463,NYU Langone Hospitals,50 to 69,114,F,Other Race,Spanish/Hispanic,1,Emergency,Home or Self Care,2019,CIR012,NONSPECIFIC CHEST PAIN,,,203,CHEST PAIN,05,DISEASES AND DISORDERS OF THE CIRCULATORY SYSTEM,2,Moderate,Minor,Medical,Blue Cross/Blue Shield,Medicare,,,,true,17130.21,4746.21
New York City,Manhattan,7002053,001463,NYU Langone Hospitals,50 to 69,104,F,Other Race,Spanish/Hispanic,1,Emergency,Home or Self Care,2019,CIR012,NONSPECIFIC CHEST PAIN,,,203,CHEST PAIN,05,DISEASES AND DISORDERS OF THE CIRCULATORY SYSTEM,1,Minor,Minor,Medical,Private Health Insurance,,,,,true,19905.66,5168.7
New York City,Manhattan,7002053,001463,NYU Langone Hospitals,50 to 69,,F,Other Race,Not Span/Hispanic,1,Emergency,Home or Self Care,2019,CIR012,NONSPECIFIC CHEST PAIN,,,203,CHEST PAIN,05,DISEASES AND DISORDERS OF THE CIRCULATORY SYSTEM,1,Minor,Minor,Medical,Private Health Insurance,,,,,true,21815.23,5606.46