Hospital Service Area,Hospital County,Operating Certificate Number,Permanent Facility Id,Facility Name,Age Group,Zip Code - 3 digits,Gender,Race,Ethnicity,Length of Stay,Type of Admission,Patient Disposition,Discharge Year,CCS Diagnosis Code,CCS Diagnosis Description,CCS Procedure Code,CCS Procedure Description,APR DRG Code,APR DRG Description,APR MDC Code,APR MDC Description,APR Severity of Illness Code,APR Severity of Illness Description,APR Risk of Mortality,APR Medical Surgical Description,Payment Typology 1,Payment Typology 2,Payment Typology 3,Birth Weight,Abortion Edit Indicator,Emergency Department Indicator,Total Charges,Total Costs
New York City,Kings,7002053,001304,NYU Langone Hospital-Brooklyn,50 to 69,112,F,Other Race,Unknown,1,Emergency,Home or Self Care,2020,CIR012,NONSPECIFIC CHEST PAIN,,,203,CHEST PAIN,05,DISEASES AND DISORDERS OF THE CIRCULATORY SYSTEM,1,Minor,Minor,Medical,Medicaid,,,,,Y,41261.04,9569.66
New York City,Kings,7002053,001304,NYU Langone Hospital-Brooklyn,30 to 49,112,M,Other Race,Not Span/Hispanic,1,Emergency,Home or Self Care,2020,CIR012,NONSPECIFIC CHEST PAIN,ADM021,"ADMINISTRATION OF THERAPEUTIC SUBSTANCES, NEC",203,CHEST PAIN,05,DISEASES AND DISORDERS OF THE CIRCULATORY SYSTEM,2,Moderate,Moderate,Medical,Private Health Insurance,,,,,Y,23853.92,5343.6
New York City,Kings,7002053,001304,NYU Langone Hospital-Brooklyn,50 to 69,112,F,White,Not Span/Hispanic,1,Emergency,Home or Self Care,2020,MUS028,OTHER SPECIFIED BONE DISEASE AND MUSCULOSKELETAL DEFORMITIES,,,203,CHEST PAIN,05,DISEASES AND DISORDERS OF THE CIRCULATORY SYSTEM,1,Minor,Minor,Medical,Blue Cross/Blue Shield,,,,,Y,16054.25,4271.81
New York City,Kings,7002053,001304,NYU Langone Hospital-Brooklyn,50 to 69,112,F,White,Not Span/Hispanic,2,Emergency,Home or Self Care,2020,CIR012,NONSPECIFIC CHEST PAIN,IMG008,ULTRASONOGRAPHY,203,CHEST PAIN,05,DISEASES AND DISORDERS OF THE CIRCULATORY SYSTEM,2,Moderate,Minor,Medical,Blue Cross/Blue Shield,,,,,Y,50215.7,14082.76
New York City,Kings,7002053,001304,NYU Langone Hospital-Brooklyn,70 or Older,112,M,Other Race,Not Span/Hispanic,2,Emergency,Home or Self Care,2020,MUS028,OTHER SPECIFIED BONE DISEASE AND MUSCULOSKELETAL DEFORMITIES,,,203,CHEST PAIN,05,DISEASES AND DISORDERS OF THE CIRCULATORY SYSTEM,2,Moderate,Moderate,Medical,Medicare,Medicaid,,,,Y,29710.28,7875.52
New York City,Kings,7002053,001304,NYU Langone Hospital-Brooklyn,70 or Older,112,F,Other Race,Spanish/Hispanic,1,Emergency,Home or Self Care,2020,CIR012,NONSPECIFIC CHEST PAIN,,,203,CHEST PAIN,05,DISEASES AND DISORDERS OF THE CIRCULATORY SYSTEM,1,Minor,Minor,Medical,Medicare,Medicaid,,,,Y,24434.18,7701.88
New York City,Kings,7002053,001304,NYU Langone Hospital-Brooklyn,30 to 49,112,M,Other Race,Spanish/Hispanic,1,Emergency,Home or Self Care,2020,MUS028,OTHER SPECIFIED BONE DISEASE AND MUSCULOSKELETAL DEFORMITIES,,,203,CHEST PAIN,05,DISEASES AND DISORDERS OF THE CIRCULATORY SYSTEM,2,Moderate,Moderate,Medical,Medicaid,,,,,Y,33489.7,9717.26
New York City,Kings,7002053,001304,NYU Langone Hospital-Brooklyn,70 or Older,112,F,Black/African American,Not Span/Hispanic,1,Emergency,Home or Self Care,2020,CIR012,NONSPECIFIC CHEST PAIN,,,203,CHEST PAIN,05,DISEASES AND DISORDERS OF THE CIRCULATORY SYSTEM,1,Minor,Minor,Medical,Medicare,,,,,Y,43611.69,9456.98
New York City,Kings,7002053,001304,NYU Langone Hospital-Brooklyn,70 or Older,112,F,Other Race,Spanish/Hispanic,1,Emergency,Home or Self Care,2020,CIR012,NONSPECIFIC CHEST PAIN,IMG008,ULTRASONOGRAPHY,203,CHEST PAIN,05,DISEASES AND DISORDERS OF THE CIRCULATORY SYSTEM,2,Moderate,Minor,Medical,Medicare,,,,,Y,27130.58,8077.33
New York City,Kings,7002053,001304,NYU Langone Hospital-Brooklyn,30 to 49,112,F,Other Race,Not Span/Hispanic,1,Emergency,Home or Self Care,2020,MUS028,OTHER SPECIFIED BONE DISEASE AND MUSCULOSKELETAL DEFORMITIES,,,203,CHEST PAIN,05,DISEASES AND DISORDERS OF THE CIRCULATORY SYSTEM,2,Moderate,Minor,Medical,Medicaid,,,,,Y,19904.15,4533.33
New York City,Kings,7002053,001304,NYU Langone Hospital-Brooklyn,70 or Older,,F,Black/African American,Unknown,1,Emergency,Home or Self Care,2020,CIR012,NONSPECIFIC CHEST PAIN,,,203,CHEST PAIN,05,DISEASES AND DISORDERS OF THE CIRCULATORY SYSTEM,1,Minor,Minor,Medical,Medicaid,,,,,Y,18764.69,4505.63
New York City,Kings,7002053,001304,NYU Langone Hospital-Brooklyn,50 to 69,112,M,Other Race,Spanish/Hispanic,1,Emergency,Home or Self Care,2020,MUS028,OTHER SPECIFIED BONE DISEASE AND MUSCULOSKELETAL DEFORMITIES,,,203,CHEST PAIN,05,DISEASES AND DISORDERS OF THE CIRCULATORY SYSTEM,2,Moderate,Minor,Medical,Medicaid,,,,,Y,28537.02,8201.01
New York City,Kings,7002053,001304,NYU Langone Hospital-Brooklyn,50 to 69,112,F,White,Unknown,1,Emergency,Home or Self Care,2020,CIR012,NONSPECIFIC CHEST PAIN,,,203,CHEST PAIN,05,DISEASES AND DISORDERS OF THE CIRCULATORY SYSTEM,1,Minor,Minor,Medical,Medicaid,,,,,Y,27529.87,7553.02
New York City,Kings,7002053,001304,NYU Langone Hospital-Brooklyn,50 to 69,112,F,White,Not Span/Hispanic,1,Emergency,Home or Self Care,2020,CIR012,NONSPECIFIC CHEST PAIN,MAM004,CARDIAC STRESS TESTS,203,CHEST PAIN,05,DISEASES AND DISORDERS OF THE CIRCULATORY SYSTEM,1,Minor,Minor,Medical,Private Health Insurance,,,,,Y,24533.14,7392.25
New York City,Kings,7002053,001304,NYU Langone Hospital-Brooklyn,50 to 69,112,F,Other Race,Not Span/Hispanic,1,Emergency,Home or Self Care,2020,CIR012,NONSPECIFIC CHEST PAIN,,,203,CHEST PAIN,05,DISEASES AND DISORDERS OF THE CIRCULATORY SYSTEM,1,Minor,Minor,Medical,Private Health Insurance,,,,,Y,27428.94,8000.36
New York City,Kings,7002053,001304,NYU Langone Hospital-Brooklyn,30 to 49,112,F,Other Race,Unknown,2,Emergency,Home or Self Care,2020,CIR012,NONSPECIFIC CHEST PAIN,,,203,CHEST PAIN,05,DISEASES AND DISORDERS OF THE CIRCULATORY SYSTEM,2,Moderate,Minor,Medical,Private Health Insurance,,,,,Y,36823.54,9097.69
New York City,Kings,7002053,001304,NYU Langone Hospital-Brooklyn,70 or Older,112,M,Other Race,Spanish/Hispanic,4,Emergency,Home or Self Care,2020,CIR012,NONSPECIFIC CHEST PAIN,,,203,CHEST PAIN,05,DISEASES AND DISORDERS OF THE CIRCULATORY SYSTEM,2,Moderate,Moderate,Medical,Medicare,Private Health Insurance,,,,Y,83936.96,24115.93
New York City,Kings,7002053,001304,NYU Langone Hospital-Brooklyn,30 to 49,112,F,Black/African American,Not Span/Hispanic,1,Emergency,Home or Self Care,2020,CIR012,NONSPECIFIC CHEST PAIN,,,203,CHEST PAIN,05,DISEASES AND DISORDERS OF THE CIRCULATORY SYSTEM,1,Minor,Minor,Medical,Blue Cross/Blue Shield,,,,,Y,33413.29,8932.11
New York City,Kings,7002053,001304,NYU Langone Hospital-Brooklyn,50 to 69,112,F,White,Not Span/Hispanic,1,Emergency,Home or Self Care,2020,CIR012,NONSPECIFIC CHEST PAIN,IMG008,ULTRASONOGRAPHY,203,CHEST PAIN,05,DISEASES AND DISORDERS OF THE CIRCULATORY SYSTEM,1,Minor,Minor,Medical,Private Health Insurance,,,,,Y,27726.59,8257.06
New York City,Kings,7002053,001304,NYU Langone Hospital-Brooklyn,50 to 69,112,F,Black/African American,Not Span/Hispanic,1,Emergency,Home or Self Care,2020,CIR012,NONSPECIFIC CHEST PAIN,IMG008,ULTRASONOGRAPHY,203,CHEST PAIN,05,DISEASES AND DISORDERS OF THE CIRCULATORY SYSTEM,1,Minor,Minor,Medical,Private Health Insurance,,,,,Y,36369.5,9492.01
New York City,Kings,7002053,001304,NYU Langone Hospital-Brooklyn,50 to 69,112,F,Other Race,Spanish/Hispanic,1,Emergency,Home or Self Care,2020,CIR012,NONSPECIFIC CHEST PAIN,ADM021,"ADMINISTRATION OF THERAPEUTIC SUBSTANCES, NEC",203,CHEST PAIN,05,DISEASES AND DISORDERS OF THE CIRCULATORY SYSTEM,1,Minor,Minor,Medical,Medicaid,,,,,Y,25934.48,8016.86
New York City,Kings,7002053,001304,NYU Langone Hospital-Brooklyn,50 to 69,100,M,Other Race,Not Span/Hispanic,1,Emergency,Home or Self Care,2020,CIR012,NONSPECIFIC CHEST PAIN,,,203,CHEST PAIN,05,DISEASES AND DISORDERS OF THE CIRCULATORY SYSTEM,1,Minor,Minor,Medical,Medicaid,,,,,Y,38545.36,8023.39
New York City,Kings,7002053,001304,NYU Langone Hospital-Brooklyn,70 or Older,116,F,White,Not Span/Hispanic,13,Emergency,Hospice - Home,2020,MUS028,OTHER SPECIFIED BONE DISEASE AND MUSCULOSKELETAL DEFORMITIES,ADM014,REGIONAL ANESTHESIA,203,CHEST PAIN,05,DISEASES AND DISORDERS OF THE CIRCULATORY SYSTEM,4,Extreme,Major,Medical,Medicare,Private Health Insurance,,,,Y,166667.29,52091.03
New York City,Kings,7002053,001304,NYU Langone Hospital-Brooklyn,50 to 69,112,F,Other Race,Spanish/Hispanic,1,Emergency,Home or Self Care,2020,CIR012,NONSPECIFIC CHEST PAIN,,,203,CHEST PAIN,05,DISEASES AND DISORDERS OF THE CIRCULATORY SYSTEM,1,Minor,Minor,Medical,Private Health Insurance,,,,,Y,36956.09,9729.14
New York City,Kings,7002053,001304,NYU Langone Hospital-Brooklyn,50 to 69,112,M,White,Not Span/Hispanic,1,Emergency,Home or Self Care,2020,CIR012,NONSPECIFIC CHEST PAIN,,,203,CHEST PAIN,05,DISEASES AND DISORDERS OF THE CIRCULATORY SYSTEM,2,Moderate,Moderate,Medical,Medicare,,,,,Y,45209.51,10122.04
New York City,Kings,7002053,001304,NYU Langone Hospital-Brooklyn,70 or Older,112,F,Other Race,Spanish/Hispanic,1,Emergency,Home or Self Care,2020,CIR012,NONSPECIFIC CHEST PAIN,ADM021,"ADMINISTRATION OF THERAPEUTIC SUBSTANCES, NEC",203,CHEST PAIN,05,DISEASES AND DISORDERS OF THE CIRCULATORY SYSTEM,1,Minor,Minor,Medical,Medicare,,,,,Y,33106.66,9015.36
New York City,Kings,7002053,001304,NYU Langone Hospital-Brooklyn,50 to 69,112,F,Other Race,Spanish/Hispanic,1,Emergency,Home or Self Care,2020,CIR012,NONSPECIFIC CHEST PAIN,,,203,CHEST PAIN,05,DISEASES AND DISORDERS OF THE CIRCULATORY SYSTEM,2,Moderate,Minor,Medical,Medicaid,,,,,Y,41428.58,9505.06
New York City,Kings,7002053,001304,NYU Langone Hospital-Brooklyn,50 to 69,112,F,Multi-racial,Spanish/Hispanic,3,Emergency,Home or Self Care,2020,CIR012,NONSPECIFIC CHEST PAIN,,,203,CHEST PAIN,05,DISEASES AND DISORDERS OF THE CIRCULATORY SYSTEM,2,Moderate,Minor,Medical,Blue Cross/Blue Shield,Blue Cross/Blue Shield,,,,Y,52378.74,15150.12
New York City,Kings,7002053,001304,NYU Langone Hospital-Brooklyn,50 to 69,112,F,White,Not Span/Hispanic,1,Emergency,Home or Self Care,2020,CIR012,NONSPECIFIC CHEST PAIN,,,203,CHEST PAIN,05,DISEASES AND DISORDERS OF THE CIRCULATORY SYSTEM,1,Minor,Minor,Medical,Medicaid,,,,,Y,49756.74,10812.3
New York City,Kings,7002053,001304,NYU Langone Hospital-Brooklyn,30 to 49,112,F,Other Race,Unknown,1,Emergency,Home or Self Care,2020,CIR012,NONSPECIFIC CHEST PAIN,MAM004,CARDIAC STRESS TESTS,203,CHEST PAIN,05,DISEASES AND DISORDERS OF THE CIRCULATORY SYSTEM,2,Moderate,Moderate,Medical,Medicaid,,,,,Y,40015.42,9466.32
New York City,Kings,7002053,001304,NYU Langone Hospital-Brooklyn,70 or Older,112,F,Other Race,Not Span/Hispanic,1,Emergency,Home or Self Care,2020,CIR012,NONSPECIFIC CHEST PAIN,,,203,CHEST PAIN,05,DISEASES AND DISORDERS OF THE CIRCULATORY SYSTEM,2,Moderate,Minor,Medical,Medicare,,,,,Y,14920.52,4238.51
New York City,Kings,7002053,001304,NYU Langone Hospital-Brooklyn,30 to 49,112,M,White,Unknown,1,Emergency,Home or Self Care,2020,CIR012,NONSPECIFIC CHEST PAIN,,,203,CHEST PAIN,05,DISEASES AND DISORDERS OF THE CIRCULATORY SYSTEM,1,Minor,Minor,Medical,Medicaid,,,,,Y,24301.51,6791.53
New York City,Kings,7002053,001304,NYU Langone Hospital-Brooklyn,50 to 69,112,F,Other Race,Spanish/Hispanic,1,Emergency,Home or Self Care,2020,CIR012,NONSPECIFIC CHEST PAIN,ADM021,"ADMINISTRATION OF THERAPEUTIC SUBSTANCES, NEC",203,CHEST PAIN,05,DISEASES AND DISORDERS OF THE CIRCULATORY SYSTEM,1,Minor,Minor,Medical,Private Health Insurance,,,,,Y,26407.91,8252.59
New York City,Kings,7002053,001304,NYU Langone Hospital-Brooklyn,70 or Older,112,F,Black/African American,Not Span/Hispanic,1,Emergency,Home or Self Care,2020,MUS028,OTHER SPECIFIED BONE DISEASE AND MUSCULOSKELETAL DEFORMITIES,,,203,CHEST PAIN,05,DISEASES AND DISORDERS OF THE CIRCULATORY SYSTEM,1,Minor,Minor,Medical,Medicare,Medicaid,,,,Y,30786.26,8992.65
New York City,Kings,7002053,001304,NYU Langone Hospital-Brooklyn,30 to 49,103,M,Other Race,Unknown,1,Emergency,Home or Self Care,2020,CIR012,NONSPECIFIC CHEST PAIN,,,203,CHEST PAIN,05,DISEASES AND DISORDERS OF THE CIRCULATORY SYSTEM,1,Minor,Minor,Medical,Medicaid,,,,,Y,25706.25,7949.07
New York City,Kings,7002053,001304,NYU Langone Hospital-Brooklyn,50 to 69,112,F,White,Unknown,1,Emergency,Home or Self Care,2020,CIR012,NONSPECIFIC CHEST PAIN,,,203,CHEST PAIN,05,DISEASES AND DISORDERS OF THE CIRCULATORY SYSTEM,1,Minor,Minor,Medical,Medicare,Medicare,,,,Y,30105.5,8412.36
New York City,Kings,7002053,001304,NYU Langone Hospital-Brooklyn,30 to 49,112,F,Other Race,Not Span/Hispanic,1,Emergency,Home or Self Care,2020,CIR012,NONSPECIFIC CHEST PAIN,,,203,CHEST PAIN,05,DISEASES AND DISORDERS OF THE CIRCULATORY SYSTEM,1,Minor,Minor,Medical,Self-Pay,,,,,Y,22693.83,5011.84
New York City,Kings,7002053,001304,NYU Langone Hospital-Brooklyn,30 to 49,112,M,Other Race,Spanish/Hispanic,1,Emergency,Home or Self Care,2020,CIR012,NONSPECIFIC CHEST PAIN,,,203,CHEST PAIN,05,DISEASES AND DISORDERS OF THE CIRCULATORY SYSTEM,2,Moderate,Moderate,Medical,Medicaid,,,,,Y,39571.91,9761.35
New York City,Kings,7002053,001304,NYU Langone Hospital-Brooklyn,50 to 69,100,M,Other Race,Not Span/Hispanic,1,Emergency,Home or Self Care,2020,CIR012,NONSPECIFIC CHEST PAIN,,,203,CHEST PAIN,05,DISEASES AND DISORDERS OF THE CIRCULATORY SYSTEM,2,Moderate,Moderate,Medical,Medicaid,,,,,Y,30228.51,8547.2
New York City,Kings,7002053,001304,NYU Langone Hospital-Brooklyn,30 to 49,112,F,White,Not Span/Hispanic,2,Emergency,Home w/ Home Health Services,2020,CIR012,NONSPECIFIC CHEST PAIN,,,203,CHEST PAIN,05,DISEASES AND DISORDERS OF THE CIRCULATORY SYSTEM,1,Minor,Minor,Medical,Private Health Insurance,,,,,Y,51259.92,12146.32
New York City,Kings,7002053,001304,NYU Langone Hospital-Brooklyn,50 to 69,112,F,Other Race,Unknown,1,Emergency,Home or Self Care,2020,CIR012,NONSPECIFIC CHEST PAIN,OTR004,ISOLATION PROCEDURES,203,CHEST PAIN,05,DISEASES AND DISORDERS OF THE CIRCULATORY SYSTEM,1,Minor,Minor,Medical,Medicare,Medicaid,,,,Y,27705.03,7222.22
New York City,Kings,7002053,001304,NYU Langone Hospital-Brooklyn,50 to 69,112,M,Other Race,Not Span/Hispanic,1,Emergency,Home or Self Care,2020,CIR012,NONSPECIFIC CHEST PAIN,ADM021,"ADMINISTRATION OF THERAPEUTIC SUBSTANCES, NEC",203,CHEST PAIN,05,DISEASES AND DISORDERS OF THE CIRCULATORY SYSTEM,2,Moderate,Moderate,Medical,Private Health Insurance,,,,,Y,28009.7,8319.38
New York City,Kings,7002053,001304,NYU Langone Hospital-Brooklyn,50 to 69,112,F,Black/African American,Not Span/Hispanic,1,Emergency,Home or Self Care,2020,CIR012,NONSPECIFIC CHEST PAIN,,,203,CHEST PAIN,05,DISEASES AND DISORDERS OF THE CIRCULATORY SYSTEM,2,Moderate,Minor,Medical,Medicare,Medicaid,,,,Y,21779.45,4985.27
New York City,Kings,7002053,001304,NYU Langone Hospital-Brooklyn,70 or Older,112,M,Other Race,Not Span/Hispanic,1,Emergency,Home or Self Care,2020,CIR012,NONSPECIFIC CHEST PAIN,ADM021,"ADMINISTRATION OF THERAPEUTIC SUBSTANCES, NEC",203,CHEST PAIN,05,DISEASES AND DISORDERS OF THE CIRCULATORY SYSTEM,1,Minor,Minor,Medical,Medicare,Medicaid,,,,Y,30124.17,8986.62
New York City,Kings,7002053,001304,NYU Langone Hospital-Brooklyn,50 to 69,112,M,Other Race,Spanish/Hispanic,1,Emergency,Home or Self Care,2020,CIR012,NONSPECIFIC CHEST PAIN,ADM021,"ADMINISTRATION OF THERAPEUTIC SUBSTANCES, NEC",203,CHEST PAIN,05,DISEASES AND DISORDERS OF THE CIRCULATORY SYSTEM,1,Minor,Minor,Medical,Medicaid,,,,,Y,36646.59,8826.41
New York City,Kings,7002053,001304,NYU Langone Hospital-Brooklyn,70 or Older,112,F,White,Not Span/Hispanic,1,Emergency,Home or Self Care,2020,CIR012,NONSPECIFIC CHEST PAIN,MAM004,CARDIAC STRESS TESTS,203,CHEST PAIN,05,DISEASES AND DISORDERS OF THE CIRCULATORY SYSTEM,2,Moderate,Minor,Medical,Medicare,Medicaid,,,,Y,66894.46,14633.97
New York City,Kings,7002053,001304,NYU Langone Hospital-Brooklyn,50 to 69,112,F,Other Race,Unknown,1,Emergency,Home or Self Care,2020,CIR012,NONSPECIFIC CHEST PAIN,OTR004,ISOLATION PROCEDURES,203,CHEST PAIN,05,DISEASES AND DISORDERS OF THE CIRCULATORY SYSTEM,2,Moderate,Minor,Medical,Private Health Insurance,,,,,Y,25092.57,5336.45
New York City,Kings,7002053,001304,NYU Langone Hospital-Brooklyn,30 to 49,112,F,Other Race,Spanish/Hispanic,1,Emergency,Home or Self Care,2020,CIR012,NONSPECIFIC CHEST PAIN,MAM004,CARDIAC STRESS TESTS,203,CHEST PAIN,05,DISEASES AND DISORDERS OF THE CIRCULATORY SYSTEM,1,Minor,Minor,Medical,Medicaid,,,,,Y,33422.78,9393.46
New York City,Kings,7002053,001304,NYU Langone Hospital-Brooklyn,30 to 49,112,F,Other Race,Spanish/Hispanic,1,Emergency,Home or Self Care,2020,CIR012,NONSPECIFIC CHEST PAIN,OTR004,ISOLATION PROCEDURES,203,CHEST PAIN,05,DISEASES AND DISORDERS OF THE CIRCULATORY SYSTEM,1,Minor,Minor,Medical,Medicaid,,,,,Y,16120.6,4304.05
New York City,Kings,7002053,001304,NYU Langone Hospital-Brooklyn,50 to 69,112,F,Other Race,Spanish/Hispanic,1,Emergency,Home or Self Care,2020,CIR012,NONSPECIFIC CHEST PAIN,OTR004,ISOLATION PROCEDURES,203,CHEST PAIN,05,DISEASES AND DISORDERS OF THE CIRCULATORY SYSTEM,1,Minor,Minor,Medical,Medicare,Medicaid,,,,Y,41146.36,7116.32
New York City,Kings,7002053,001304,NYU Langone Hospital-Brooklyn,50 to 69,112,F,Black/African American,Not Span/Hispanic,5,Emergency,Home w/ Home Health Services,2020,CIR012,NONSPECIFIC CHEST PAIN,IMG008,ULTRASONOGRAPHY,203,CHEST PAIN,05,DISEASES AND DISORDERS OF THE CIRCULATORY SYSTEM,2,Moderate,Minor,Medical,Medicare,Medicaid,,,,Y,82659.83,23281.84
New York City,Kings,7002053,001304,NYU Langone Hospital-Brooklyn,50 to 69,112,F,White,Not Span/Hispanic,2,Emergency,Home w/ Home Health Services,2020,CIR012,NONSPECIFIC CHEST PAIN,,,203,CHEST PAIN,05,DISEASES AND DISORDERS OF THE CIRCULATORY SYSTEM,1,Minor,Minor,Medical,Private Health Insurance,,,,,Y,46967.48,10266.5
New York City,Kings,7002053,001304,NYU Langone Hospital-Brooklyn,70 or Older,112,F,Other Race,Not Span/Hispanic,2,Emergency,Home or Self Care,2020,CIR012,NONSPECIFIC CHEST PAIN,MAM004,CARDIAC STRESS TESTS,203,CHEST PAIN,05,DISEASES AND DISORDERS OF THE CIRCULATORY SYSTEM,1,Minor,Minor,Medical,Medicaid,,,,,Y,44783.79,9466.58
New York City,Kings,7002053,001304,NYU Langone Hospital-Brooklyn,70 or Older,112,F,Other Race,Spanish/Hispanic,1,Emergency,Home or Self Care,2020,MUS028,OTHER SPECIFIED BONE DISEASE AND MUSCULOSKELETAL DEFORMITIES,IMG008,ULTRASONOGRAPHY,203,CHEST PAIN,05,DISEASES AND DISORDERS OF THE CIRCULATORY SYSTEM,1,Minor,Minor,Medical,Medicare,Blue Cross/Blue Shield,,,,Y,36823.77,6724.4
New York City,Kings,7002053,001304,NYU Langone Hospital-Brooklyn,18 to 29,112,M,Other Race,Not Span/Hispanic,1,Emergency,Home or Self Care,2020,CIR012,NONSPECIFIC CHEST PAIN,ADM021,"ADMINISTRATION OF THERAPEUTIC SUBSTANCES, NEC",203,CHEST PAIN,05,DISEASES AND DISORDERS OF THE CIRCULATORY SYSTEM,2,Moderate,Moderate,Medical,Private Health Insurance,,,,,Y,29846.68,5999.31
New York City,Kings,7002053,001304,NYU Langone Hospital-Brooklyn,70 or Older,112,F,Other Race,Spanish/Hispanic,2,Emergency,Home or Self Care,2020,MUS028,OTHER SPECIFIED BONE DISEASE AND MUSCULOSKELETAL DEFORMITIES,OTR004,ISOLATION PROCEDURES,203,CHEST PAIN,05,DISEASES AND DISORDERS OF THE CIRCULATORY SYSTEM,2,Moderate,Minor,Medical,Medicare,Medicaid,,,,Y,43047.86,9326.5
New York City,Kings,7002053,001304,NYU Langone Hospital-Brooklyn,50 to 69,112,F,White,Spanish/Hispanic,1,Emergency,Home or Self Care,2020,CIR012,NONSPECIFIC CHEST PAIN,OTR004,ISOLATION PROCEDURES,203,CHEST PAIN,05,DISEASES AND DISORDERS OF THE CIRCULATORY SYSTEM,1,Minor,Minor,Medical,Medicare,Medicaid,,,,Y,20806.76,4903.39
New York City,Kings,7002053,001304,NYU Langone Hospital-Brooklyn,18 to 29,112,M,White,Not Span/Hispanic,2,Emergency,Home or Self Care,2020,CIR012,NONSPECIFIC CHEST PAIN,IMG008,ULTRASONOGRAPHY,203,CHEST PAIN,05,DISEASES AND DISORDERS OF THE CIRCULATORY SYSTEM,2,Moderate,Moderate,Medical,Medicaid,,,,,Y,35715.42,8922.87
New York City,Kings,7002053,001304,NYU Langone Hospital-Brooklyn,50 to 69,112,M,White,Not Span/Hispanic,1,Emergency,Left Against Medical Advice,2020,CIR012,NONSPECIFIC CHEST PAIN,ADM021,"ADMINISTRATION OF THERAPEUTIC SUBSTANCES, NEC",203,CHEST PAIN,05,DISEASES AND DISORDERS OF THE CIRCULATORY SYSTEM,2,Moderate,Minor,Medical,Medicaid,,,,,Y,16399.44,4252.52
New York City,Kings,7002053,001304,NYU Langone Hospital-Brooklyn,30 to 49,112,F,Black/African American,Not Span/Hispanic,1,Emergency,Home or Self Care,2020,CIR012,NONSPECIFIC CHEST PAIN,OTR004,ISOLATION PROCEDURES,203,CHEST PAIN,05,DISEASES AND DISORDERS OF THE CIRCULATORY SYSTEM,1,Minor,Minor,Medical,Private Health Insurance,,,,,Y,29836.8,6217.46
New York City,Kings,7002053,001304,NYU Langone Hospital-Brooklyn,50 to 69,112,F,White,Not Span/Hispanic,3,Emergency,Left Against Medical Advice,2020,CIR012,NONSPECIFIC CHEST PAIN,OTR004,ISOLATION PROCEDURES,203,CHEST PAIN,05,DISEASES AND DISORDERS OF THE CIRCULATORY SYSTEM,1,Minor,Minor,Medical,Medicaid,,,,,Y,48153.91,15470.56
New York City,Kings,7002053,001304,NYU Langone Hospital-Brooklyn,30 to 49,112,F,Other Race,Spanish/Hispanic,2,Emergency,Home or Self Care,2020,CIR012,NONSPECIFIC CHEST PAIN,,,203,CHEST PAIN,05,DISEASES AND DISORDERS OF THE CIRCULATORY SYSTEM,2,Moderate,Minor,Medical,Medicaid,,,,,Y,49226.63,9813.2
New York City,Kings,7002053,001304,NYU Langone Hospital-Brooklyn,70 or Older,103,F,White,Not Span/Hispanic,2,Emergency,Home w/ Home Health Services,2020,CIR012,NONSPECIFIC CHEST PAIN,MAM004,CARDIAC STRESS TESTS,203,CHEST PAIN,05,DISEASES AND DISORDERS OF THE CIRCULATORY SYSTEM,3,Major,Moderate,Medical,Medicare,Medicaid,,,,Y,51700.7,14955.32
New York City,Kings,7002053,001304,NYU Langone Hospital-Brooklyn,30 to 49,112,M,Other Race,Spanish/Hispanic,1,Emergency,Home or Self Care,2020,CIR012,NONSPECIFIC CHEST PAIN,,,203,CHEST PAIN,05,DISEASES AND DISORDERS OF THE CIRCULATORY SYSTEM,1,Minor,Minor,Medical,Medicaid,,,,,Y,23938.89,6352.59
New York City,Kings,7002053,001304,NYU Langone Hospital-Brooklyn,70 or Older,112,F,Other Race,Not Span/Hispanic,2,Emergency,Skilled Nursing Home,2020,CIR012,NONSPECIFIC CHEST PAIN,OTR004,ISOLATION PROCEDURES,203,CHEST PAIN,05,DISEASES AND DISORDERS OF THE CIRCULATORY SYSTEM,2,Moderate,Minor,Medical,Medicare,Medicaid,,,,Y,46950.96,15764.3
New York City,Kings,7002053,001304,NYU Langone Hospital-Brooklyn,30 to 49,112,F,Other Race,Not Span/Hispanic,2,Emergency,Home or Self Care,2020,CIR012,NONSPECIFIC CHEST PAIN,ADM021,"ADMINISTRATION OF THERAPEUTIC SUBSTANCES, NEC",203,CHEST PAIN,05,DISEASES AND DISORDERS OF THE CIRCULATORY SYSTEM,1,Minor,Minor,Medical,Private Health Insurance,,,,,Y,42724.48,12062.06
New York City,Kings,7002053,001304,NYU Langone Hospital-Brooklyn,18 to 29,112,M,Other Race,Not Span/Hispanic,1,Emergency,Home or Self Care,2020,CIR012,NONSPECIFIC CHEST PAIN,,,203,CHEST PAIN,05,DISEASES AND DISORDERS OF THE CIRCULATORY SYSTEM,2,Moderate,Moderate,Medical,Self-Pay,,,,,Y,39435.53,11883.89
New York City,Kings,7002053,001304,NYU Langone Hospital-Brooklyn,30 to 49,112,F,Other Race,Spanish/Hispanic,4,Emergency,Home or Self Care,2020,CIR012,NONSPECIFIC CHEST PAIN,ESA001,HEMODIALYSIS,203,CHEST PAIN,05,DISEASES AND DISORDERS OF THE CIRCULATORY SYSTEM,3,Major,Moderate,Medical,Medicaid,,,,,Y,85225.01,23509.33
New York City,Kings,7002053,001304,NYU Langone Hospital-Brooklyn,70 or Older,112,F,White,Not Span/Hispanic,3,Emergency,Home w/ Home Health Services,2020,CIR012,NONSPECIFIC CHEST PAIN,ADM021,"ADMINISTRATION OF THERAPEUTIC SUBSTANCES, NEC",203,CHEST PAIN,05,DISEASES AND DISORDERS OF THE CIRCULATORY SYSTEM,2,Moderate,Moderate,Medical,Medicare,,,,,Y,66964.93,17770.66
New York City,Kings,7002053,001304,NYU Langone Hospital-Brooklyn,30 to 49,103,F,White,Not Span/Hispanic,1,Emergency,Home or Self Care,2020,MUS028,OTHER SPECIFIED BONE DISEASE AND MUSCULOSKELETAL DEFORMITIES,MAM004,CARDIAC STRESS TESTS,203,CHEST PAIN,05,DISEASES AND DISORDERS OF THE CIRCULATORY SYSTEM,1,Minor,Minor,Medical,Blue Cross/Blue Shield,,,,,Y,29893.97,7101.29