Hospital Service Area,Hospital County,Operating Certificate Number,Permanent Facility Id,Facility Name,Age Group,Zip Code - 3 digits,Gender,Race,Ethnicity,Length of Stay,Type of Admission,Patient Disposition,Discharge Year,CCS Diagnosis Code,CCS Diagnosis Description,CCS Procedure Code,CCS Procedure Description,APR DRG Code,APR DRG Description,APR MDC Code,APR MDC Description,APR Severity of Illness Code,APR Severity of Illness Description,APR Risk of Mortality,APR Medical Surgical Description,Payment Typology 1,Payment Typology 2,Payment Typology 3,Birth Weight,Abortion Edit Indicator,Emergency Department Indicator,Total Charges,Total Costs
New York City,Manhattan,7002053,001463,NYU Langone Hospitals,30 to 49,112,M,White,Not Span/Hispanic,1,Emergency,Home or Self Care,2020,CIR012,NONSPECIFIC CHEST PAIN,,,203,CHEST PAIN,05,DISEASES AND DISORDERS OF THE CIRCULATORY SYSTEM,2,Moderate,Minor,Medical,Medicaid,,,,,Y,34662.57,8027.64
New York City,Manhattan,7002053,001463,NYU Langone Hospitals,70 or Older,100,M,Black/African American,Not Span/Hispanic,1,Emergency,Home or Self Care,2020,CIR012,NONSPECIFIC CHEST PAIN,,,203,CHEST PAIN,05,DISEASES AND DISORDERS OF THE CIRCULATORY SYSTEM,2,Moderate,Major,Medical,Medicare,Medicaid,,,,Y,29353.9,8782.76
New York City,Manhattan,7002053,001463,NYU Langone Hospitals,50 to 69,100,F,Other Race,Not Span/Hispanic,1,Emergency,Home or Self Care,2020,CIR012,NONSPECIFIC CHEST PAIN,OTR004,ISOLATION PROCEDURES,203,CHEST PAIN,05,DISEASES AND DISORDERS OF THE CIRCULATORY SYSTEM,1,Minor,Minor,Medical,Medicare,Medicaid,,,,Y,60044.01,16198.26
New York City,Manhattan,7002053,001463,NYU Langone Hospitals,50 to 69,OOS,M,White,Not Span/Hispanic,1,Emergency,Home or Self Care,2020,CIR012,NONSPECIFIC CHEST PAIN,,,203,CHEST PAIN,05,DISEASES AND DISORDERS OF THE CIRCULATORY SYSTEM,1,Minor,Minor,Medical,Blue Cross/Blue Shield,,,,,Y,27447.82,8310.14
New York City,Manhattan,7002053,001463,NYU Langone Hospitals,50 to 69,117,F,White,Not Span/Hispanic,1,Emergency,Home or Self Care,2020,CIR012,NONSPECIFIC CHEST PAIN,,,203,CHEST PAIN,05,DISEASES AND DISORDERS OF THE CIRCULATORY SYSTEM,1,Minor,Minor,Medical,Blue Cross/Blue Shield,,,,,Y,34183.18,9266.69
New York City,Manhattan,7002053,001463,NYU Langone Hospitals,50 to 69,100,M,Black/African American,Not Span/Hispanic,1,Emergency,Home or Self Care,2020,CIR012,NONSPECIFIC CHEST PAIN,,,203,CHEST PAIN,05,DISEASES AND DISORDERS OF THE CIRCULATORY SYSTEM,2,Moderate,Moderate,Medical,Medicare,Blue Cross/Blue Shield,,,,Y,42485.59,10002
New York City,Manhattan,7002053,001463,NYU Langone Hospitals,18 to 29,104,M,Other Race,Spanish/Hispanic,2,Emergency,Home w/ Home Health Services,2020,CIR012,NONSPECIFIC CHEST PAIN,,,203,CHEST PAIN,05,DISEASES AND DISORDERS OF THE CIRCULATORY SYSTEM,2,Moderate,Moderate,Medical,Medicare,Medicaid,,,,Y,44689.7,9942.87
New York City,Manhattan,7002053,001463,NYU Langone Hospitals,18 to 29,104,M,Other Race,Spanish/Hispanic,1,Emergency,Left Against Medical Advice,2020,CIR012,NONSPECIFIC CHEST PAIN,,,203,CHEST PAIN,05,DISEASES AND DISORDERS OF THE CIRCULATORY SYSTEM,2,Moderate,Moderate,Medical,Medicare,Medicaid,,,,Y,15331.37,4271.57
New York City,Manhattan,7002053,001463,NYU Langone Hospitals,50 to 69,112,M,White,Not Span/Hispanic,1,Emergency,Home or Self Care,2020,CIR012,NONSPECIFIC CHEST PAIN,,,203,CHEST PAIN,05,DISEASES AND DISORDERS OF THE CIRCULATORY SYSTEM,2,Moderate,Minor,Medical,Medicaid,,,,,Y,39033.51,9327.65
New York City,Manhattan,7002053,001463,NYU Langone Hospitals,30 to 49,100,F,Other Race,Not Span/Hispanic,1,Emergency,Home or Self Care,2020,CIR012,NONSPECIFIC CHEST PAIN,,,203,CHEST PAIN,05,DISEASES AND DISORDERS OF THE CIRCULATORY SYSTEM,2,Moderate,Minor,Medical,Blue Cross/Blue Shield,,,,,Y,42391.87,8860.81
New York City,Manhattan,7002053,001463,NYU Langone Hospitals,50 to 69,OOS,F,Other Race,Not Span/Hispanic,1,Emergency,Home or Self Care,2020,CIR012,NONSPECIFIC CHEST PAIN,,,203,CHEST PAIN,05,DISEASES AND DISORDERS OF THE CIRCULATORY SYSTEM,1,Minor,Minor,Medical,Private Health Insurance,,,,,Y,34266.36,8802.56
New York City,Manhattan,7002053,001463,NYU Langone Hospitals,50 to 69,112,F,White,Spanish/Hispanic,1,Emergency,Home or Self Care,2020,CIR012,NONSPECIFIC CHEST PAIN,,,203,CHEST PAIN,05,DISEASES AND DISORDERS OF THE CIRCULATORY SYSTEM,2,Moderate,Moderate,Medical,Medicaid,,,,,Y,31284.38,8553.76
New York City,Manhattan,7002053,001463,NYU Langone Hospitals,50 to 69,113,F,Other Race,Spanish/Hispanic,1,Emergency,Home or Self Care,2020,CIR012,NONSPECIFIC CHEST PAIN,,,203,CHEST PAIN,05,DISEASES AND DISORDERS OF THE CIRCULATORY SYSTEM,1,Minor,Minor,Medical,Blue Cross/Blue Shield,,,,,Y,34409.11,8983.87
New York City,Manhattan,7002053,001463,NYU Langone Hospitals,50 to 69,113,F,Other Race,Spanish/Hispanic,1,Emergency,Home or Self Care,2020,CIR012,NONSPECIFIC CHEST PAIN,ADM017,ADMINISTRATION OF NUTRITIONAL AND ELECTROLYTIC SUBSTANCES,203,CHEST PAIN,05,DISEASES AND DISORDERS OF THE CIRCULATORY SYSTEM,3,Major,Minor,Medical,Blue Cross/Blue Shield,Federal/State/Local/VA,,,,Y,26534,7831.05
New York City,Manhattan,7002053,001463,NYU Langone Hospitals,50 to 69,112,F,Other Race,Not Span/Hispanic,1,Emergency,Home or Self Care,2020,CIR012,NONSPECIFIC CHEST PAIN,,,203,CHEST PAIN,05,DISEASES AND DISORDERS OF THE CIRCULATORY SYSTEM,1,Minor,Minor,Medical,Private Health Insurance,,,,,Y,32981.54,9289.44
New York City,Manhattan,7002053,001463,NYU Langone Hospitals,50 to 69,100,F,White,Not Span/Hispanic,1,Emergency,Home w/ Home Health Services,2020,CIR012,NONSPECIFIC CHEST PAIN,,,203,CHEST PAIN,05,DISEASES AND DISORDERS OF THE CIRCULATORY SYSTEM,2,Moderate,Minor,Medical,Medicare,Medicaid,,,,Y,39312.38,10922.49
New York City,Manhattan,7002053,001463,NYU Langone Hospitals,50 to 69,103,F,White,Unknown,1,Emergency,Home or Self Care,2020,CIR012,NONSPECIFIC CHEST PAIN,,,203,CHEST PAIN,05,DISEASES AND DISORDERS OF THE CIRCULATORY SYSTEM,1,Minor,Minor,Medical,Blue Cross/Blue Shield,Private Health Insurance,,,,Y,29659.06,8096.5
New York City,Manhattan,7002053,001463,NYU Langone Hospitals,18 to 29,100,M,White,Not Span/Hispanic,1,Emergency,Home or Self Care,2020,CIR012,NONSPECIFIC CHEST PAIN,,,203,CHEST PAIN,05,DISEASES AND DISORDERS OF THE CIRCULATORY SYSTEM,1,Minor,Minor,Medical,Blue Cross/Blue Shield,,,,,Y,32622.41,9343.26
New York City,Manhattan,7002053,001463,NYU Langone Hospitals,50 to 69,112,F,Black/African American,Not Span/Hispanic,1,Emergency,Home or Self Care,2020,CIR012,NONSPECIFIC CHEST PAIN,,,203,CHEST PAIN,05,DISEASES AND DISORDERS OF THE CIRCULATORY SYSTEM,1,Minor,Minor,Medical,Medicaid,,,,,Y,44792.75,10822.39
New York City,Manhattan,7002053,001463,NYU Langone Hospitals,50 to 69,100,M,White,Not Span/Hispanic,1,Emergency,Home or Self Care,2020,CIR012,NONSPECIFIC CHEST PAIN,,,203,CHEST PAIN,05,DISEASES AND DISORDERS OF THE CIRCULATORY SYSTEM,1,Minor,Minor,Medical,Private Health Insurance,,,,,Y,28834.53,8213.6
New York City,Manhattan,7002053,001463,NYU Langone Hospitals,70 or Older,111,F,Other Race,Unknown,1,Emergency,Home or Self Care,2020,CIR012,NONSPECIFIC CHEST PAIN,,,203,CHEST PAIN,05,DISEASES AND DISORDERS OF THE CIRCULATORY SYSTEM,1,Minor,Minor,Medical,Medicare,,,,,Y,40832.19,10024.27
New York City,Manhattan,7002053,001463,NYU Langone Hospitals,50 to 69,112,F,White,Not Span/Hispanic,1,Emergency,Home or Self Care,2020,CIR012,NONSPECIFIC CHEST PAIN,,,203,CHEST PAIN,05,DISEASES AND DISORDERS OF THE CIRCULATORY SYSTEM,1,Minor,Minor,Medical,Private Health Insurance,,,,,Y,31038.41,7606.3
New York City,Manhattan,7002053,001463,NYU Langone Hospitals,70 or Older,100,F,Other Race,Spanish/Hispanic,1,Emergency,Home or Self Care,2020,CIR012,NONSPECIFIC CHEST PAIN,,,203,CHEST PAIN,05,DISEASES AND DISORDERS OF THE CIRCULATORY SYSTEM,1,Minor,Moderate,Medical,Medicare,,,,,Y,56175.75,15367.02
New York City,Manhattan,7002053,001463,NYU Langone Hospitals,30 to 49,100,M,White,Not Span/Hispanic,1,Emergency,Home or Self Care,2020,MUS028,OTHER SPECIFIED BONE DISEASE AND MUSCULOSKELETAL DEFORMITIES,,,203,CHEST PAIN,05,DISEASES AND DISORDERS OF THE CIRCULATORY SYSTEM,2,Moderate,Moderate,Medical,Private Health Insurance,,,,,Y,24973.73,5408.84
New York City,Manhattan,7002053,001463,NYU Langone Hospitals,50 to 69,100,M,Black/African American,Not Span/Hispanic,1,Emergency,Home or Self Care,2020,CIR012,NONSPECIFIC CHEST PAIN,,,203,CHEST PAIN,05,DISEASES AND DISORDERS OF THE CIRCULATORY SYSTEM,1,Minor,Minor,Medical,Medicaid,,,,,Y,35599.64,10045.7
New York City,Manhattan,7002053,001463,NYU Langone Hospitals,30 to 49,112,M,White,Not Span/Hispanic,1,Emergency,Home or Self Care,2020,CIR012,NONSPECIFIC CHEST PAIN,,,203,CHEST PAIN,05,DISEASES AND DISORDERS OF THE CIRCULATORY SYSTEM,1,Minor,Minor,Medical,Medicaid,,,,,Y,23667.25,7043.19
New York City,Manhattan,7002053,001463,NYU Langone Hospitals,50 to 69,104,M,Other Race,Not Span/Hispanic,1,Emergency,Home or Self Care,2020,CIR012,NONSPECIFIC CHEST PAIN,,,203,CHEST PAIN,05,DISEASES AND DISORDERS OF THE CIRCULATORY SYSTEM,1,Minor,Minor,Medical,Private Health Insurance,,,,,Y,33562.71,9132.35
New York City,Manhattan,7002053,001463,NYU Langone Hospitals,30 to 49,100,F,White,Not Span/Hispanic,1,Emergency,Home or Self Care,2020,CIR012,NONSPECIFIC CHEST PAIN,,,203,CHEST PAIN,05,DISEASES AND DISORDERS OF THE CIRCULATORY SYSTEM,1,Minor,Minor,Medical,Private Health Insurance,,,,,Y,31953.42,8076.95
New York City,Manhattan,7002053,001463,NYU Langone Hospitals,30 to 49,100,M,Black/African American,Not Span/Hispanic,1,Emergency,Home or Self Care,2020,CIR012,NONSPECIFIC CHEST PAIN,,,203,CHEST PAIN,05,DISEASES AND DISORDERS OF THE CIRCULATORY SYSTEM,1,Minor,Minor,Medical,Private Health Insurance,,,,,Y,24249.67,7567.26
New York City,Manhattan,7002053,001463,NYU Langone Hospitals,50 to 69,113,M,Other Race,Not Span/Hispanic,1,Emergency,Home or Self Care,2020,CIR012,NONSPECIFIC CHEST PAIN,,,203,CHEST PAIN,05,DISEASES AND DISORDERS OF THE CIRCULATORY SYSTEM,1,Minor,Minor,Medical,Blue Cross/Blue Shield,,,,,Y,23351.01,6630.6
New York City,Manhattan,7002053,001463,NYU Langone Hospitals,0 to 17,104,F,Other Race,Spanish/Hispanic,2,Emergency,Home or Self Care,2020,MUS028,OTHER SPECIFIED BONE DISEASE AND MUSCULOSKELETAL DEFORMITIES,,,203,CHEST PAIN,05,DISEASES AND DISORDERS OF THE CIRCULATORY SYSTEM,1,Minor,Minor,Medical,Medicaid,,,,,Y,24446.38,5775.24
New York City,Manhattan,7002053,001463,NYU Langone Hospitals,50 to 69,100,M,White,Not Span/Hispanic,1,Emergency,Home or Self Care,2020,CIR012,NONSPECIFIC CHEST PAIN,,,203,CHEST PAIN,05,DISEASES AND DISORDERS OF THE CIRCULATORY SYSTEM,1,Minor,Minor,Medical,Blue Cross/Blue Shield,,,,,Y,36726.6,9524.29
New York City,Manhattan,7002053,001463,NYU Langone Hospitals,50 to 69,112,F,Black/African American,Not Span/Hispanic,1,Emergency,Home or Self Care,2020,CIR012,NONSPECIFIC CHEST PAIN,,,203,CHEST PAIN,05,DISEASES AND DISORDERS OF THE CIRCULATORY SYSTEM,1,Minor,Minor,Medical,Private Health Insurance,,,,,Y,24543.76,7813.61
New York City,Manhattan,7002053,001463,NYU Langone Hospitals,70 or Older,100,M,White,Not Span/Hispanic,1,Emergency,Home or Self Care,2020,CIR012,NONSPECIFIC CHEST PAIN,,,203,CHEST PAIN,05,DISEASES AND DISORDERS OF THE CIRCULATORY SYSTEM,1,Minor,Minor,Medical,Private Health Insurance,Medicare,,,,Y,28744.34,7509.26
New York City,Manhattan,7002053,001463,NYU Langone Hospitals,50 to 69,114,F,Other Race,Not Span/Hispanic,1,Emergency,Home or Self Care,2020,CIR012,NONSPECIFIC CHEST PAIN,,,203,CHEST PAIN,05,DISEASES AND DISORDERS OF THE CIRCULATORY SYSTEM,1,Minor,Moderate,Medical,Blue Cross/Blue Shield,,,,,Y,26035,7988.79
New York City,Manhattan,7002053,001463,NYU Langone Hospitals,50 to 69,100,M,Other Race,Not Span/Hispanic,1,Emergency,Home or Self Care,2020,CIR012,NONSPECIFIC CHEST PAIN,,,203,CHEST PAIN,05,DISEASES AND DISORDERS OF THE CIRCULATORY SYSTEM,1,Minor,Minor,Medical,Blue Cross/Blue Shield,,,,,Y,29610.79,8089.1
New York City,Manhattan,7002053,001463,NYU Langone Hospitals,30 to 49,111,F,Black/African American,Not Span/Hispanic,1,Emergency,Home or Self Care,2020,CIR012,NONSPECIFIC CHEST PAIN,,,203,CHEST PAIN,05,DISEASES AND DISORDERS OF THE CIRCULATORY SYSTEM,1,Minor,Minor,Medical,Medicaid,,,,,Y,40342.14,10295.12
New York City,Manhattan,7002053,001463,NYU Langone Hospitals,30 to 49,117,M,White,Not Span/Hispanic,1,Emergency,Home or Self Care,2020,CIR012,NONSPECIFIC CHEST PAIN,,,203,CHEST PAIN,05,DISEASES AND DISORDERS OF THE CIRCULATORY SYSTEM,1,Minor,Minor,Medical,Blue Cross/Blue Shield,,,,,Y,33348.35,9859.57
New York City,Manhattan,7002053,001463,NYU Langone Hospitals,50 to 69,100,F,Black/African American,Not Span/Hispanic,1,Emergency,Home or Self Care,2020,CIR012,NONSPECIFIC CHEST PAIN,,,203,CHEST PAIN,05,DISEASES AND DISORDERS OF THE CIRCULATORY SYSTEM,2,Moderate,Moderate,Medical,Medicare,Medicaid,,,,Y,55811.92,13278.29
New York City,Manhattan,7002053,001463,NYU Langone Hospitals,50 to 69,114,M,Other Race,Not Span/Hispanic,1,Emergency,Home or Self Care,2020,CIR012,NONSPECIFIC CHEST PAIN,,,203,CHEST PAIN,05,DISEASES AND DISORDERS OF THE CIRCULATORY SYSTEM,1,Minor,Minor,Medical,Blue Cross/Blue Shield,,,,,Y,42246.06,10187.15
New York City,Manhattan,7002053,001463,NYU Langone Hospitals,30 to 49,100,M,White,Not Span/Hispanic,1,Emergency,Home or Self Care,2020,CIR012,NONSPECIFIC CHEST PAIN,,,203,CHEST PAIN,05,DISEASES AND DISORDERS OF THE CIRCULATORY SYSTEM,1,Minor,Minor,Medical,Blue Cross/Blue Shield,,,,,Y,31036.54,8952.01
New York City,Manhattan,7002053,001463,NYU Langone Hospitals,30 to 49,112,F,Black/African American,Not Span/Hispanic,1,Emergency,Home or Self Care,2020,CIR012,NONSPECIFIC CHEST PAIN,,,203,CHEST PAIN,05,DISEASES AND DISORDERS OF THE CIRCULATORY SYSTEM,1,Minor,Minor,Medical,Private Health Insurance,,,,,Y,18581.84,4637.4
New York City,Manhattan,7002053,001463,NYU Langone Hospitals,30 to 49,112,F,Black/African American,Not Span/Hispanic,1,Emergency,Home or Self Care,2020,CIR012,NONSPECIFIC CHEST PAIN,,,203,CHEST PAIN,05,DISEASES AND DISORDERS OF THE CIRCULATORY SYSTEM,1,Minor,Minor,Medical,Blue Cross/Blue Shield,Blue Cross/Blue Shield,,,,Y,65705.43,11090.8
New York City,Manhattan,7002053,001463,NYU Langone Hospitals,70 or Older,112,F,Other Race,Spanish/Hispanic,2,Emergency,Home w/ Home Health Services,2020,MUS028,OTHER SPECIFIED BONE DISEASE AND MUSCULOSKELETAL DEFORMITIES,,,203,CHEST PAIN,05,DISEASES AND DISORDERS OF THE CIRCULATORY SYSTEM,3,Major,Moderate,Medical,Medicare,Medicaid,,,,Y,26938.59,8053.07
New York City,Manhattan,7002053,001463,NYU Langone Hospitals,50 to 69,104,M,Other Race,Not Span/Hispanic,1,Emergency,Home or Self Care,2020,MUS028,OTHER SPECIFIED BONE DISEASE AND MUSCULOSKELETAL DEFORMITIES,,,203,CHEST PAIN,05,DISEASES AND DISORDERS OF THE CIRCULATORY SYSTEM,3,Major,Moderate,Medical,Medicare,Medicaid,,,,Y,20381.44,4593.95
New York City,Manhattan,7002053,001463,NYU Langone Hospitals,50 to 69,103,M,White,Not Span/Hispanic,1,Emergency,Home or Self Care,2020,CIR012,NONSPECIFIC CHEST PAIN,,,203,CHEST PAIN,05,DISEASES AND DISORDERS OF THE CIRCULATORY SYSTEM,1,Minor,Minor,Medical,Private Health Insurance,,,,,Y,13599.58,4098.4
New York City,Manhattan,7002053,001463,NYU Langone Hospitals,50 to 69,OOS,M,Other Race,Not Span/Hispanic,1,Emergency,Left Against Medical Advice,2020,CIR012,NONSPECIFIC CHEST PAIN,,,203,CHEST PAIN,05,DISEASES AND DISORDERS OF THE CIRCULATORY SYSTEM,3,Major,Moderate,Medical,Medicaid,,,,,Y,14256.67,4167.15
New York City,Manhattan,7002053,001463,NYU Langone Hospitals,50 to 69,100,F,Black/African American,Not Span/Hispanic,2,Emergency,Home or Self Care,2020,MUS028,OTHER SPECIFIED BONE DISEASE AND MUSCULOSKELETAL DEFORMITIES,OTR004,ISOLATION PROCEDURES,203,CHEST PAIN,05,DISEASES AND DISORDERS OF THE CIRCULATORY SYSTEM,1,Minor,Minor,Medical,Blue Cross/Blue Shield,,,,,Y,60252.3,13768.04
New York City,Manhattan,7002053,001463,NYU Langone Hospitals,50 to 69,100,M,Other Race,Spanish/Hispanic,1,Emergency,Home or Self Care,2020,CIR012,NONSPECIFIC CHEST PAIN,,,203,CHEST PAIN,05,DISEASES AND DISORDERS OF THE CIRCULATORY SYSTEM,1,Minor,Minor,Medical,Private Health Insurance,,,,,Y,25984.35,5516.69
New York City,Manhattan,7002053,001463,NYU Langone Hospitals,50 to 69,100,F,White,Not Span/Hispanic,1,Emergency,Home or Self Care,2020,CIR012,NONSPECIFIC CHEST PAIN,IMG008,ULTRASONOGRAPHY,203,CHEST PAIN,05,DISEASES AND DISORDERS OF THE CIRCULATORY SYSTEM,1,Minor,Minor,Medical,Private Health Insurance,,,,,Y,30838.39,8462.79
New York City,Manhattan,7002053,001463,NYU Langone Hospitals,50 to 69,112,M,Black/African American,Not Span/Hispanic,1,Emergency,Home or Self Care,2020,CIR012,NONSPECIFIC CHEST PAIN,,,203,CHEST PAIN,05,DISEASES AND DISORDERS OF THE CIRCULATORY SYSTEM,1,Minor,Minor,Medical,Medicare,,,,,Y,34312.55,8720.98
New York City,Manhattan,7002053,001463,NYU Langone Hospitals,50 to 69,100,M,White,Not Span/Hispanic,1,Emergency,Home or Self Care,2020,CIR012,NONSPECIFIC CHEST PAIN,IMG008,ULTRASONOGRAPHY,203,CHEST PAIN,05,DISEASES AND DISORDERS OF THE CIRCULATORY SYSTEM,1,Minor,Minor,Medical,Blue Cross/Blue Shield,,,,,Y,22386.85,5269.63
New York City,Manhattan,7002053,001463,NYU Langone Hospitals,50 to 69,100,M,White,Not Span/Hispanic,1,Emergency,Home or Self Care,2020,CIR012,NONSPECIFIC CHEST PAIN,,,203,CHEST PAIN,05,DISEASES AND DISORDERS OF THE CIRCULATORY SYSTEM,2,Moderate,Moderate,Medical,Private Health Insurance,Medicaid,,,,Y,28068.07,7714.45
New York City,Manhattan,7002053,001463,NYU Langone Hospitals,30 to 49,113,M,Other Race,Not Span/Hispanic,3,Emergency,Home or Self Care,2020,CIR012,NONSPECIFIC CHEST PAIN,,,203,CHEST PAIN,05,DISEASES AND DISORDERS OF THE CIRCULATORY SYSTEM,3,Major,Moderate,Medical,Medicaid,,,,,Y,39839.31,11775.86
New York City,Manhattan,7002053,001463,NYU Langone Hospitals,70 or Older,113,F,White,Not Span/Hispanic,1,Emergency,Home or Self Care,2020,CIR012,NONSPECIFIC CHEST PAIN,,,203,CHEST PAIN,05,DISEASES AND DISORDERS OF THE CIRCULATORY SYSTEM,3,Major,Moderate,Medical,Medicare,Medicare,,,,Y,48786.93,13164.55
New York City,Manhattan,7002053,001463,NYU Langone Hospitals,50 to 69,112,F,Black/African American,Not Span/Hispanic,1,Emergency,Home or Self Care,2020,MUS028,OTHER SPECIFIED BONE DISEASE AND MUSCULOSKELETAL DEFORMITIES,,,203,CHEST PAIN,05,DISEASES AND DISORDERS OF THE CIRCULATORY SYSTEM,1,Minor,Minor,Medical,Private Health Insurance,,,,,Y,28240.85,7118.85
New York City,Manhattan,7002053,001463,NYU Langone Hospitals,50 to 69,103,F,Other Race,Unknown,2,Emergency,Home or Self Care,2020,CIR012,NONSPECIFIC CHEST PAIN,OTR004,ISOLATION PROCEDURES,203,CHEST PAIN,05,DISEASES AND DISORDERS OF THE CIRCULATORY SYSTEM,1,Minor,Minor,Medical,Medicaid,,,,,Y,61236.97,16273.94
New York City,Manhattan,7002053,001463,NYU Langone Hospitals,50 to 69,113,F,Other Race,Spanish/Hispanic,1,Emergency,Home or Self Care,2020,CIR012,NONSPECIFIC CHEST PAIN,,,203,CHEST PAIN,05,DISEASES AND DISORDERS OF THE CIRCULATORY SYSTEM,1,Minor,Minor,Medical,Medicare,,,,,Y,36518.92,11093.3
New York City,Manhattan,7002053,001463,NYU Langone Hospitals,70 or Older,100,F,Black/African American,Not Span/Hispanic,1,Emergency,Home or Self Care,2020,CIR012,NONSPECIFIC CHEST PAIN,,,203,CHEST PAIN,05,DISEASES AND DISORDERS OF THE CIRCULATORY SYSTEM,1,Minor,Minor,Medical,Medicare,,,,,Y,63818.98,14677.23
New York City,Manhattan,7002053,001463,NYU Langone Hospitals,50 to 69,112,M,White,Not Span/Hispanic,1,Emergency,Home or Self Care,2020,CIR012,NONSPECIFIC CHEST PAIN,,,203,CHEST PAIN,05,DISEASES AND DISORDERS OF THE CIRCULATORY SYSTEM,2,Moderate,Minor,Medical,Medicare,Medicare,,,,Y,19333.74,5816.27
New York City,Manhattan,7002053,001463,NYU Langone Hospitals,50 to 69,112,F,Black/African American,Not Span/Hispanic,1,Emergency,Home or Self Care,2020,CIR012,NONSPECIFIC CHEST PAIN,,,203,CHEST PAIN,05,DISEASES AND DISORDERS OF THE CIRCULATORY SYSTEM,1,Minor,Minor,Medical,Medicaid,,,,,Y,44062.39,11451.51
New York City,Manhattan,7002053,001463,NYU Langone Hospitals,50 to 69,104,F,White,Not Span/Hispanic,1,Emergency,Home or Self Care,2020,CIR012,NONSPECIFIC CHEST PAIN,,,203,CHEST PAIN,05,DISEASES AND DISORDERS OF THE CIRCULATORY SYSTEM,1,Minor,Moderate,Medical,Medicaid,,,,,Y,42077.79,12291.57
New York City,Manhattan,7002053,001463,NYU Langone Hospitals,50 to 69,112,M,White,Not Span/Hispanic,1,Emergency,Home or Self Care,2020,CIR012,NONSPECIFIC CHEST PAIN,IMG008,ULTRASONOGRAPHY,203,CHEST PAIN,05,DISEASES AND DISORDERS OF THE CIRCULATORY SYSTEM,1,Minor,Minor,Medical,Medicaid,,,,,Y,30420.44,8998.96
New York City,Manhattan,7002053,001463,NYU Langone Hospitals,50 to 69,113,F,Other Race,Not Span/Hispanic,1,Emergency,Home or Self Care,2020,CIR012,NONSPECIFIC CHEST PAIN,,,203,CHEST PAIN,05,DISEASES AND DISORDERS OF THE CIRCULATORY SYSTEM,2,Moderate,Minor,Medical,Medicaid,,,,,Y,51956.44,12480.06
New York City,Manhattan,7002053,001463,NYU Langone Hospitals,18 to 29,112,F,Other Race,Unknown,1,Emergency,Home or Self Care,2020,CIR012,NONSPECIFIC CHEST PAIN,IMG008,ULTRASONOGRAPHY,203,CHEST PAIN,05,DISEASES AND DISORDERS OF THE CIRCULATORY SYSTEM,3,Major,Major,Medical,Medicaid,,,,,Y,25586.08,6622.83
New York City,Manhattan,7002053,001463,NYU Langone Hospitals,50 to 69,112,F,Other Race,Spanish/Hispanic,3,Emergency,Home w/ Home Health Services,2020,CIR012,NONSPECIFIC CHEST PAIN,,,203,CHEST PAIN,05,DISEASES AND DISORDERS OF THE CIRCULATORY SYSTEM,2,Moderate,Moderate,Medical,Medicare,,,,,Y,71693.45,18109.22
New York City,Manhattan,7002053,001463,NYU Langone Hospitals,50 to 69,100,F,White,Not Span/Hispanic,1,Emergency,Home or Self Care,2020,CIR012,NONSPECIFIC CHEST PAIN,,,203,CHEST PAIN,05,DISEASES AND DISORDERS OF THE CIRCULATORY SYSTEM,2,Moderate,Minor,Medical,Private Health Insurance,,,,,Y,46173.85,13025.99
New York City,Manhattan,7002053,001463,NYU Langone Hospitals,50 to 69,112,F,White,Not Span/Hispanic,1,Emergency,Home or Self Care,2020,CIR012,NONSPECIFIC CHEST PAIN,,,203,CHEST PAIN,05,DISEASES AND DISORDERS OF THE CIRCULATORY SYSTEM,1,Minor,Minor,Medical,Private Health Insurance,,,,,Y,44129.67,11920.92
New York City,Manhattan,7002053,001463,NYU Langone Hospitals,50 to 69,112,M,Black/African American,Not Span/Hispanic,2,Emergency,Home or Self Care,2020,CIR012,NONSPECIFIC CHEST PAIN,,,203,CHEST PAIN,05,DISEASES AND DISORDERS OF THE CIRCULATORY SYSTEM,2,Moderate,Moderate,Medical,Medicaid,,,,,Y,58591.65,16732.97
New York City,Manhattan,7002053,001463,NYU Langone Hospitals,50 to 69,100,F,Other Race,Unknown,1,Emergency,Home or Self Care,2020,CIR012,NONSPECIFIC CHEST PAIN,,,203,CHEST PAIN,05,DISEASES AND DISORDERS OF THE CIRCULATORY SYSTEM,1,Minor,Minor,Medical,Blue Cross/Blue Shield,,,,,Y,40106.13,11084.29
New York City,Manhattan,7002053,001463,NYU Langone Hospitals,70 or Older,100,F,Other Race,Spanish/Hispanic,1,Emergency,Home w/ Home Health Services,2020,CIR012,NONSPECIFIC CHEST PAIN,,,203,CHEST PAIN,05,DISEASES AND DISORDERS OF THE CIRCULATORY SYSTEM,2,Moderate,Moderate,Medical,Medicare,,,,,Y,34663.33,7899.45
New York City,Manhattan,7002053,001463,NYU Langone Hospitals,50 to 69,100,F,White,Not Span/Hispanic,1,Emergency,Home or Self Care,2020,CIR012,NONSPECIFIC CHEST PAIN,,,203,CHEST PAIN,05,DISEASES AND DISORDERS OF THE CIRCULATORY SYSTEM,2,Moderate,Minor,Medical,Medicare,Medicare,,,,Y,62053.51,15015.94
New York City,Manhattan,7002053,001463,NYU Langone Hospitals,18 to 29,112,M,White,Unknown,1,Emergency,Home or Self Care,2020,CIR012,NONSPECIFIC CHEST PAIN,,,203,CHEST PAIN,05,DISEASES AND DISORDERS OF THE CIRCULATORY SYSTEM,1,Minor,Minor,Medical,Medicaid,,,,,Y,33329.81,9188.48
New York City,Manhattan,7002053,001463,NYU Langone Hospitals,30 to 49,112,F,Other Race,Not Span/Hispanic,1,Emergency,Home or Self Care,2020,CIR012,NONSPECIFIC CHEST PAIN,,,203,CHEST PAIN,05,DISEASES AND DISORDERS OF THE CIRCULATORY SYSTEM,1,Minor,Minor,Medical,Medicaid,,,,,Y,40634.57,11350.32