Hospital Service Area,Hospital County,Operating Certificate Number,Permanent Facility Id,Facility Name,Age Group,Zip Code - 3 digits,Gender,Race,Ethnicity,Length of Stay,Type of Admission,Patient Disposition,Discharge Year,CCS Diagnosis Code,CCS Diagnosis Description,CCS Procedure Code,CCS Procedure Description,APR DRG Code,APR DRG Description,APR MDC Code,APR MDC Description,APR Severity of Illness Code,APR Severity of Illness Description,APR Risk of Mortality,APR Medical Surgical Description,Payment Typology 1,Payment Typology 2,Payment Typology 3,Birth Weight,Abortion Edit Indicator,Emergency Department Indicator,Total Charges,Total Costs
New York City,Manhattan,7002053,001463,NYU Langone Hospitals,70 or Older,112,F,Other Race,Unknown,1,Emergency,Home or Self Care,2019,SYM001,SYNCOPE,,,204,SYNCOPE & COLLAPSE,05,DISEASES AND DISORDERS OF THE CIRCULATORY SYSTEM,1,Minor,Minor,Medical,Medicare,,,,,true,24663.42,5929.96
New York City,Manhattan,7002053,001463,NYU Langone Hospitals,70 or Older,,F,White,Not Span/Hispanic,1,Emergency,Home w/ Home Health Services,2019,CIR031,HYPOTENSION,,,204,SYNCOPE & COLLAPSE,05,DISEASES AND DISORDERS OF THE CIRCULATORY SYSTEM,1,Minor,Minor,Medical,Medicare,Medicare,,,,true,46692.41,13386.15
New York City,Manhattan,7002053,001463,NYU Langone Hospitals,50 to 69,OOS,M,Black/African American,Not Span/Hispanic,1,Emergency,Home or Self Care,2019,SYM001,SYNCOPE,,,204,SYNCOPE & COLLAPSE,05,DISEASES AND DISORDERS OF THE CIRCULATORY SYSTEM,3,Major,Moderate,Medical,Private Health Insurance,,,,,true,29712.96,9509.51
New York City,Manhattan,7002053,001463,NYU Langone Hospitals,30 to 49,100,F,Other Race,Unknown,1,Emergency,Home or Self Care,2019,SYM001,SYNCOPE,,,204,SYNCOPE & COLLAPSE,05,DISEASES AND DISORDERS OF THE CIRCULATORY SYSTEM,1,Minor,Minor,Medical,Private Health Insurance,,,,,true,16788.02,4834.55
New York City,Manhattan,7002053,001463,NYU Langone Hospitals,70 or Older,100,M,White,Not Span/Hispanic,1,Emergency,Home w/ Home Health Services,2019,SYM001,SYNCOPE,MAM006,PACEMAKER AND DEFIBRILLATOR INTERROGATION,204,SYNCOPE & COLLAPSE,05,DISEASES AND DISORDERS OF THE CIRCULATORY SYSTEM,3,Major,Major,Medical,Medicare,Blue Cross/Blue Shield,,,,true,42034.63,14566.55
New York City,Manhattan,7002053,001463,NYU Langone Hospitals,70 or Older,112,F,White,Not Span/Hispanic,1,Emergency,Home w/ Home Health Services,2019,SYM001,SYNCOPE,IMG008,ULTRASONOGRAPHY,204,SYNCOPE & COLLAPSE,05,DISEASES AND DISORDERS OF THE CIRCULATORY SYSTEM,1,Minor,Minor,Medical,Medicare,Medicare,,,,true,47115.96,14501.08
New York City,Manhattan,7002053,001463,NYU Langone Hospitals,50 to 69,OOS,F,White,Not Span/Hispanic,2,Emergency,Home or Self Care,2019,CIR031,HYPOTENSION,ADM010,VACCINATIONS,204,SYNCOPE & COLLAPSE,05,DISEASES AND DISORDERS OF THE CIRCULATORY SYSTEM,1,Minor,Minor,Medical,Medicare,Medicare,,,,true,27187.62,8371.12
New York City,Manhattan,7002053,001463,NYU Langone Hospitals,70 or Older,100,M,Other Race,Not Span/Hispanic,1,Emergency,Home or Self Care,2019,SYM001,SYNCOPE,IMG008,ULTRASONOGRAPHY,204,SYNCOPE & COLLAPSE,05,DISEASES AND DISORDERS OF THE CIRCULATORY SYSTEM,2,Moderate,Major,Medical,Medicare,Blue Cross/Blue Shield,Private Health Insurance,,,true,31062.56,5857.57
New York City,Manhattan,7002053,001463,NYU Langone Hospitals,50 to 69,101,M,White,Not Span/Hispanic,1,Emergency,Home or Self Care,2019,SYM001,SYNCOPE,,,204,SYNCOPE & COLLAPSE,05,DISEASES AND DISORDERS OF THE CIRCULATORY SYSTEM,2,Moderate,Moderate,Medical,Private Health Insurance,,,,,true,23187.41,5719.43
New York City,Manhattan,7002053,001463,NYU Langone Hospitals,50 to 69,100,M,White,Not Span/Hispanic,2,Emergency,Home or Self Care,2019,SYM001,SYNCOPE,,,204,SYNCOPE & COLLAPSE,05,DISEASES AND DISORDERS OF THE CIRCULATORY SYSTEM,1,Minor,Minor,Medical,Private Health Insurance,,,,,true,32493.57,9552.68
New York City,Manhattan,7002053,001463,NYU Langone Hospitals,70 or Older,100,F,White,Not Span/Hispanic,3,Emergency,Skilled Nursing Home,2019,CIR031,HYPOTENSION,,,204,SYNCOPE & COLLAPSE,05,DISEASES AND DISORDERS OF THE CIRCULATORY SYSTEM,3,Major,Moderate,Medical,Medicare,Blue Cross/Blue Shield,,,,true,96661.84,22231.64
New York City,Manhattan,7002053,001463,NYU Langone Hospitals,70 or Older,100,M,Other Race,Spanish/Hispanic,1,Emergency,Home or Self Care,2019,SYM001,SYNCOPE,,,204,SYNCOPE & COLLAPSE,05,DISEASES AND DISORDERS OF THE CIRCULATORY SYSTEM,2,Moderate,Moderate,Medical,Medicare,,,,,true,91100.51,13152.66
New York City,Manhattan,7002053,001463,NYU Langone Hospitals,18 to 29,114,F,Other Race,Spanish/Hispanic,1,Emergency,Home or Self Care,2019,SYM001,SYNCOPE,,,204,SYNCOPE & COLLAPSE,05,DISEASES AND DISORDERS OF THE CIRCULATORY SYSTEM,3,Major,Moderate,Medical,Medicaid,,,,,true,30192.96,9676.56
New York City,Manhattan,7002053,001463,NYU Langone Hospitals,50 to 69,112,M,White,Not Span/Hispanic,1,Emergency,Home or Self Care,2019,SYM001,SYNCOPE,,,204,SYNCOPE & COLLAPSE,05,DISEASES AND DISORDERS OF THE CIRCULATORY SYSTEM,2,Moderate,Minor,Medical,Blue Cross/Blue Shield,,,,,true,34418.64,11072.79
New York City,Manhattan,7002053,001463,NYU Langone Hospitals,50 to 69,114,M,White,Not Span/Hispanic,2,Elective,Home or Self Care,2019,SYM001,SYNCOPE,MAM011,ELECTROENCEPHALOGRAM (EEG),204,SYNCOPE & COLLAPSE,05,DISEASES AND DISORDERS OF THE CIRCULATORY SYSTEM,3,Major,Major,Medical,Medicare,Medicare,,,,false,71714.49,9133.62
New York City,Manhattan,7002053,001463,NYU Langone Hospitals,70 or Older,100,M,White,Not Span/Hispanic,1,Emergency,Home w/ Home Health Services,2019,SYM001,SYNCOPE,,,204,SYNCOPE & COLLAPSE,05,DISEASES AND DISORDERS OF THE CIRCULATORY SYSTEM,2,Moderate,Minor,Medical,Medicare,Private Health Insurance,,,,true,38260.05,11189.8
New York City,Manhattan,7002053,001463,NYU Langone Hospitals,70 or Older,100,F,White,Not Span/Hispanic,1,Emergency,Home w/ Home Health Services,2019,SYM001,SYNCOPE,,,204,SYNCOPE & COLLAPSE,05,DISEASES AND DISORDERS OF THE CIRCULATORY SYSTEM,3,Major,Major,Medical,Medicare,,,,,true,31526.31,10150.96
New York City,Manhattan,7002053,001463,NYU Langone Hospitals,70 or Older,100,F,White,Not Span/Hispanic,1,Emergency,Home or Self Care,2019,CIR031,HYPOTENSION,,,204,SYNCOPE & COLLAPSE,05,DISEASES AND DISORDERS OF THE CIRCULATORY SYSTEM,2,Moderate,Minor,Medical,Medicare,,,,,true,24202.76,7555.28
New York City,Manhattan,7002053,001463,NYU Langone Hospitals,50 to 69,112,M,White,Not Span/Hispanic,1,Emergency,Home or Self Care,2019,SYM001,SYNCOPE,,,204,SYNCOPE & COLLAPSE,05,DISEASES AND DISORDERS OF THE CIRCULATORY SYSTEM,1,Minor,Minor,Medical,Medicare,Private Health Insurance,,,,true,31026.25,10087.62
New York City,Manhattan,7002053,001463,NYU Langone Hospitals,70 or Older,112,F,White,Not Span/Hispanic,1,Emergency,Home or Self Care,2019,SYM001,SYNCOPE,,,204,SYNCOPE & COLLAPSE,05,DISEASES AND DISORDERS OF THE CIRCULATORY SYSTEM,3,Major,Major,Medical,Medicare,Medicaid,,,,true,19602.64,5363.38
New York City,Manhattan,7002053,001463,NYU Langone Hospitals,70 or Older,100,F,White,Not Span/Hispanic,4,Emergency,Skilled Nursing Home,2019,CIR031,HYPOTENSION,,,204,SYNCOPE & COLLAPSE,05,DISEASES AND DISORDERS OF THE CIRCULATORY SYSTEM,1,Minor,Minor,Medical,Medicare,Medicare,,,,true,62515.7,22054.73
New York City,Manhattan,7002053,001463,NYU Langone Hospitals,30 to 49,112,M,White,Not Span/Hispanic,1,Emergency,Home or Self Care,2019,SYM001,SYNCOPE,,,204,SYNCOPE & COLLAPSE,05,DISEASES AND DISORDERS OF THE CIRCULATORY SYSTEM,1,Minor,Minor,Medical,Private Health Insurance,,,,,true,32614.63,8980.17
New York City,Manhattan,7002053,001463,NYU Langone Hospitals,18 to 29,OOS,F,White,Not Span/Hispanic,2,Elective,Home or Self Care,2019,SYM001,SYNCOPE,MAM011,ELECTROENCEPHALOGRAM (EEG),204,SYNCOPE & COLLAPSE,05,DISEASES AND DISORDERS OF THE CIRCULATORY SYSTEM,1,Minor,Minor,Medical,Private Health Insurance,,,,,false,37643.68,7482.93
New York City,Manhattan,7002053,001463,NYU Langone Hospitals,70 or Older,113,M,Other Race,Not Span/Hispanic,1,Emergency,Home w/ Home Health Services,2019,SYM001,SYNCOPE,,,204,SYNCOPE & COLLAPSE,05,DISEASES AND DISORDERS OF THE CIRCULATORY SYSTEM,2,Moderate,Moderate,Medical,Private Health Insurance,,,,,true,32309.19,10156.62
New York City,Manhattan,7002053,001463,NYU Langone Hospitals,70 or Older,119,M,White,Not Span/Hispanic,1,Emergency,Home or Self Care,2019,SYM001,SYNCOPE,,,204,SYNCOPE & COLLAPSE,05,DISEASES AND DISORDERS OF THE CIRCULATORY SYSTEM,2,Moderate,Major,Medical,Private Health Insurance,,,,,true,20287.22,5131.71
New York City,Manhattan,7002053,001463,NYU Langone Hospitals,50 to 69,OOS,M,White,Not Span/Hispanic,1,Emergency,Home or Self Care,2019,SYM001,SYNCOPE,,,204,SYNCOPE & COLLAPSE,05,DISEASES AND DISORDERS OF THE CIRCULATORY SYSTEM,1,Minor,Minor,Medical,Private Health Insurance,Private Health Insurance,,,,true,27507.73,9778.76
New York City,Manhattan,7002053,001463,NYU Langone Hospitals,70 or Older,112,F,White,Not Span/Hispanic,1,Emergency,Home or Self Care,2019,SYM001,SYNCOPE,ADM021,"ADMINISTRATION OF THERAPEUTIC SUBSTANCES, NEC",204,SYNCOPE & COLLAPSE,05,DISEASES AND DISORDERS OF THE CIRCULATORY SYSTEM,1,Minor,Minor,Medical,Blue Cross/Blue Shield,,,,,true,30509.68,7266.84
New York City,Manhattan,7002053,001463,NYU Langone Hospitals,70 or Older,103,F,White,Not Span/Hispanic,2,Emergency,Home w/ Home Health Services,2019,SYM001,SYNCOPE,MST028,"SUBCUTANEOUS TISSUE AND FASCIA PROCEDURES, NEC",204,SYNCOPE & COLLAPSE,05,DISEASES AND DISORDERS OF THE CIRCULATORY SYSTEM,2,Moderate,Moderate,Medical,Medicare,,,,,true,162994.61,26780.33
New York City,Manhattan,7002053,001463,NYU Langone Hospitals,70 or Older,112,M,White,Not Span/Hispanic,1,Emergency,Home w/ Home Health Services,2019,SYM001,SYNCOPE,,,204,SYNCOPE & COLLAPSE,05,DISEASES AND DISORDERS OF THE CIRCULATORY SYSTEM,2,Moderate,Moderate,Medical,Medicare,,,,,true,44811.67,12679.59
New York City,Manhattan,7002053,001463,NYU Langone Hospitals,70 or Older,112,F,White,Not Span/Hispanic,2,Emergency,Home w/ Home Health Services,2019,SYM001,SYNCOPE,,,204,SYNCOPE & COLLAPSE,05,DISEASES AND DISORDERS OF THE CIRCULATORY SYSTEM,2,Moderate,Moderate,Medical,Medicare,Medicare,,,,true,29929.65,9053.92
New York City,Manhattan,7002053,001463,NYU Langone Hospitals,50 to 69,OOS,F,Multi-racial,Not Span/Hispanic,1,Emergency,Home or Self Care,2019,SYM001,SYNCOPE,,,204,SYNCOPE & COLLAPSE,05,DISEASES AND DISORDERS OF THE CIRCULATORY SYSTEM,1,Minor,Minor,Medical,Private Health Insurance,,,,,true,20316.64,5282.22
New York City,Manhattan,7002053,001463,NYU Langone Hospitals,70 or Older,100,F,White,Not Span/Hispanic,1,Emergency,Home w/ Home Health Services,2019,SYM001,SYNCOPE,,,204,SYNCOPE & COLLAPSE,05,DISEASES AND DISORDERS OF THE CIRCULATORY SYSTEM,2,Moderate,Minor,Medical,Medicare,Medicare,,,,true,32966.88,9936.05
New York City,Manhattan,7002053,001463,NYU Langone Hospitals,50 to 69,100,M,White,Unknown,1,Emergency,Home or Self Care,2019,SYM001,SYNCOPE,,,204,SYNCOPE & COLLAPSE,05,DISEASES AND DISORDERS OF THE CIRCULATORY SYSTEM,3,Major,Major,Medical,Self-Pay,,,,,true,22139.57,5416.55
New York City,Manhattan,7002053,001463,NYU Langone Hospitals,50 to 69,100,M,White,Not Span/Hispanic,1,Emergency,Home or Self Care,2019,SYM001,SYNCOPE,,,204,SYNCOPE & COLLAPSE,05,DISEASES AND DISORDERS OF THE CIRCULATORY SYSTEM,2,Moderate,Moderate,Medical,Private Health Insurance,,,,,true,14955.12,4453.14
New York City,Manhattan,7002053,001463,NYU Langone Hospitals,50 to 69,114,M,White,Not Span/Hispanic,3,Emergency,Home or Self Care,2019,SYM001,SYNCOPE,MAM006,PACEMAKER AND DEFIBRILLATOR INTERROGATION,204,SYNCOPE & COLLAPSE,05,DISEASES AND DISORDERS OF THE CIRCULATORY SYSTEM,3,Major,Moderate,Medical,Medicare,Medicare,,,,true,52854.4,20245.74
New York City,Manhattan,7002053,001463,NYU Langone Hospitals,50 to 69,112,M,White,Not Span/Hispanic,1,Emergency,Home or Self Care,2019,SYM001,SYNCOPE,,,204,SYNCOPE & COLLAPSE,05,DISEASES AND DISORDERS OF THE CIRCULATORY SYSTEM,3,Major,Major,Medical,Blue Cross/Blue Shield,,,,,true,28807.98,8333.16
New York City,Manhattan,7002053,001463,NYU Langone Hospitals,70 or Older,113,F,Other Race,Not Span/Hispanic,1,Emergency,Home or Self Care,2019,SYM001,SYNCOPE,,,204,SYNCOPE & COLLAPSE,05,DISEASES AND DISORDERS OF THE CIRCULATORY SYSTEM,2,Moderate,Minor,Medical,Medicare,Medicaid,,,,true,20257.83,5254.36
New York City,Manhattan,7002053,001463,NYU Langone Hospitals,50 to 69,100,F,Black/African American,Not Span/Hispanic,2,Emergency,Home or Self Care,2019,SYM001,SYNCOPE,,,204,SYNCOPE & COLLAPSE,05,DISEASES AND DISORDERS OF THE CIRCULATORY SYSTEM,2,Moderate,Minor,Medical,Medicare,Medicaid,,,,true,58327.37,13250.44
New York City,Manhattan,7002053,001463,NYU Langone Hospitals,70 or Older,OOS,F,Other Race,Not Span/Hispanic,1,Emergency,Home or Self Care,2019,SYM001,SYNCOPE,,,204,SYNCOPE & COLLAPSE,05,DISEASES AND DISORDERS OF THE CIRCULATORY SYSTEM,2,Moderate,Moderate,Medical,Medicare,Private Health Insurance,,,,true,43387.18,14044.53
New York City,Manhattan,7002053,001463,NYU Langone Hospitals,50 to 69,112,F,White,Not Span/Hispanic,1,Emergency,Home or Self Care,2019,CIR031,HYPOTENSION,,,204,SYNCOPE & COLLAPSE,05,DISEASES AND DISORDERS OF THE CIRCULATORY SYSTEM,1,Minor,Minor,Medical,Medicare,,,,,true,36090.31,12494.51
New York City,Manhattan,7002053,001463,NYU Langone Hospitals,18 to 29,113,M,Other Race,Spanish/Hispanic,4,Emergency,Home or Self Care,2019,SYM001,SYNCOPE,IMG008,ULTRASONOGRAPHY,204,SYNCOPE & COLLAPSE,05,DISEASES AND DISORDERS OF THE CIRCULATORY SYSTEM,2,Moderate,Minor,Medical,Medicaid,,,,,true,99113.61,17733.6
New York City,Manhattan,7002053,001463,NYU Langone Hospitals,18 to 29,112,F,Black/African American,Not Span/Hispanic,1,Emergency,Home or Self Care,2019,SYM001,SYNCOPE,MAM011,ELECTROENCEPHALOGRAM (EEG),204,SYNCOPE & COLLAPSE,05,DISEASES AND DISORDERS OF THE CIRCULATORY SYSTEM,3,Major,Moderate,Medical,Medicaid,,,,,true,38844.57,5168.55
New York City,Manhattan,7002053,001463,NYU Langone Hospitals,70 or Older,100,M,White,Not Span/Hispanic,1,Emergency,Home or Self Care,2019,CIR031,HYPOTENSION,ADM001,TRANSFUSION OF BLOOD AND BLOOD PRODUCTS,204,SYNCOPE & COLLAPSE,05,DISEASES AND DISORDERS OF THE CIRCULATORY SYSTEM,2,Moderate,Moderate,Medical,Private Health Insurance,Medicare,,,,true,36852.96,12500.99
New York City,Manhattan,7002053,001463,NYU Langone Hospitals,18 to 29,100,F,White,Not Span/Hispanic,1,Emergency,Home or Self Care,2019,SYM001,SYNCOPE,,,204,SYNCOPE & COLLAPSE,05,DISEASES AND DISORDERS OF THE CIRCULATORY SYSTEM,1,Minor,Minor,Medical,Blue Cross/Blue Shield,,,,,true,25418.8,5129.84
New York City,Manhattan,7002053,001463,NYU Langone Hospitals,70 or Older,112,F,White,Not Span/Hispanic,3,Emergency,Skilled Nursing Home,2019,SYM001,SYNCOPE,,,204,SYNCOPE & COLLAPSE,05,DISEASES AND DISORDERS OF THE CIRCULATORY SYSTEM,3,Major,Moderate,Medical,Medicare,Private Health Insurance,,,,true,82659.7,23031.08
New York City,Manhattan,7002053,001463,NYU Langone Hospitals,70 or Older,OOS,M,White,Not Span/Hispanic,1,Emergency,Home or Self Care,2019,SYM001,SYNCOPE,,,204,SYNCOPE & COLLAPSE,05,DISEASES AND DISORDERS OF THE CIRCULATORY SYSTEM,2,Moderate,Major,Medical,Medicare,Blue Cross/Blue Shield,,,,true,20317.96,5156.61
New York City,Manhattan,7002053,001463,NYU Langone Hospitals,50 to 69,OOS,F,Other Race,Not Span/Hispanic,1,Emergency,Home or Self Care,2019,SYM001,SYNCOPE,,,204,SYNCOPE & COLLAPSE,05,DISEASES AND DISORDERS OF THE CIRCULATORY SYSTEM,1,Minor,Minor,Medical,Private Health Insurance,,,,,true,25522.08,6250.91
New York City,Manhattan,7002053,001463,NYU Langone Hospitals,70 or Older,100,M,White,Not Span/Hispanic,2,Emergency,Home or Self Care,2019,SYM001,SYNCOPE,,,204,SYNCOPE & COLLAPSE,05,DISEASES AND DISORDERS OF THE CIRCULATORY SYSTEM,2,Moderate,Minor,Medical,Medicare,Medicare,,,,true,42492.03,9174.16
New York City,Manhattan,7002053,001463,NYU Langone Hospitals,70 or Older,112,F,White,Not Span/Hispanic,1,Emergency,Home or Self Care,2019,SYM001,SYNCOPE,,,204,SYNCOPE & COLLAPSE,05,DISEASES AND DISORDERS OF THE CIRCULATORY SYSTEM,2,Moderate,Major,Medical,Medicare,Medicare,,,,true,18495.65,4944.93
New York City,Manhattan,7002053,001463,NYU Langone Hospitals,50 to 69,100,M,Other Race,Not Span/Hispanic,1,Emergency,Home or Self Care,2019,CIR031,HYPOTENSION,,,204,SYNCOPE & COLLAPSE,05,DISEASES AND DISORDERS OF THE CIRCULATORY SYSTEM,1,Minor,Minor,Medical,Private Health Insurance,,,,,true,32107.53,9505.93
New York City,Manhattan,7002053,001463,NYU Langone Hospitals,30 to 49,113,M,Other Race,Spanish/Hispanic,1,Emergency,Home or Self Care,2019,SYM001,SYNCOPE,,,204,SYNCOPE & COLLAPSE,05,DISEASES AND DISORDERS OF THE CIRCULATORY SYSTEM,1,Minor,Minor,Medical,Self-Pay,,,,,true,26853.67,8964.98
New York City,Manhattan,7002053,001463,NYU Langone Hospitals,70 or Older,100,F,White,Not Span/Hispanic,3,Emergency,Skilled Nursing Home,2019,SYM001,SYNCOPE,MAM006,PACEMAKER AND DEFIBRILLATOR INTERROGATION,204,SYNCOPE & COLLAPSE,05,DISEASES AND DISORDERS OF THE CIRCULATORY SYSTEM,2,Moderate,Moderate,Medical,Medicare,Blue Cross/Blue Shield,,,,true,57117.39,20508.43
New York City,Manhattan,7002053,001463,NYU Langone Hospitals,70 or Older,100,F,White,Not Span/Hispanic,1,Emergency,Home or Self Care,2019,SYM001,SYNCOPE,,,204,SYNCOPE & COLLAPSE,05,DISEASES AND DISORDERS OF THE CIRCULATORY SYSTEM,2,Moderate,Moderate,Medical,Medicare,,,,,true,26354.45,6076.29
New York City,Manhattan,7002053,001463,NYU Langone Hospitals,70 or Older,119,M,White,Not Span/Hispanic,3,Emergency,Skilled Nursing Home,2019,SYM001,SYNCOPE,HEP010,HEPATOBILIARY AND PANCREATIC DRAINAGE,204,SYNCOPE & COLLAPSE,05,DISEASES AND DISORDERS OF THE CIRCULATORY SYSTEM,2,Moderate,Minor,Medical,Medicare,Medicare,,,,true,114446.61,26065.27
New York City,Manhattan,7002053,001463,NYU Langone Hospitals,70 or Older,112,F,White,Unknown,1,Emergency,Home or Self Care,2019,CIR031,HYPOTENSION,,,204,SYNCOPE & COLLAPSE,05,DISEASES AND DISORDERS OF THE CIRCULATORY SYSTEM,2,Moderate,Minor,Medical,Blue Cross/Blue Shield,,,,,true,32388.77,6012.23
New York City,Manhattan,7002053,001463,NYU Langone Hospitals,50 to 69,,F,White,Not Span/Hispanic,1,Emergency,Home or Self Care,2019,SYM001,SYNCOPE,,,204,SYNCOPE & COLLAPSE,05,DISEASES AND DISORDERS OF THE CIRCULATORY SYSTEM,1,Minor,Minor,Medical,Private Health Insurance,,,,,true,20408.33,7087.36
New York City,Manhattan,7002053,001463,NYU Langone Hospitals,70 or Older,111,M,White,Not Span/Hispanic,3,Emergency,Skilled Nursing Home,2019,CIR031,HYPOTENSION,SKB006,SKIN LACERATION REPAIR (EXCLUDING PERINEUM),204,SYNCOPE & COLLAPSE,05,DISEASES AND DISORDERS OF THE CIRCULATORY SYSTEM,2,Moderate,Moderate,Medical,Medicare,Blue Cross/Blue Shield,Medicaid,,,true,51353.3,14481.33
New York City,Manhattan,7002053,001463,NYU Langone Hospitals,50 to 69,115,F,White,Not Span/Hispanic,1,Emergency,Home or Self Care,2019,SYM001,SYNCOPE,,,204,SYNCOPE & COLLAPSE,05,DISEASES AND DISORDERS OF THE CIRCULATORY SYSTEM,2,Moderate,Moderate,Medical,Blue Cross/Blue Shield,,,,,true,21228.73,5394.43
New York City,Manhattan,7002053,001463,NYU Langone Hospitals,50 to 69,OOS,F,Other Race,Not Span/Hispanic,1,Emergency,Home or Self Care,2019,SYM001,SYNCOPE,,,204,SYNCOPE & COLLAPSE,05,DISEASES AND DISORDERS OF THE CIRCULATORY SYSTEM,1,Minor,Minor,Medical,Blue Cross/Blue Shield,,,,,true,31947.44,9771.74
New York City,Manhattan,7002053,001463,NYU Langone Hospitals,50 to 69,112,M,White,Not Span/Hispanic,4,Emergency,Skilled Nursing Home,2019,SYM001,SYNCOPE,,,204,SYNCOPE & COLLAPSE,05,DISEASES AND DISORDERS OF THE CIRCULATORY SYSTEM,3,Major,Major,Medical,Blue Cross/Blue Shield,Medicare,,,,true,75408.82,16363.23
New York City,Manhattan,7002053,001463,NYU Langone Hospitals,30 to 49,112,M,White,Not Span/Hispanic,1,Emergency,Home or Self Care,2019,SYM001,SYNCOPE,,,204,SYNCOPE & COLLAPSE,05,DISEASES AND DISORDERS OF THE CIRCULATORY SYSTEM,1,Minor,Minor,Medical,Private Health Insurance,,,,,true,26885.54,6273.77
New York City,Manhattan,7002053,001463,NYU Langone Hospitals,70 or Older,112,F,Black/African American,Not Span/Hispanic,1,Emergency,Home w/ Home Health Services,2019,SYM001,SYNCOPE,,,204,SYNCOPE & COLLAPSE,05,DISEASES AND DISORDERS OF THE CIRCULATORY SYSTEM,1,Minor,Minor,Medical,Private Health Insurance,,,,,true,28506.34,8001.32
New York City,Manhattan,7002053,001463,NYU Langone Hospitals,70 or Older,100,M,White,Not Span/Hispanic,3,Emergency,Home w/ Home Health Services,2019,SYM001,SYNCOPE,,,204,SYNCOPE & COLLAPSE,05,DISEASES AND DISORDERS OF THE CIRCULATORY SYSTEM,3,Major,Major,Medical,Medicare,Medicare,,,,true,40061.13,12757.62
New York City,Manhattan,7002053,001463,NYU Langone Hospitals,70 or Older,100,F,White,Not Span/Hispanic,1,Emergency,Home or Self Care,2019,SYM001,SYNCOPE,,,204,SYNCOPE & COLLAPSE,05,DISEASES AND DISORDERS OF THE CIRCULATORY SYSTEM,2,Moderate,Moderate,Medical,Medicare,Blue Cross/Blue Shield,,,,true,51628.81,15416.65
New York City,Manhattan,7002053,001463,NYU Langone Hospitals,70 or Older,OOS,M,White,Not Span/Hispanic,1,Emergency,Home or Self Care,2019,SYM001,SYNCOPE,,,204,SYNCOPE & COLLAPSE,05,DISEASES AND DISORDERS OF THE CIRCULATORY SYSTEM,2,Moderate,Moderate,Medical,Private Health Insurance,,,,,true,26033.92,5759.14
New York City,Manhattan,7002053,001463,NYU Langone Hospitals,50 to 69,100,M,White,Not Span/Hispanic,1,Emergency,Home or Self Care,2019,SYM001,SYNCOPE,,,204,SYNCOPE & COLLAPSE,05,DISEASES AND DISORDERS OF THE CIRCULATORY SYSTEM,1,Minor,Minor,Medical,Private Health Insurance,,,,,true,30925.07,8895.16
New York City,Manhattan,7002053,001463,NYU Langone Hospitals,50 to 69,100,F,Black/African American,Unknown,2,Emergency,Home or Self Care,2019,SYM001,SYNCOPE,,,204,SYNCOPE & COLLAPSE,05,DISEASES AND DISORDERS OF THE CIRCULATORY SYSTEM,3,Major,Major,Medical,Medicare,Blue Cross/Blue Shield,,,,true,55661.74,17554.21
New York City,Manhattan,7002053,001463,NYU Langone Hospitals,70 or Older,100,M,Other Race,Not Span/Hispanic,1,Emergency,Home or Self Care,2019,SYM001,SYNCOPE,,,204,SYNCOPE & COLLAPSE,05,DISEASES AND DISORDERS OF THE CIRCULATORY SYSTEM,2,Moderate,Moderate,Medical,Medicare,,,,,true,21422.58,5644.16
New York City,Manhattan,7002053,001463,NYU Langone Hospitals,70 or Older,104,M,Black/African American,Not Span/Hispanic,1,Emergency,Home or Self Care,2019,SYM001,SYNCOPE,,,204,SYNCOPE & COLLAPSE,05,DISEASES AND DISORDERS OF THE CIRCULATORY SYSTEM,1,Minor,Minor,Medical,Medicaid,,,,,true,28818.41,9013.83
New York City,Manhattan,7002053,001463,NYU Langone Hospitals,30 to 49,OOS,M,Other Race,Not Span/Hispanic,1,Emergency,Home or Self Care,2019,SYM001,SYNCOPE,,,204,SYNCOPE & COLLAPSE,05,DISEASES AND DISORDERS OF THE CIRCULATORY SYSTEM,1,Minor,Minor,Medical,Private Health Insurance,,,,,true,16399.84,4762.64
New York City,Manhattan,7002053,001463,NYU Langone Hospitals,50 to 69,100,M,Black/African American,Not Span/Hispanic,1,Emergency,Home w/ Home Health Services,2019,SYM001,SYNCOPE,ESA001,HEMODIALYSIS,204,SYNCOPE & COLLAPSE,05,DISEASES AND DISORDERS OF THE CIRCULATORY SYSTEM,2,Moderate,Moderate,Medical,Medicare,Medicaid,,,,true,36014.28,11444.95
New York City,Manhattan,7002053,001463,NYU Langone Hospitals,50 to 69,100,F,White,Not Span/Hispanic,1,Emergency,Home or Self Care,2019,SYM001,SYNCOPE,,,204,SYNCOPE & COLLAPSE,05,DISEASES AND DISORDERS OF THE CIRCULATORY SYSTEM,1,Minor,Minor,Medical,Blue Cross/Blue Shield,Medicare,,,,true,17302.15,4824.4
New York City,Manhattan,7002053,001463,NYU Langone Hospitals,50 to 69,100,F,White,Not Span/Hispanic,1,Emergency,Home or Self Care,2019,SYM001,SYNCOPE,,,204,SYNCOPE & COLLAPSE,05,DISEASES AND DISORDERS OF THE CIRCULATORY SYSTEM,1,Minor,Minor,Medical,Blue Cross/Blue Shield,Medicare,,,,true,14198.76,4397.28
New York City,Manhattan,7002053,001463,NYU Langone Hospitals,70 or Older,117,M,White,Not Span/Hispanic,1,Emergency,Home or Self Care,2019,SYM001,SYNCOPE,,,204,SYNCOPE & COLLAPSE,05,DISEASES AND DISORDERS OF THE CIRCULATORY SYSTEM,1,Minor,Minor,Medical,Private Health Insurance,Medicare,Federal/State/Local/VA,,,true,27342.59,9028.65