Hospital Service Area,Hospital County,Operating Certificate Number,Permanent Facility Id,Facility Name,Age Group,Zip Code - 3 digits,Gender,Race,Ethnicity,Length of Stay,Type of Admission,Patient Disposition,Discharge Year,CCS Diagnosis Code,CCS Diagnosis Description,CCS Procedure Code,CCS Procedure Description,APR DRG Code,APR DRG Description,APR MDC Code,APR MDC Description,APR Severity of Illness Code,APR Severity of Illness Description,APR Risk of Mortality,APR Medical Surgical Description,Payment Typology 1,Payment Typology 2,Payment Typology 3,Birth Weight,Abortion Edit Indicator,Emergency Department Indicator,Total Charges,Total Costs
Long Island,Suffolk,5123000,000885,Long Island Community Hospital,70 or Older,117,F,White,Not Span/Hispanic,3,Emergency,Home or Self Care,2019,SYM001,SYNCOPE,,,204,SYNCOPE & COLLAPSE,05,DISEASES AND DISORDERS OF THE CIRCULATORY SYSTEM,2,Moderate,Moderate,Medical,Medicare,Medicare,Private Health Insurance,,,true,48997.69,6125.11
Long Island,Suffolk,5123000,000885,Long Island Community Hospital,30 to 49,117,F,White,Not Span/Hispanic,1,Emergency,Left Against Medical Advice,2019,SYM001,SYNCOPE,,,204,SYNCOPE & COLLAPSE,05,DISEASES AND DISORDERS OF THE CIRCULATORY SYSTEM,1,Minor,Minor,Medical,Medicare,Medicare,Medicaid,,,true,12662.55,1766.9
Long Island,Suffolk,5123000,000885,Long Island Community Hospital,70 or Older,117,F,White,Not Span/Hispanic,1,Emergency,Home w/ Home Health Services,2019,SYM001,SYNCOPE,,,204,SYNCOPE & COLLAPSE,05,DISEASES AND DISORDERS OF THE CIRCULATORY SYSTEM,1,Minor,Minor,Medical,Medicare,Medicare,Blue Cross/Blue Shield,,,true,39152.35,2443.79
Long Island,Suffolk,5123000,000885,Long Island Community Hospital,70 or Older,117,F,White,Not Span/Hispanic,2,Emergency,Home w/ Home Health Services,2019,SYM001,SYNCOPE,,,204,SYNCOPE & COLLAPSE,05,DISEASES AND DISORDERS OF THE CIRCULATORY SYSTEM,3,Major,Major,Medical,Medicare,Medicare,,,,true,46223.2,5430.29
Long Island,Suffolk,5123000,000885,Long Island Community Hospital,50 to 69,117,M,Black/African American,Not Span/Hispanic,1,Emergency,Home or Self Care,2019,SYM001,SYNCOPE,SUD002,PHARMACOTHERAPY FOR SUBSTANCE USE,204,SYNCOPE & COLLAPSE,05,DISEASES AND DISORDERS OF THE CIRCULATORY SYSTEM,2,Moderate,Minor,Medical,Private Health Insurance,Medicaid,,,,true,16550.35,2591.83
Long Island,Suffolk,5123000,000885,Long Island Community Hospital,18 to 29,119,M,Other Race,Not Span/Hispanic,1,Emergency,Home or Self Care,2019,SYM001,SYNCOPE,,,204,SYNCOPE & COLLAPSE,05,DISEASES AND DISORDERS OF THE CIRCULATORY SYSTEM,2,Moderate,Minor,Medical,Private Health Insurance,Medicaid,,,,true,33855.87,3629.1
Long Island,Suffolk,5123000,000885,Long Island Community Hospital,30 to 49,117,M,Other Race,Not Span/Hispanic,2,Emergency,Home or Self Care,2019,SYM001,SYNCOPE,SUD001,SUBSTANCE USE DETOXIFICATION,204,SYNCOPE & COLLAPSE,05,DISEASES AND DISORDERS OF THE CIRCULATORY SYSTEM,1,Minor,Minor,Medical,Self-Pay,,,,,true,49599.59,5836.4
Long Island,Suffolk,5123000,000885,Long Island Community Hospital,30 to 49,119,F,White,Not Span/Hispanic,1,Emergency,Left Against Medical Advice,2019,SYM001,SYNCOPE,,,204,SYNCOPE & COLLAPSE,05,DISEASES AND DISORDERS OF THE CIRCULATORY SYSTEM,3,Major,Moderate,Medical,Private Health Insurance,Medicaid,,,,true,33436.47,3672.17
Long Island,Suffolk,5123000,000885,Long Island Community Hospital,70 or Older,117,F,White,Not Span/Hispanic,3,Emergency,Skilled Nursing Home,2019,CIR031,HYPOTENSION,,,204,SYNCOPE & COLLAPSE,05,DISEASES AND DISORDERS OF THE CIRCULATORY SYSTEM,2,Moderate,Minor,Medical,Medicare,Medicare,Medicaid,,,true,52350.28,6633.41
Long Island,Suffolk,5123000,000885,Long Island Community Hospital,70 or Older,117,F,White,Not Span/Hispanic,2,Emergency,Home or Self Care,2019,SYM001,SYNCOPE,,,204,SYNCOPE & COLLAPSE,05,DISEASES AND DISORDERS OF THE CIRCULATORY SYSTEM,1,Minor,Moderate,Medical,Medicare,Medicare,Private Health Insurance,,,true,49366.5,4969.47
Long Island,Suffolk,5123000,000885,Long Island Community Hospital,70 or Older,117,M,White,Not Span/Hispanic,1,Emergency,Home w/ Home Health Services,2019,SYM001,SYNCOPE,,,204,SYNCOPE & COLLAPSE,05,DISEASES AND DISORDERS OF THE CIRCULATORY SYSTEM,2,Moderate,Minor,Medical,Medicare,,,,,true,14947.76,2156.94
Long Island,Suffolk,5123000,000885,Long Island Community Hospital,70 or Older,117,M,White,Not Span/Hispanic,1,Emergency,Left Against Medical Advice,2019,SYM001,SYNCOPE,,,204,SYNCOPE & COLLAPSE,05,DISEASES AND DISORDERS OF THE CIRCULATORY SYSTEM,3,Major,Major,Medical,Medicare,Medicare,,,,true,20016.64,2164.91
Long Island,Suffolk,5123000,000885,Long Island Community Hospital,30 to 49,117,M,White,Not Span/Hispanic,2,Emergency,Home or Self Care,2019,SYM001,SYNCOPE,ESA004,NON-INVASIVE VENTILATION,204,SYNCOPE & COLLAPSE,05,DISEASES AND DISORDERS OF THE CIRCULATORY SYSTEM,3,Major,Major,Medical,Private Health Insurance,,,,,true,31065.27,4222.01
Long Island,Suffolk,5123000,000885,Long Island Community Hospital,50 to 69,119,F,White,Not Span/Hispanic,3,Emergency,Home or Self Care,2019,SYM001,SYNCOPE,,,204,SYNCOPE & COLLAPSE,05,DISEASES AND DISORDERS OF THE CIRCULATORY SYSTEM,2,Moderate,Minor,Medical,Private Health Insurance,Medicaid,,,,true,65860.43,5933.74
Long Island,Suffolk,5123000,000885,Long Island Community Hospital,50 to 69,117,M,Black/African American,Not Span/Hispanic,3,Emergency,Home or Self Care,2019,SYM001,SYNCOPE,ADM001,TRANSFUSION OF BLOOD AND BLOOD PRODUCTS,204,SYNCOPE & COLLAPSE,05,DISEASES AND DISORDERS OF THE CIRCULATORY SYSTEM,3,Major,Major,Medical,Private Health Insurance,,,,,true,50340.9,7440.26
Long Island,Suffolk,5123000,000885,Long Island Community Hospital,50 to 69,117,F,White,Not Span/Hispanic,2,Emergency,Home or Self Care,2019,SYM001,SYNCOPE,,,204,SYNCOPE & COLLAPSE,05,DISEASES AND DISORDERS OF THE CIRCULATORY SYSTEM,2,Moderate,Minor,Medical,Blue Cross/Blue Shield,,,,,true,65832.74,9200.91
Long Island,Suffolk,5123000,000885,Long Island Community Hospital,70 or Older,117,F,White,Not Span/Hispanic,2,Emergency,Home or Self Care,2019,SYM001,SYNCOPE,,,204,SYNCOPE & COLLAPSE,05,DISEASES AND DISORDERS OF THE CIRCULATORY SYSTEM,2,Moderate,Minor,Medical,Medicare,Medicare,Private Health Insurance,,,true,36778.19,5438.75
Long Island,Suffolk,5123000,000885,Long Island Community Hospital,70 or Older,117,F,White,Not Span/Hispanic,7,Emergency,Skilled Nursing Home,2019,SYM001,SYNCOPE,,,204,SYNCOPE & COLLAPSE,05,DISEASES AND DISORDERS OF THE CIRCULATORY SYSTEM,2,Moderate,Minor,Medical,Medicare,Medicare,Private Health Insurance,,,true,49067.24,9744.55
Long Island,Suffolk,5123000,000885,Long Island Community Hospital,70 or Older,117,M,White,Not Span/Hispanic,22,Emergency,Skilled Nursing Home,2019,SYM001,SYNCOPE,SUD001,SUBSTANCE USE DETOXIFICATION,204,SYNCOPE & COLLAPSE,05,DISEASES AND DISORDERS OF THE CIRCULATORY SYSTEM,4,Extreme,Extreme,Medical,Medicare,Blue Cross/Blue Shield,,,,true,236615.96,37917.72
Long Island,Suffolk,5123000,000885,Long Island Community Hospital,70 or Older,117,F,White,Not Span/Hispanic,2,Emergency,Home or Self Care,2019,SYM001,SYNCOPE,,,204,SYNCOPE & COLLAPSE,05,DISEASES AND DISORDERS OF THE CIRCULATORY SYSTEM,2,Moderate,Moderate,Medical,Medicare,Medicare,Blue Cross/Blue Shield,,,true,47979.46,6067.17
Long Island,Suffolk,5123000,000885,Long Island Community Hospital,50 to 69,117,F,White,Not Span/Hispanic,5,Emergency,Home or Self Care,2019,SYM001,SYNCOPE,MAM011,ELECTROENCEPHALOGRAM (EEG),204,SYNCOPE & COLLAPSE,05,DISEASES AND DISORDERS OF THE CIRCULATORY SYSTEM,2,Moderate,Moderate,Medical,Medicaid,,,,,true,99076.92,11634.8
Long Island,Suffolk,5123000,000885,Long Island Community Hospital,70 or Older,119,F,White,Not Span/Hispanic,2,Emergency,Home or Self Care,2019,CIR031,HYPOTENSION,,,204,SYNCOPE & COLLAPSE,05,DISEASES AND DISORDERS OF THE CIRCULATORY SYSTEM,2,Moderate,Minor,Medical,Medicare,Medicare,Private Health Insurance,,,true,14776.81,2995.39
Long Island,Suffolk,5123000,000885,Long Island Community Hospital,70 or Older,117,M,White,Not Span/Hispanic,1,Emergency,Home w/ Home Health Services,2019,SYM001,SYNCOPE,,,204,SYNCOPE & COLLAPSE,05,DISEASES AND DISORDERS OF THE CIRCULATORY SYSTEM,2,Moderate,Moderate,Medical,Medicare,Medicare,Private Health Insurance,,,true,43663.73,4793.07
Long Island,Suffolk,5123000,000885,Long Island Community Hospital,70 or Older,119,F,Other Race,Not Span/Hispanic,5,Emergency,Home w/ Home Health Services,2019,CIR031,HYPOTENSION,,,204,SYNCOPE & COLLAPSE,05,DISEASES AND DISORDERS OF THE CIRCULATORY SYSTEM,3,Major,Moderate,Medical,Medicare,Medicaid,,,,true,49515.47,8364.82
Long Island,Suffolk,5123000,000885,Long Island Community Hospital,50 to 69,117,F,White,Not Span/Hispanic,4,Emergency,Home or Self Care,2019,SYM001,SYNCOPE,CAR024,VENOUS AND ARTERIAL CATHETER PLACEMENT,204,SYNCOPE & COLLAPSE,05,DISEASES AND DISORDERS OF THE CIRCULATORY SYSTEM,3,Major,Moderate,Medical,Medicare,Medicare,Medicaid,,,true,57253.55,6760.69
Long Island,Suffolk,5123000,000885,Long Island Community Hospital,70 or Older,119,F,White,Not Span/Hispanic,2,Emergency,Home w/ Home Health Services,2019,SYM001,SYNCOPE,MAM006,PACEMAKER AND DEFIBRILLATOR INTERROGATION,204,SYNCOPE & COLLAPSE,05,DISEASES AND DISORDERS OF THE CIRCULATORY SYSTEM,3,Major,Major,Medical,Medicare,Medicare,Private Health Insurance,,,true,47536.58,4905.28
Long Island,Suffolk,5123000,000885,Long Island Community Hospital,70 or Older,119,M,White,Not Span/Hispanic,5,Emergency,Skilled Nursing Home,2019,SYM001,SYNCOPE,,,204,SYNCOPE & COLLAPSE,05,DISEASES AND DISORDERS OF THE CIRCULATORY SYSTEM,2,Moderate,Minor,Medical,Medicare,Medicare,,,,true,53781.36,7064.98
Long Island,Suffolk,5123000,000885,Long Island Community Hospital,70 or Older,117,F,Other Race,Spanish/Hispanic,3,Emergency,Home w/ Home Health Services,2019,SYM001,SYNCOPE,,,204,SYNCOPE & COLLAPSE,05,DISEASES AND DISORDERS OF THE CIRCULATORY SYSTEM,2,Moderate,Moderate,Medical,Medicare,,,,,true,22652.5,4455.3
Long Island,Suffolk,5123000,000885,Long Island Community Hospital,70 or Older,117,M,Black/African American,Not Span/Hispanic,4,Emergency,Home or Self Care,2019,SYM001,SYNCOPE,ESA001,HEMODIALYSIS,204,SYNCOPE & COLLAPSE,05,DISEASES AND DISORDERS OF THE CIRCULATORY SYSTEM,2,Moderate,Moderate,Medical,Medicare,Medicaid,,,,true,54373.92,7757.93
Long Island,Suffolk,5123000,000885,Long Island Community Hospital,50 to 69,117,M,White,Not Span/Hispanic,4,Emergency,Home or Self Care,2019,SYM001,SYNCOPE,,,204,SYNCOPE & COLLAPSE,05,DISEASES AND DISORDERS OF THE CIRCULATORY SYSTEM,1,Minor,Minor,Medical,Medicare,Medicare,Medicaid,,,true,30805.32,5426.37
Long Island,Suffolk,5123000,000885,Long Island Community Hospital,50 to 69,119,M,White,Not Span/Hispanic,3,Emergency,Home or Self Care,2019,SYM001,SYNCOPE,,,204,SYNCOPE & COLLAPSE,05,DISEASES AND DISORDERS OF THE CIRCULATORY SYSTEM,2,Moderate,Minor,Medical,Blue Cross/Blue Shield,,,,,true,50000.05,6799.15
Long Island,Suffolk,5123000,000885,Long Island Community Hospital,70 or Older,117,M,White,Not Span/Hispanic,4,Emergency,Home w/ Home Health Services,2019,CIR031,HYPOTENSION,,,204,SYNCOPE & COLLAPSE,05,DISEASES AND DISORDERS OF THE CIRCULATORY SYSTEM,3,Major,Major,Medical,Medicare,Medicare,Blue Cross/Blue Shield,,,true,36539.09,6475.16
Long Island,Suffolk,5123000,000885,Long Island Community Hospital,70 or Older,117,M,Black/African American,Not Span/Hispanic,4,Emergency,Home or Self Care,2019,SYM001,SYNCOPE,MAM006,PACEMAKER AND DEFIBRILLATOR INTERROGATION,204,SYNCOPE & COLLAPSE,05,DISEASES AND DISORDERS OF THE CIRCULATORY SYSTEM,2,Moderate,Major,Medical,Medicare,Medicare,,,,true,60214.13,7135.87
Long Island,Suffolk,5123000,000885,Long Island Community Hospital,70 or Older,117,F,White,Not Span/Hispanic,2,Emergency,Skilled Nursing Home,2019,SYM001,SYNCOPE,MST028,"SUBCUTANEOUS TISSUE AND FASCIA PROCEDURES, NEC",204,SYNCOPE & COLLAPSE,05,DISEASES AND DISORDERS OF THE CIRCULATORY SYSTEM,1,Minor,Moderate,Medical,Medicare,,,,,true,104026.21,16010.59
Long Island,Suffolk,5123000,000885,Long Island Community Hospital,18 to 29,117,F,White,Not Span/Hispanic,3,Emergency,Home or Self Care,2019,SYM001,SYNCOPE,,,204,SYNCOPE & COLLAPSE,05,DISEASES AND DISORDERS OF THE CIRCULATORY SYSTEM,2,Moderate,Minor,Medical,Private Health Insurance,Medicaid,,,,true,76042.1,11787.39
Long Island,Suffolk,5123000,000885,Long Island Community Hospital,50 to 69,119,M,White,Not Span/Hispanic,5,Emergency,Home or Self Care,2019,CIR031,HYPOTENSION,,,204,SYNCOPE & COLLAPSE,05,DISEASES AND DISORDERS OF THE CIRCULATORY SYSTEM,2,Moderate,Minor,Medical,Private Health Insurance,Medicaid,,,,true,74806.26,9337.46
Long Island,Suffolk,5123000,000885,Long Island Community Hospital,70 or Older,117,M,White,Not Span/Hispanic,5,Emergency,Home w/ Home Health Services,2019,SYM001,SYNCOPE,MST028,"SUBCUTANEOUS TISSUE AND FASCIA PROCEDURES, NEC",204,SYNCOPE & COLLAPSE,05,DISEASES AND DISORDERS OF THE CIRCULATORY SYSTEM,3,Major,Major,Medical,Medicare,Medicare,,,,true,121240.97,20118.22
Long Island,Suffolk,5123000,000885,Long Island Community Hospital,70 or Older,117,M,White,Not Span/Hispanic,1,Emergency,Home or Self Care,2019,SYM001,SYNCOPE,,,204,SYNCOPE & COLLAPSE,05,DISEASES AND DISORDERS OF THE CIRCULATORY SYSTEM,1,Minor,Moderate,Medical,Medicare,Medicare,Blue Cross/Blue Shield,,,true,17242.43,2277.05
Long Island,Suffolk,5123000,000885,Long Island Community Hospital,70 or Older,117,F,White,Not Span/Hispanic,2,Emergency,Hospice - Home,2019,SYM001,SYNCOPE,,,204,SYNCOPE & COLLAPSE,05,DISEASES AND DISORDERS OF THE CIRCULATORY SYSTEM,1,Minor,Moderate,Medical,Medicare,Medicare,Private Health Insurance,,,true,13703.78,2906.97
Long Island,Suffolk,5123000,000885,Long Island Community Hospital,70 or Older,117,M,White,Not Span/Hispanic,4,Emergency,Home w/ Home Health Services,2019,SYM001,SYNCOPE,,,204,SYNCOPE & COLLAPSE,05,DISEASES AND DISORDERS OF THE CIRCULATORY SYSTEM,2,Moderate,Moderate,Medical,Medicare,Medicare,Private Health Insurance,,,true,48992.15,5931.8
Long Island,Suffolk,5123000,000885,Long Island Community Hospital,70 or Older,117,F,White,Not Span/Hispanic,4,Emergency,Skilled Nursing Home,2019,CIR031,HYPOTENSION,,,204,SYNCOPE & COLLAPSE,05,DISEASES AND DISORDERS OF THE CIRCULATORY SYSTEM,3,Major,Major,Medical,Medicare,Medicare,Blue Cross/Blue Shield,,,true,33815.27,5654.62
Long Island,Suffolk,5123000,000885,Long Island Community Hospital,50 to 69,119,F,White,Not Span/Hispanic,4,Emergency,Skilled Nursing Home,2019,SYM001,SYNCOPE,,,204,SYNCOPE & COLLAPSE,05,DISEASES AND DISORDERS OF THE CIRCULATORY SYSTEM,1,Minor,Minor,Medical,Blue Cross/Blue Shield,Medicare,,,,true,55992.19,6474.72
Long Island,Suffolk,5123000,000885,Long Island Community Hospital,70 or Older,117,M,White,Not Span/Hispanic,1,Emergency,Home or Self Care,2019,SYM001,SYNCOPE,,,204,SYNCOPE & COLLAPSE,05,DISEASES AND DISORDERS OF THE CIRCULATORY SYSTEM,2,Moderate,Major,Medical,Medicare,Medicare,Private Health Insurance,,,true,15851.15,1788.04
Long Island,Suffolk,5123000,000885,Long Island Community Hospital,50 to 69,117,F,White,Not Span/Hispanic,2,Emergency,Home or Self Care,2019,SYM001,SYNCOPE,,,204,SYNCOPE & COLLAPSE,05,DISEASES AND DISORDERS OF THE CIRCULATORY SYSTEM,2,Moderate,Moderate,Medical,Private Health Insurance,,,,,true,41150.47,5493.07
Long Island,Suffolk,5123000,000885,Long Island Community Hospital,50 to 69,119,F,White,Not Span/Hispanic,2,Emergency,Home w/ Home Health Services,2019,CIR031,HYPOTENSION,,,204,SYNCOPE & COLLAPSE,05,DISEASES AND DISORDERS OF THE CIRCULATORY SYSTEM,2,Moderate,Minor,Medical,Medicare,Medicare,Medicaid,,,true,34383.82,3425.18
Long Island,Suffolk,5123000,000885,Long Island Community Hospital,50 to 69,117,M,White,Not Span/Hispanic,4,Emergency,Home or Self Care,2019,SYM001,SYNCOPE,,,204,SYNCOPE & COLLAPSE,05,DISEASES AND DISORDERS OF THE CIRCULATORY SYSTEM,2,Moderate,Minor,Medical,Blue Cross/Blue Shield,,,,,true,72069.29,9950.01
Long Island,Suffolk,5123000,000885,Long Island Community Hospital,70 or Older,117,M,White,Not Span/Hispanic,1,Emergency,Home or Self Care,2019,CIR031,HYPOTENSION,,,204,SYNCOPE & COLLAPSE,05,DISEASES AND DISORDERS OF THE CIRCULATORY SYSTEM,2,Moderate,Moderate,Medical,Medicare,Medicare,Private Health Insurance,,,true,35762.33,3134.47
Long Island,Suffolk,5123000,000885,Long Island Community Hospital,70 or Older,119,F,White,Not Span/Hispanic,2,Emergency,Short-term Hospital,2019,SYM001,SYNCOPE,,,204,SYNCOPE & COLLAPSE,05,DISEASES AND DISORDERS OF THE CIRCULATORY SYSTEM,3,Major,Major,Medical,Medicare,Medicare,Blue Cross/Blue Shield,,,true,26417.66,4191.15
Long Island,Suffolk,5123000,000885,Long Island Community Hospital,50 to 69,117,M,White,Not Span/Hispanic,5,Urgent,Home or Self Care,2019,SYM001,SYNCOPE,,,204,SYNCOPE & COLLAPSE,05,DISEASES AND DISORDERS OF THE CIRCULATORY SYSTEM,2,Moderate,Minor,Medical,Medicare,Medicare,,,,false,31178.77,6732.29
Long Island,Suffolk,5123000,000885,Long Island Community Hospital,50 to 69,117,M,White,Not Span/Hispanic,2,Emergency,Skilled Nursing Home,2019,SYM001,SYNCOPE,SKB006,SKIN LACERATION REPAIR (EXCLUDING PERINEUM),204,SYNCOPE & COLLAPSE,05,DISEASES AND DISORDERS OF THE CIRCULATORY SYSTEM,2,Moderate,Minor,Medical,Medicare,,,,,true,20868.82,3058.92
Long Island,Suffolk,5123000,000885,Long Island Community Hospital,70 or Older,117,F,White,Not Span/Hispanic,4,Emergency,Skilled Nursing Home,2019,SYM001,SYNCOPE,,,204,SYNCOPE & COLLAPSE,05,DISEASES AND DISORDERS OF THE CIRCULATORY SYSTEM,2,Moderate,Moderate,Medical,Medicare,Medicare,,,,true,33988.49,6477.07
Long Island,Suffolk,5123000,000885,Long Island Community Hospital,70 or Older,117,M,White,Not Span/Hispanic,3,Emergency,Skilled Nursing Home,2019,SYM001,SYNCOPE,,,204,SYNCOPE & COLLAPSE,05,DISEASES AND DISORDERS OF THE CIRCULATORY SYSTEM,3,Major,Major,Medical,Medicare,Medicare,,,,true,36444.75,5959.12
Long Island,Suffolk,5123000,000885,Long Island Community Hospital,50 to 69,117,M,White,Not Span/Hispanic,3,Emergency,Home or Self Care,2019,CIR031,HYPOTENSION,ESA004,NON-INVASIVE VENTILATION,204,SYNCOPE & COLLAPSE,05,DISEASES AND DISORDERS OF THE CIRCULATORY SYSTEM,2,Moderate,Minor,Medical,Medicare,Medicare,Private Health Insurance,,,true,85422.12,8301.83
Long Island,Suffolk,5123000,000885,Long Island Community Hospital,18 to 29,117,F,Other Race,Not Span/Hispanic,4,Emergency,Home or Self Care,2019,SYM001,SYNCOPE,CNS002,LUMBAR PUNCTURE,204,SYNCOPE & COLLAPSE,05,DISEASES AND DISORDERS OF THE CIRCULATORY SYSTEM,1,Minor,Minor,Medical,Private Health Insurance,,,,,true,51695.29,8520.4
Long Island,Suffolk,5123000,000885,Long Island Community Hospital,70 or Older,117,F,White,Not Span/Hispanic,6,Emergency,Home w/ Home Health Services,2019,SYM001,SYNCOPE,ESA001,HEMODIALYSIS,204,SYNCOPE & COLLAPSE,05,DISEASES AND DISORDERS OF THE CIRCULATORY SYSTEM,3,Major,Major,Medical,Medicare,Medicare,Blue Cross/Blue Shield,,,true,69604,15318.53
Long Island,Suffolk,5123000,000885,Long Island Community Hospital,30 to 49,119,F,White,Not Span/Hispanic,5,Emergency,Home or Self Care,2019,SYM001,SYNCOPE,MAM011,ELECTROENCEPHALOGRAM (EEG),204,SYNCOPE & COLLAPSE,05,DISEASES AND DISORDERS OF THE CIRCULATORY SYSTEM,2,Moderate,Moderate,Medical,Medicare,Medicare,Private Health Insurance,,,true,60395.28,7618.29
Long Island,Suffolk,5123000,000885,Long Island Community Hospital,70 or Older,117,F,White,Not Span/Hispanic,1,Emergency,Home w/ Home Health Services,2019,SYM001,SYNCOPE,,,204,SYNCOPE & COLLAPSE,05,DISEASES AND DISORDERS OF THE CIRCULATORY SYSTEM,3,Major,Major,Medical,Medicare,,,,,true,16957.57,2128.12
Long Island,Suffolk,5123000,000885,Long Island Community Hospital,30 to 49,119,F,White,Not Span/Hispanic,6,Emergency,Home or Self Care,2019,SYM001,SYNCOPE,,,204,SYNCOPE & COLLAPSE,05,DISEASES AND DISORDERS OF THE CIRCULATORY SYSTEM,3,Major,Moderate,Medical,Medicare,Medicare,Private Health Insurance,,,true,67472.09,8465.45
Long Island,Suffolk,5123000,000885,Long Island Community Hospital,30 to 49,119,M,White,Not Span/Hispanic,2,Emergency,Home or Self Care,2019,SYM001,SYNCOPE,,,204,SYNCOPE & COLLAPSE,05,DISEASES AND DISORDERS OF THE CIRCULATORY SYSTEM,2,Moderate,Minor,Medical,Medicare,Medicare,Medicaid,,,true,33134.18,5722.76
Long Island,Suffolk,5123000,000885,Long Island Community Hospital,70 or Older,117,M,White,Not Span/Hispanic,2,Emergency,Home w/ Home Health Services,2019,SYM001,SYNCOPE,PLC001,IMMOBILIZATION BY SPLINT OR OTHER EXTERNAL DEVICE,204,SYNCOPE & COLLAPSE,05,DISEASES AND DISORDERS OF THE CIRCULATORY SYSTEM,2,Moderate,Moderate,Medical,Medicare,,,,,true,55404.39,4570.15
Long Island,Suffolk,5123000,000885,Long Island Community Hospital,70 or Older,119,F,White,Not Span/Hispanic,1,Emergency,Home or Self Care,2019,SYM001,SYNCOPE,,,204,SYNCOPE & COLLAPSE,05,DISEASES AND DISORDERS OF THE CIRCULATORY SYSTEM,3,Major,Moderate,Medical,Medicare,Medicare,Private Health Insurance,,,true,27643.52,2230.65
Long Island,Suffolk,5123000,000885,Long Island Community Hospital,70 or Older,117,F,White,Not Span/Hispanic,4,Emergency,Skilled Nursing Home,2019,SYM001,SYNCOPE,,,204,SYNCOPE & COLLAPSE,05,DISEASES AND DISORDERS OF THE CIRCULATORY SYSTEM,1,Minor,Moderate,Medical,Medicare,Medicare,Private Health Insurance,,,true,43678.63,6393.03
Long Island,Suffolk,5123000,000885,Long Island Community Hospital,70 or Older,119,F,White,Not Span/Hispanic,4,Emergency,Home or Self Care,2019,SYM001,SYNCOPE,,,204,SYNCOPE & COLLAPSE,05,DISEASES AND DISORDERS OF THE CIRCULATORY SYSTEM,4,Extreme,Extreme,Medical,Medicare,Private Health Insurance,,,,true,61249.64,10036.27
Long Island,Suffolk,5123000,000885,Long Island Community Hospital,70 or Older,117,F,White,Not Span/Hispanic,3,Emergency,Home w/ Home Health Services,2019,SYM001,SYNCOPE,,,204,SYNCOPE & COLLAPSE,05,DISEASES AND DISORDERS OF THE CIRCULATORY SYSTEM,3,Major,Major,Medical,Medicare,Medicare,Blue Cross/Blue Shield,,,true,38478.75,6205.51
Long Island,Suffolk,5123000,000885,Long Island Community Hospital,50 to 69,117,M,Other Race,Not Span/Hispanic,1,Emergency,Home or Self Care,2019,SYM001,SYNCOPE,,,204,SYNCOPE & COLLAPSE,05,DISEASES AND DISORDERS OF THE CIRCULATORY SYSTEM,2,Moderate,Moderate,Medical,Medicare,Medicare,Medicaid,,,true,31257.97,2337.97
Long Island,Suffolk,5123000,000885,Long Island Community Hospital,50 to 69,119,M,White,Not Span/Hispanic,1,Emergency,Left Against Medical Advice,2019,SYM001,SYNCOPE,,,204,SYNCOPE & COLLAPSE,05,DISEASES AND DISORDERS OF THE CIRCULATORY SYSTEM,2,Moderate,Minor,Medical,Medicare,Medicare,Medicaid,,,true,12295.11,1728.63
Long Island,Suffolk,5123000,000885,Long Island Community Hospital,50 to 69,117,F,White,Not Span/Hispanic,4,Emergency,Skilled Nursing Home,2019,SYM001,SYNCOPE,,,204,SYNCOPE & COLLAPSE,05,DISEASES AND DISORDERS OF THE CIRCULATORY SYSTEM,2,Moderate,Moderate,Medical,Medicare,Medicaid,,,,true,49511.9,7609.19
Long Island,Suffolk,5123000,000885,Long Island Community Hospital,30 to 49,119,F,White,Not Span/Hispanic,2,Emergency,Home or Self Care,2019,SYM001,SYNCOPE,GIS002,COLONOSCOPY AND PROCTOSCOPY WITH BIOPSY,204,SYNCOPE & COLLAPSE,05,DISEASES AND DISORDERS OF THE CIRCULATORY SYSTEM,2,Moderate,Minor,Medical,Blue Cross/Blue Shield,,,,,true,79324.85,9451.58
Long Island,Suffolk,5123000,000885,Long Island Community Hospital,50 to 69,117,F,White,Not Span/Hispanic,11,Emergency,Skilled Nursing Home,2019,SYM001,SYNCOPE,CAR029,"CARDIOVASCULAR DEVICE PROCEDURES, NEC",204,SYNCOPE & COLLAPSE,05,DISEASES AND DISORDERS OF THE CIRCULATORY SYSTEM,3,Major,Moderate,Medical,Medicaid,,,,,true,97935.87,17185.91
Long Island,Suffolk,5123000,000885,Long Island Community Hospital,70 or Older,117,F,White,Not Span/Hispanic,1,Emergency,Home or Self Care,2019,CIR031,HYPOTENSION,,,204,SYNCOPE & COLLAPSE,05,DISEASES AND DISORDERS OF THE CIRCULATORY SYSTEM,2,Moderate,Moderate,Medical,Medicare,Medicare,Private Health Insurance,,,true,46321.63,3571.89