Hospital Service Area,Hospital County,Operating Certificate Number,Permanent Facility Id,Facility Name,Age Group,Zip Code - 3 digits,Gender,Race,Ethnicity,Length of Stay,Type of Admission,Patient Disposition,Discharge Year,CCS Diagnosis Code,CCS Diagnosis Description,CCS Procedure Code,CCS Procedure Description,APR DRG Code,APR DRG Description,APR MDC Code,APR MDC Description,APR Severity of Illness Code,APR Severity of Illness Description,APR Risk of Mortality,APR Medical Surgical Description,Payment Typology 1,Payment Typology 2,Payment Typology 3,Birth Weight,Abortion Edit Indicator,Emergency Department Indicator,Total Charges,Total Costs
New York City,Manhattan,7002001,001438,Bellevue Hospital Center,18 to 29,113,M,Black/African American,Not Span/Hispanic,5,Emergency,Court/Law Enforcement,2020,SYM001,SYNCOPE,MAM011,ELECTROENCEPHALOGRAM (EEG),204,SYNCOPE & COLLAPSE,05,DISEASES AND DISORDERS OF THE CIRCULATORY SYSTEM,1,Minor,Minor,Medical,Private Health Insurance,Medicaid,,,,Y,39456.59,22690.85
New York City,Manhattan,7002001,001438,Bellevue Hospital Center,30 to 49,112,M,Other Race,Spanish/Hispanic,2,Trauma,Home or Self Care,2020,SYM001,SYNCOPE,ESA003,MECHANICAL VENTILATION,204,SYNCOPE & COLLAPSE,05,DISEASES AND DISORDERS OF THE CIRCULATORY SYSTEM,3,Major,Major,Medical,Medicaid,,,,,Y,32127.44,18475.98
New York City,Manhattan,7002001,001438,Bellevue Hospital Center,50 to 69,104,M,Black/African American,Not Span/Hispanic,2,Emergency,Home or Self Care,2020,SYM001,SYNCOPE,MAM014,PULMONARY FUNCTION TESTS,204,SYNCOPE & COLLAPSE,05,DISEASES AND DISORDERS OF THE CIRCULATORY SYSTEM,1,Minor,Minor,Medical,Medicaid,,,,,Y,18465.15,10619.01
New York City,Manhattan,7002001,001438,Bellevue Hospital Center,70 or Older,100,F,White,Not Span/Hispanic,5,Emergency,Home or Self Care,2020,SYM001,SYNCOPE,IMG007,COMPUTERIZED TOMOGRAPHY (CT) WITHOUT CONTRAST,204,SYNCOPE & COLLAPSE,05,DISEASES AND DISORDERS OF THE CIRCULATORY SYSTEM,2,Moderate,Minor,Medical,Medicare,,,,,Y,37912.09,21802.64
New York City,Manhattan,7002001,001438,Bellevue Hospital Center,50 to 69,112,M,Multi-racial,Not Span/Hispanic,1,Emergency,Home or Self Care,2020,SYM001,SYNCOPE,ADM017,ADMINISTRATION OF NUTRITIONAL AND ELECTROLYTIC SUBSTANCES,204,SYNCOPE & COLLAPSE,05,DISEASES AND DISORDERS OF THE CIRCULATORY SYSTEM,2,Moderate,Minor,Medical,Medicare,Medicaid,,,,Y,11424.72,6570.17
New York City,Manhattan,7002001,001438,Bellevue Hospital Center,70 or Older,100,F,White,Not Span/Hispanic,2,Emergency,Home or Self Care,2020,SYM001,SYNCOPE,MST028,"SUBCUTANEOUS TISSUE AND FASCIA PROCEDURES, NEC",204,SYNCOPE & COLLAPSE,05,DISEASES AND DISORDERS OF THE CIRCULATORY SYSTEM,2,Moderate,Minor,Medical,Medicare,Private Health Insurance,,,,Y,25472.32,14648.72
New York City,Manhattan,7002001,001438,Bellevue Hospital Center,50 to 69,100,F,White,Not Span/Hispanic,1,Emergency,Home or Self Care,2020,SYM001,SYNCOPE,SKB006,SKIN LACERATION REPAIR (EXCLUDING PERINEUM),204,SYNCOPE & COLLAPSE,05,DISEASES AND DISORDERS OF THE CIRCULATORY SYSTEM,1,Minor,Minor,Medical,Medicare,Medicare,,,,Y,13130.3,7551.03
New York City,Manhattan,7002001,001438,Bellevue Hospital Center,70 or Older,112,M,Other Race,Spanish/Hispanic,5,Emergency,Home or Self Care,2020,CIR031,HYPOTENSION,MAM006,PACEMAKER AND DEFIBRILLATOR INTERROGATION,204,SYNCOPE & COLLAPSE,05,DISEASES AND DISORDERS OF THE CIRCULATORY SYSTEM,2,Moderate,Major,Medical,Medicare,Medicaid,,,,Y,37818.21,21748.65
New York City,Manhattan,7002001,001438,Bellevue Hospital Center,70 or Older,100,M,Other Race,Not Span/Hispanic,10,Emergency,Home w/ Home Health Services,2020,SYM001,SYNCOPE,ADM021,"ADMINISTRATION OF THERAPEUTIC SUBSTANCES, NEC",204,SYNCOPE & COLLAPSE,05,DISEASES AND DISORDERS OF THE CIRCULATORY SYSTEM,2,Moderate,Major,Medical,Medicare,Medicaid,,,,Y,81170.61,46679.92
New York City,Manhattan,7002001,001438,Bellevue Hospital Center,50 to 69,OOS,M,Black/African American,Not Span/Hispanic,1,Emergency,Home or Self Care,2020,SYM001,SYNCOPE,MAM006,PACEMAKER AND DEFIBRILLATOR INTERROGATION,204,SYNCOPE & COLLAPSE,05,DISEASES AND DISORDERS OF THE CIRCULATORY SYSTEM,2,Moderate,Minor,Medical,Private Health Insurance,,,,,Y,10582.41,6085.77
New York City,Manhattan,7002001,001438,Bellevue Hospital Center,50 to 69,113,M,Black/African American,Not Span/Hispanic,1,Emergency,Court/Law Enforcement,2020,SYM001,SYNCOPE,SUD002,PHARMACOTHERAPY FOR SUBSTANCE USE,204,SYNCOPE & COLLAPSE,05,DISEASES AND DISORDERS OF THE CIRCULATORY SYSTEM,2,Moderate,Minor,Medical,Medicaid,,,,,N,8841.76,5084.75
New York City,Manhattan,7002001,001438,Bellevue Hospital Center,70 or Older,104,M,Other Race,Spanish/Hispanic,7,Emergency,Home or Self Care,2020,CIR031,HYPOTENSION,ADM021,"ADMINISTRATION OF THERAPEUTIC SUBSTANCES, NEC",204,SYNCOPE & COLLAPSE,05,DISEASES AND DISORDERS OF THE CIRCULATORY SYSTEM,2,Moderate,Moderate,Medical,Medicare,,,,,Y,50675.58,29142.72
New York City,Manhattan,7002001,001438,Bellevue Hospital Center,50 to 69,104,M,Other Race,Not Span/Hispanic,5,Emergency,Home w/ Home Health Services,2020,CIR031,HYPOTENSION,ADM017,ADMINISTRATION OF NUTRITIONAL AND ELECTROLYTIC SUBSTANCES,204,SYNCOPE & COLLAPSE,05,DISEASES AND DISORDERS OF THE CIRCULATORY SYSTEM,2,Moderate,Moderate,Medical,Medicaid,,,,,Y,39830.7,22906
New York City,Manhattan,7002001,001438,Bellevue Hospital Center,50 to 69,113,M,Other Race,Not Span/Hispanic,2,Emergency,Home or Self Care,2020,SYM001,SYNCOPE,MAM008,CARDIAC MONITORING,204,SYNCOPE & COLLAPSE,05,DISEASES AND DISORDERS OF THE CIRCULATORY SYSTEM,2,Moderate,Moderate,Medical,Private Health Insurance,,,,,Y,17096.21,9831.76
New York City,Manhattan,7002001,001438,Bellevue Hospital Center,50 to 69,100,M,White,Not Span/Hispanic,1,Emergency,Left Against Medical Advice,2020,CIR031,HYPOTENSION,ADM017,ADMINISTRATION OF NUTRITIONAL AND ELECTROLYTIC SUBSTANCES,204,SYNCOPE & COLLAPSE,05,DISEASES AND DISORDERS OF THE CIRCULATORY SYSTEM,2,Moderate,Moderate,Medical,Medicaid,,,,,Y,9977.38,5737.83
New York City,Manhattan,7002001,001438,Bellevue Hospital Center,30 to 49,104,M,Black/African American,Not Span/Hispanic,1,Emergency,Home or Self Care,2020,SYM001,SYNCOPE,ADM021,"ADMINISTRATION OF THERAPEUTIC SUBSTANCES, NEC",204,SYNCOPE & COLLAPSE,05,DISEASES AND DISORDERS OF THE CIRCULATORY SYSTEM,2,Moderate,Moderate,Medical,Medicaid,,,,,Y,13225.62,7605.84
New York City,Manhattan,7002001,001438,Bellevue Hospital Center,50 to 69,113,M,Other Race,Unknown,1,Emergency,Court/Law Enforcement,2020,SYM001,SYNCOPE,,,204,SYNCOPE & COLLAPSE,05,DISEASES AND DISORDERS OF THE CIRCULATORY SYSTEM,1,Minor,Minor,Medical,Medicaid,,,,,Y,12765.23,7341.08
New York City,Manhattan,7002001,001438,Bellevue Hospital Center,18 to 29,112,M,Black/African American,Not Span/Hispanic,1,Urgent,Home or Self Care,2020,CIR031,HYPOTENSION,ADM021,"ADMINISTRATION OF THERAPEUTIC SUBSTANCES, NEC",204,SYNCOPE & COLLAPSE,05,DISEASES AND DISORDERS OF THE CIRCULATORY SYSTEM,2,Moderate,Moderate,Medical,Medicaid,,,,,N,8812.02,5067.65
New York City,Manhattan,7002001,001438,Bellevue Hospital Center,50 to 69,104,M,Other Race,Spanish/Hispanic,1,Urgent,Home or Self Care,2020,SYM001,SYNCOPE,ADM021,"ADMINISTRATION OF THERAPEUTIC SUBSTANCES, NEC",204,SYNCOPE & COLLAPSE,05,DISEASES AND DISORDERS OF THE CIRCULATORY SYSTEM,1,Minor,Minor,Medical,Medicaid,,,,,N,6424.36,3694.55
New York City,Manhattan,7002001,001438,Bellevue Hospital Center,50 to 69,100,M,White,Not Span/Hispanic,3,Emergency,Home or Self Care,2020,CIR031,HYPOTENSION,SKB006,SKIN LACERATION REPAIR (EXCLUDING PERINEUM),204,SYNCOPE & COLLAPSE,05,DISEASES AND DISORDERS OF THE CIRCULATORY SYSTEM,2,Moderate,Minor,Medical,Medicare,Medicaid,,,,Y,30804.88,17715.39
New York City,Manhattan,7002001,001438,Bellevue Hospital Center,50 to 69,112,M,White,Not Span/Hispanic,1,Emergency,Home or Self Care,2020,SYM001,SYNCOPE,ADM017,ADMINISTRATION OF NUTRITIONAL AND ELECTROLYTIC SUBSTANCES,204,SYNCOPE & COLLAPSE,05,DISEASES AND DISORDERS OF THE CIRCULATORY SYSTEM,3,Major,Major,Medical,Medicaid,,,,,Y,9095.07,5230.43
New York City,Manhattan,7002001,001438,Bellevue Hospital Center,50 to 69,112,F,Other Race,Spanish/Hispanic,2,Emergency,Home or Self Care,2020,SYM001,SYNCOPE,IMG007,COMPUTERIZED TOMOGRAPHY (CT) WITHOUT CONTRAST,204,SYNCOPE & COLLAPSE,05,DISEASES AND DISORDERS OF THE CIRCULATORY SYSTEM,2,Moderate,Minor,Medical,Private Health Insurance,,,,,Y,19537.18,11235.52
New York City,Manhattan,7002001,001438,Bellevue Hospital Center,70 or Older,100,M,Other Race,Spanish/Hispanic,1,Emergency,Home or Self Care,2020,SYM001,SYNCOPE,ADM017,ADMINISTRATION OF NUTRITIONAL AND ELECTROLYTIC SUBSTANCES,204,SYNCOPE & COLLAPSE,05,DISEASES AND DISORDERS OF THE CIRCULATORY SYSTEM,1,Minor,Minor,Medical,Medicare,,,,,Y,13968.47,8033.04
New York City,Manhattan,7002001,001438,Bellevue Hospital Center,70 or Older,100,F,White,Not Span/Hispanic,2,Emergency,Home w/ Home Health Services,2020,SYM001,SYNCOPE,IMG007,COMPUTERIZED TOMOGRAPHY (CT) WITHOUT CONTRAST,204,SYNCOPE & COLLAPSE,05,DISEASES AND DISORDERS OF THE CIRCULATORY SYSTEM,1,Minor,Moderate,Medical,Medicare,Medicare,,,,Y,18598.64,10695.78
New York City,Manhattan,7002001,001438,Bellevue Hospital Center,50 to 69,112,M,Other Race,Spanish/Hispanic,1,Emergency,Home or Self Care,2020,SYM001,SYNCOPE,MAM006,PACEMAKER AND DEFIBRILLATOR INTERROGATION,204,SYNCOPE & COLLAPSE,05,DISEASES AND DISORDERS OF THE CIRCULATORY SYSTEM,1,Minor,Moderate,Medical,Medicare,Medicaid,,,,Y,8678.47,4990.85
New York City,Manhattan,7002001,001438,Bellevue Hospital Center,70 or Older,100,M,White,Not Span/Hispanic,3,Emergency,Home or Self Care,2020,SYM001,SYNCOPE,ADM021,"ADMINISTRATION OF THERAPEUTIC SUBSTANCES, NEC",204,SYNCOPE & COLLAPSE,05,DISEASES AND DISORDERS OF THE CIRCULATORY SYSTEM,1,Minor,Minor,Medical,Medicaid,,,,,Y,26323.67,15138.32
New York City,Manhattan,7002001,001438,Bellevue Hospital Center,70 or Older,112,M,Black/African American,Not Span/Hispanic,1,Emergency,Home or Self Care,2020,CIR031,HYPOTENSION,ADM017,ADMINISTRATION OF NUTRITIONAL AND ELECTROLYTIC SUBSTANCES,204,SYNCOPE & COLLAPSE,05,DISEASES AND DISORDERS OF THE CIRCULATORY SYSTEM,1,Minor,Moderate,Medical,Medicare,Medicaid,,,,Y,9043.4,5200.71
New York City,Manhattan,7002001,001438,Bellevue Hospital Center,70 or Older,100,M,Black/African American,Not Span/Hispanic,4,Emergency,Home or Self Care,2020,CIR031,HYPOTENSION,IMG007,COMPUTERIZED TOMOGRAPHY (CT) WITHOUT CONTRAST,204,SYNCOPE & COLLAPSE,05,DISEASES AND DISORDERS OF THE CIRCULATORY SYSTEM,2,Moderate,Moderate,Medical,Medicaid,,,,,Y,40490.38,23285.37
New York City,Manhattan,7002001,001438,Bellevue Hospital Center,50 to 69,112,M,Other Race,Not Span/Hispanic,2,Emergency,Home or Self Care,2020,SYM001,SYNCOPE,SKB006,SKIN LACERATION REPAIR (EXCLUDING PERINEUM),204,SYNCOPE & COLLAPSE,05,DISEASES AND DISORDERS OF THE CIRCULATORY SYSTEM,1,Minor,Minor,Medical,Private Health Insurance,,,,,Y,21613.55,12429.61
New York City,Manhattan,7002001,001438,Bellevue Hospital Center,50 to 69,114,M,Other Race,Not Span/Hispanic,4,Emergency,Home or Self Care,2020,SYM001,SYNCOPE,IMG007,COMPUTERIZED TOMOGRAPHY (CT) WITHOUT CONTRAST,204,SYNCOPE & COLLAPSE,05,DISEASES AND DISORDERS OF THE CIRCULATORY SYSTEM,2,Moderate,Minor,Medical,Medicaid,,,,,Y,32047.7,18430.12
New York City,Manhattan,7002001,001438,Bellevue Hospital Center,50 to 69,100,M,Other Race,Spanish/Hispanic,1,Emergency,Home or Self Care,2020,SYM001,SYNCOPE,ADM021,"ADMINISTRATION OF THERAPEUTIC SUBSTANCES, NEC",204,SYNCOPE & COLLAPSE,05,DISEASES AND DISORDERS OF THE CIRCULATORY SYSTEM,2,Moderate,Moderate,Medical,Medicare,Medicaid,,,,Y,10923.69,6282.04
New York City,Manhattan,7002001,001438,Bellevue Hospital Center,18 to 29,OOS,M,Other Race,Unknown,1,Emergency,Home or Self Care,2020,SYM001,SYNCOPE,ADM017,ADMINISTRATION OF NUTRITIONAL AND ELECTROLYTIC SUBSTANCES,204,SYNCOPE & COLLAPSE,05,DISEASES AND DISORDERS OF THE CIRCULATORY SYSTEM,1,Minor,Minor,Medical,Self-Pay,,,,,Y,11315.05,6507.1
New York City,Manhattan,7002001,001438,Bellevue Hospital Center,50 to 69,112,M,Black/African American,Not Span/Hispanic,1,Emergency,Left Against Medical Advice,2020,SYM001,SYNCOPE,IMG007,COMPUTERIZED TOMOGRAPHY (CT) WITHOUT CONTRAST,204,SYNCOPE & COLLAPSE,05,DISEASES AND DISORDERS OF THE CIRCULATORY SYSTEM,2,Moderate,Moderate,Medical,Medicare,Medicaid,,,,Y,15751.03,9058.17
New York City,Manhattan,7002001,001438,Bellevue Hospital Center,70 or Older,100,M,Black/African American,Not Span/Hispanic,5,Emergency,Home or Self Care,2020,CIR031,HYPOTENSION,ADM021,"ADMINISTRATION OF THERAPEUTIC SUBSTANCES, NEC",204,SYNCOPE & COLLAPSE,05,DISEASES AND DISORDERS OF THE CIRCULATORY SYSTEM,1,Minor,Minor,Medical,Medicare,Medicaid,,,,Y,39899.27,22945.43
New York City,Manhattan,7002001,001438,Bellevue Hospital Center,50 to 69,100,M,Black/African American,Not Span/Hispanic,3,Emergency,Left Against Medical Advice,2020,SYM001,SYNCOPE,ADM015,ADMINISTRATION OF ANTIBIOTICS,204,SYNCOPE & COLLAPSE,05,DISEASES AND DISORDERS OF THE CIRCULATORY SYSTEM,2,Moderate,Moderate,Medical,Private Health Insurance,Medicaid,,,,Y,32636.97,18769
New York City,Manhattan,7002001,001438,Bellevue Hospital Center,70 or Older,100,M,White,Not Span/Hispanic,1,Emergency,Home or Self Care,2020,SYM001,SYNCOPE,IMG007,COMPUTERIZED TOMOGRAPHY (CT) WITHOUT CONTRAST,204,SYNCOPE & COLLAPSE,05,DISEASES AND DISORDERS OF THE CIRCULATORY SYSTEM,2,Moderate,Moderate,Medical,Private Health Insurance,Medicare,,,,Y,19855.79,11418.75
New York City,Manhattan,7002001,001438,Bellevue Hospital Center,30 to 49,113,M,Black/African American,Not Span/Hispanic,1,Emergency,Home or Self Care,2020,CIR031,HYPOTENSION,ADM021,"ADMINISTRATION OF THERAPEUTIC SUBSTANCES, NEC",204,SYNCOPE & COLLAPSE,05,DISEASES AND DISORDERS OF THE CIRCULATORY SYSTEM,2,Moderate,Major,Medical,Medicaid,,,,,Y,19729.79,11346.29
New York City,Manhattan,7002001,001438,Bellevue Hospital Center,18 to 29,104,M,Black/African American,Not Span/Hispanic,1,Emergency,Left Against Medical Advice,2020,SYM001,SYNCOPE,IMG007,COMPUTERIZED TOMOGRAPHY (CT) WITHOUT CONTRAST,204,SYNCOPE & COLLAPSE,05,DISEASES AND DISORDERS OF THE CIRCULATORY SYSTEM,1,Minor,Minor,Medical,Medicaid,,,,,Y,10225.15,5880.32
New York City,Manhattan,7002001,001438,Bellevue Hospital Center,70 or Older,100,M,Black/African American,Not Span/Hispanic,8,Emergency,Home w/ Home Health Services,2020,SYM001,SYNCOPE,IMG007,COMPUTERIZED TOMOGRAPHY (CT) WITHOUT CONTRAST,204,SYNCOPE & COLLAPSE,05,DISEASES AND DISORDERS OF THE CIRCULATORY SYSTEM,2,Moderate,Major,Medical,Medicare,Medicaid,,,,Y,63146.57,36314.58
New York City,Manhattan,7002001,001438,Bellevue Hospital Center,30 to 49,100,F,Other Race,Not Span/Hispanic,5,Emergency,Psychiatric Hospital or Unit of Hosp,2020,SYM001,SYNCOPE,,,204,SYNCOPE & COLLAPSE,05,DISEASES AND DISORDERS OF THE CIRCULATORY SYSTEM,2,Moderate,Moderate,Medical,Private Health Insurance,,,,,Y,38470.77,22123.92
New York City,Manhattan,7002001,001438,Bellevue Hospital Center,50 to 69,112,M,Other Race,Not Span/Hispanic,2,Emergency,Home or Self Care,2020,SYM001,SYNCOPE,ADM001,TRANSFUSION OF BLOOD AND BLOOD PRODUCTS,204,SYNCOPE & COLLAPSE,05,DISEASES AND DISORDERS OF THE CIRCULATORY SYSTEM,2,Moderate,Moderate,Medical,Private Health Insurance,,,,,Y,20871.37,12002.79
New York City,Manhattan,7002001,001438,Bellevue Hospital Center,50 to 69,100,F,Other Race,Spanish/Hispanic,5,Emergency,Home or Self Care,2020,SYM001,SYNCOPE,MAM008,CARDIAC MONITORING,204,SYNCOPE & COLLAPSE,05,DISEASES AND DISORDERS OF THE CIRCULATORY SYSTEM,1,Minor,Moderate,Medical,Medicare,Medicaid,,,,Y,40508.37,23295.72
New York City,Manhattan,7002001,001438,Bellevue Hospital Center,50 to 69,114,M,Other Race,Unknown,1,Emergency,Home or Self Care,2020,SYM001,SYNCOPE,IMG007,COMPUTERIZED TOMOGRAPHY (CT) WITHOUT CONTRAST,204,SYNCOPE & COLLAPSE,05,DISEASES AND DISORDERS OF THE CIRCULATORY SYSTEM,1,Minor,Minor,Medical,Medicaid,,,,,Y,10071.4,5791.9
New York City,Manhattan,7002001,001438,Bellevue Hospital Center,70 or Older,100,F,Other Race,Spanish/Hispanic,8,Emergency,Skilled Nursing Home,2020,SYM001,SYNCOPE,ADM021,"ADMINISTRATION OF THERAPEUTIC SUBSTANCES, NEC",204,SYNCOPE & COLLAPSE,05,DISEASES AND DISORDERS OF THE CIRCULATORY SYSTEM,2,Moderate,Moderate,Medical,Medicare,Medicaid,,,,Y,67801.72,38991.68
New York City,Manhattan,7002001,001438,Bellevue Hospital Center,70 or Older,,F,Other Race,Unknown,5,Emergency,Home or Self Care,2020,SYM001,SYNCOPE,ADM017,ADMINISTRATION OF NUTRITIONAL AND ELECTROLYTIC SUBSTANCES,204,SYNCOPE & COLLAPSE,05,DISEASES AND DISORDERS OF THE CIRCULATORY SYSTEM,2,Moderate,Minor,Medical,Medicare,Medicare,,,,Y,46732.61,26875.18
New York City,Manhattan,7002001,001438,Bellevue Hospital Center,30 to 49,111,M,Other Race,Spanish/Hispanic,1,Emergency,Home or Self Care,2020,SYM001,SYNCOPE,ADM021,"ADMINISTRATION OF THERAPEUTIC SUBSTANCES, NEC",204,SYNCOPE & COLLAPSE,05,DISEASES AND DISORDERS OF THE CIRCULATORY SYSTEM,1,Minor,Moderate,Medical,Medicaid,,,,,Y,17116.63,9843.5
New York City,Manhattan,7002001,001438,Bellevue Hospital Center,50 to 69,100,F,Other Race,Not Span/Hispanic,3,Emergency,Home w/ Home Health Services,2020,SYM001,SYNCOPE,MAM008,CARDIAC MONITORING,204,SYNCOPE & COLLAPSE,05,DISEASES AND DISORDERS OF THE CIRCULATORY SYSTEM,1,Minor,Minor,Medical,Medicaid,,,,,Y,30957.59,17803.21
New York City,Manhattan,7002001,001438,Bellevue Hospital Center,70 or Older,100,F,Other Race,Not Span/Hispanic,2,Emergency,Home or Self Care,2020,SYM001,SYNCOPE,IMG008,ULTRASONOGRAPHY,204,SYNCOPE & COLLAPSE,05,DISEASES AND DISORDERS OF THE CIRCULATORY SYSTEM,2,Moderate,Moderate,Medical,Medicare,Medicaid,,,,Y,23977.32,13788.97
New York City,Manhattan,7002001,001438,Bellevue Hospital Center,30 to 49,112,F,Other Race,Unknown,1,Emergency,Home or Self Care,2020,SYM001,SYNCOPE,SKB006,SKIN LACERATION REPAIR (EXCLUDING PERINEUM),204,SYNCOPE & COLLAPSE,05,DISEASES AND DISORDERS OF THE CIRCULATORY SYSTEM,2,Moderate,Minor,Medical,Private Health Insurance,,,,,Y,14149.38,8137.08
New York City,Manhattan,7002001,001438,Bellevue Hospital Center,70 or Older,104,F,Other Race,Spanish/Hispanic,3,Emergency,Home or Self Care,2020,SYM001,SYNCOPE,ADM007,INTRAVENOUS INDUCTION OF LABOR,204,SYNCOPE & COLLAPSE,05,DISEASES AND DISORDERS OF THE CIRCULATORY SYSTEM,2,Moderate,Moderate,Medical,Medicare,Medicaid,,,,Y,25208.75,14497.15
New York City,Manhattan,7002001,001438,Bellevue Hospital Center,50 to 69,100,M,Black/African American,Not Span/Hispanic,2,Emergency,Left Against Medical Advice,2020,SYM001,SYNCOPE,IMG007,COMPUTERIZED TOMOGRAPHY (CT) WITHOUT CONTRAST,204,SYNCOPE & COLLAPSE,05,DISEASES AND DISORDERS OF THE CIRCULATORY SYSTEM,2,Moderate,Moderate,Medical,Self-Pay,,,,,Y,24605.75,14150.37
New York City,Manhattan,7002001,001438,Bellevue Hospital Center,70 or Older,100,M,White,Not Span/Hispanic,1,Emergency,Home w/ Home Health Services,2020,SYM001,SYNCOPE,ADM017,ADMINISTRATION OF NUTRITIONAL AND ELECTROLYTIC SUBSTANCES,204,SYNCOPE & COLLAPSE,05,DISEASES AND DISORDERS OF THE CIRCULATORY SYSTEM,2,Moderate,Moderate,Medical,Medicare,Private Health Insurance,,,,Y,20933.52,12038.53
New York City,Manhattan,7002001,001438,Bellevue Hospital Center,70 or Older,OOS,F,White,Not Span/Hispanic,2,Emergency,Home or Self Care,2020,CIR031,HYPOTENSION,ADM017,ADMINISTRATION OF NUTRITIONAL AND ELECTROLYTIC SUBSTANCES,204,SYNCOPE & COLLAPSE,05,DISEASES AND DISORDERS OF THE CIRCULATORY SYSTEM,2,Moderate,Moderate,Medical,Medicare,,,,,Y,31272.83,17984.5
New York City,Manhattan,7002001,001438,Bellevue Hospital Center,18 to 29,100,M,Other Race,Not Span/Hispanic,3,Emergency,Left Against Medical Advice,2020,CIR031,HYPOTENSION,IMG008,ULTRASONOGRAPHY,204,SYNCOPE & COLLAPSE,05,DISEASES AND DISORDERS OF THE CIRCULATORY SYSTEM,3,Major,Major,Medical,Medicaid,,,,,Y,26548.2,15267.45
New York City,Manhattan,7002001,001438,Bellevue Hospital Center,50 to 69,100,M,Other Race,Spanish/Hispanic,1,Emergency,Left Against Medical Advice,2020,SYM001,SYNCOPE,ADM021,"ADMINISTRATION OF THERAPEUTIC SUBSTANCES, NEC",204,SYNCOPE & COLLAPSE,05,DISEASES AND DISORDERS OF THE CIRCULATORY SYSTEM,2,Moderate,Moderate,Medical,Medicaid,,,,,Y,8688.12,4996.4
New York City,Manhattan,7002001,001438,Bellevue Hospital Center,50 to 69,104,M,Black/African American,Not Span/Hispanic,2,Emergency,Home or Self Care,2020,SYM001,SYNCOPE,ADM017,ADMINISTRATION OF NUTRITIONAL AND ELECTROLYTIC SUBSTANCES,204,SYNCOPE & COLLAPSE,05,DISEASES AND DISORDERS OF THE CIRCULATORY SYSTEM,2,Moderate,Moderate,Medical,Medicaid,,,,,Y,19850.17,11415.52
New York City,Manhattan,7002001,001438,Bellevue Hospital Center,50 to 69,100,M,Black/African American,Not Span/Hispanic,4,Emergency,Home or Self Care,2020,SYM001,SYNCOPE,IMG007,COMPUTERIZED TOMOGRAPHY (CT) WITHOUT CONTRAST,204,SYNCOPE & COLLAPSE,05,DISEASES AND DISORDERS OF THE CIRCULATORY SYSTEM,2,Moderate,Moderate,Medical,Medicaid,,,,,Y,31889.29,18339.02
New York City,Manhattan,7002001,001438,Bellevue Hospital Center,50 to 69,112,F,White,Not Span/Hispanic,5,Emergency,Home or Self Care,2020,CIR031,HYPOTENSION,IMG007,COMPUTERIZED TOMOGRAPHY (CT) WITHOUT CONTRAST,204,SYNCOPE & COLLAPSE,05,DISEASES AND DISORDERS OF THE CIRCULATORY SYSTEM,3,Major,Minor,Medical,Medicare,,,,,Y,47310.58,27207.56
New York City,Manhattan,7002001,001438,Bellevue Hospital Center,50 to 69,100,M,Black/African American,Not Span/Hispanic,2,Emergency,Home or Self Care,2020,CIR031,HYPOTENSION,IMG007,COMPUTERIZED TOMOGRAPHY (CT) WITHOUT CONTRAST,204,SYNCOPE & COLLAPSE,05,DISEASES AND DISORDERS OF THE CIRCULATORY SYSTEM,1,Minor,Minor,Medical,Medicaid,,,,,Y,24413.29,14039.69
New York City,Manhattan,7002001,001438,Bellevue Hospital Center,30 to 49,114,F,Other Race,Not Span/Hispanic,4,Emergency,Home or Self Care,2020,SYM001,SYNCOPE,IMG007,COMPUTERIZED TOMOGRAPHY (CT) WITHOUT CONTRAST,204,SYNCOPE & COLLAPSE,05,DISEASES AND DISORDERS OF THE CIRCULATORY SYSTEM,3,Major,Moderate,Medical,Medicaid,,,,,Y,43599.66,25073.47
New York City,Manhattan,7002001,001438,Bellevue Hospital Center,70 or Older,100,M,Black/African American,Not Span/Hispanic,5,Emergency,Home or Self Care,2020,SYM001,SYNCOPE,MAM006,PACEMAKER AND DEFIBRILLATOR INTERROGATION,204,SYNCOPE & COLLAPSE,05,DISEASES AND DISORDERS OF THE CIRCULATORY SYSTEM,2,Moderate,Moderate,Medical,Medicare,Medicaid,,,,Y,44590.5,25643.28
New York City,Manhattan,7002001,001438,Bellevue Hospital Center,50 to 69,112,M,Other Race,Unknown,4,Emergency,Home or Self Care,2020,SYM001,SYNCOPE,IMG007,COMPUTERIZED TOMOGRAPHY (CT) WITHOUT CONTRAST,204,SYNCOPE & COLLAPSE,05,DISEASES AND DISORDERS OF THE CIRCULATORY SYSTEM,2,Moderate,Moderate,Medical,Medicaid,,,,,Y,31006.8,17831.51
New York City,Manhattan,7002001,001438,Bellevue Hospital Center,70 or Older,100,M,White,Not Span/Hispanic,2,Emergency,Home w/ Home Health Services,2020,SYM001,SYNCOPE,ADM015,ADMINISTRATION OF ANTIBIOTICS,204,SYNCOPE & COLLAPSE,05,DISEASES AND DISORDERS OF THE CIRCULATORY SYSTEM,2,Moderate,Major,Medical,Medicare,Medicare,,,,Y,25024.91,14391.43
New York City,Manhattan,7002001,001438,Bellevue Hospital Center,50 to 69,100,M,Black/African American,Not Span/Hispanic,1,Emergency,Home or Self Care,2020,SYM001,SYNCOPE,MAM008,CARDIAC MONITORING,204,SYNCOPE & COLLAPSE,05,DISEASES AND DISORDERS OF THE CIRCULATORY SYSTEM,1,Minor,Minor,Medical,Medicaid,,,,,Y,7898.13,4542.09
New York City,Manhattan,7002001,001438,Bellevue Hospital Center,70 or Older,100,F,Other Race,Unknown,4,Emergency,Home w/ Home Health Services,2020,SYM001,SYNCOPE,ADM021,"ADMINISTRATION OF THERAPEUTIC SUBSTANCES, NEC",204,SYNCOPE & COLLAPSE,05,DISEASES AND DISORDERS OF THE CIRCULATORY SYSTEM,2,Moderate,Minor,Medical,Medicare,Medicaid,,,,Y,42440.8,24407.03
New York City,Manhattan,7002001,001438,Bellevue Hospital Center,30 to 49,100,F,White,Unknown,1,Emergency,Home or Self Care,2020,SYM001,SYNCOPE,MAM008,CARDIAC MONITORING,204,SYNCOPE & COLLAPSE,05,DISEASES AND DISORDERS OF THE CIRCULATORY SYSTEM,1,Minor,Minor,Medical,Medicaid,,,,,Y,9876.12,5679.6