Hospital Service Area,Hospital County,Operating Certificate Number,Permanent Facility Id,Facility Name,Age Group,Zip Code - 3 digits,Gender,Race,Ethnicity,Length of Stay,Type of Admission,Patient Disposition,Discharge Year,CCS Diagnosis Code,CCS Diagnosis Description,CCS Procedure Code,CCS Procedure Description,APR DRG Code,APR DRG Description,APR MDC Code,APR MDC Description,APR Severity of Illness Code,APR Severity of Illness Description,APR Risk of Mortality,APR Medical Surgical Description,Payment Typology 1,Payment Typology 2,Payment Typology 3,Birth Weight,Abortion Edit Indicator,Emergency Department Indicator,Total Charges,Total Costs
Long Island,Nassau,2908000,000511,NYU Winthrop Hospital,70 or Older,118,M,White,Not Span/Hispanic,4,Emergency,Skilled Nursing Home,2017,237,Complication of device; implant or graft,191,ARTERIO/VENOGRAM-NOT HH,206,"Malfunction,reaction,complication of cardiac/vasc device or procedure",05,Diseases and Disorders of the Circulatory System,2,Moderate,Moderate,Medical,Medicare,Medicare,Blue Cross/Blue Shield,,N,Y,49756.62,13259.92
Long Island,Nassau,2908000,000511,NYU Winthrop Hospital,30 to 49,117,F,White,Not Span/Hispanic,3,Emergency,Home or Self Care,2017,238,Complications of surgical procedures or medical care,000,NO PROC,206,"Malfunction,reaction,complication of cardiac/vasc device or procedure",05,Diseases and Disorders of the Circulatory System,2,Moderate,Minor,Medical,Private Health Insurance,,,,N,Y,22444.84,5138.23
Long Island,Nassau,2908000,000511,NYU Winthrop Hospital,50 to 69,117,M,White,Not Span/Hispanic,2,Emergency,Home or Self Care,2017,237,Complication of device; implant or graft,000,NO PROC,206,"Malfunction,reaction,complication of cardiac/vasc device or procedure",05,Diseases and Disorders of the Circulatory System,2,Moderate,Moderate,Medical,Medicare,Medicare,Private Health Insurance,,N,Y,34638.59,8115.11
Long Island,Nassau,2908000,000511,NYU Winthrop Hospital,50 to 69,110,M,White,Not Span/Hispanic,1,Emergency,Home or Self Care,2017,238,Complications of surgical procedures or medical care,222,BLOOD TRANSFUSION,206,"Malfunction,reaction,complication of cardiac/vasc device or procedure",05,Diseases and Disorders of the Circulatory System,2,Moderate,Minor,Medical,Blue Cross/Blue Shield,,,,N,Y,31426.90,6806.15
Long Island,Nassau,2908000,000511,NYU Winthrop Hospital,50 to 69,110,M,White,Not Span/Hispanic,6,Emergency,Skilled Nursing Home,2017,237,Complication of device; implant or graft,062,OT DX CARDIOVASC PRCS,206,"Malfunction,reaction,complication of cardiac/vasc device or procedure",05,Diseases and Disorders of the Circulatory System,2,Moderate,Moderate,Medical,Medicare,,,,N,Y,105916.80,27293.61
Long Island,Nassau,2908000,000511,NYU Winthrop Hospital,50 to 69,115,M,Black/African American,Not Span/Hispanic,5,Emergency,Home or Self Care,2017,237,Complication of device; implant or graft,190,ARTERIO FEMORAL/LOW ART,206,"Malfunction,reaction,complication of cardiac/vasc device or procedure",05,Diseases and Disorders of the Circulatory System,1,Minor,Minor,Medical,Blue Cross/Blue Shield,,,,N,Y,144824.91,34110.82
Long Island,Nassau,2908000,000511,NYU Winthrop Hospital,18 to 29,115,F,White,Spanish/Hispanic,1,Emergency,Short-term Hospital,2017,237,Complication of device; implant or graft,216,RESP INTUB/MECH VENTIL,206,"Malfunction,reaction,complication of cardiac/vasc device or procedure",05,Diseases and Disorders of the Circulatory System,3,Major,Major,Medical,Private Health Insurance,Medicaid,,,N,Y,23397.06,5008.67
Long Island,Nassau,2908000,000511,NYU Winthrop Hospital,30 to 49,117,M,Black/African American,Not Span/Hispanic,4,Emergency,Home or Self Care,2017,237,Complication of device; implant or graft,054,OT VASC CATH; NOT HEART,206,"Malfunction,reaction,complication of cardiac/vasc device or procedure",05,Diseases and Disorders of the Circulatory System,4,Extreme,Moderate,Medical,Blue Cross/Blue Shield,,,,N,Y,51700.38,12303.51
Long Island,Nassau,2908000,000511,NYU Winthrop Hospital,50 to 69,115,F,Black/African American,Not Span/Hispanic,12,Emergency,Home w/ Home Health Services,2017,237,Complication of device; implant or graft,054,OT VASC CATH; NOT HEART,206,"Malfunction,reaction,complication of cardiac/vasc device or procedure",05,Diseases and Disorders of the Circulatory System,4,Extreme,Extreme,Medical,Medicare,Medicare,Private Health Insurance,,N,Y,227381.39,56823.51
Long Island,Nassau,2908000,000511,NYU Winthrop Hospital,70 or Older,118,M,White,Not Span/Hispanic,1,Elective,Home or Self Care,2017,237,Complication of device; implant or graft,191,ARTERIO/VENOGRAM-NOT HH,206,"Malfunction,reaction,complication of cardiac/vasc device or procedure",05,Diseases and Disorders of the Circulatory System,2,Moderate,Minor,Medical,Medicare,Medicare,Private Health Insurance,,N,Y,49713.42,14181.41
Long Island,Nassau,2908000,000511,NYU Winthrop Hospital,50 to 69,112,M,White,Not Span/Hispanic,20,Emergency,Skilled Nursing Home,2017,237,Complication of device; implant or graft,193,DX ULTRASOUND HEART,206,"Malfunction,reaction,complication of cardiac/vasc device or procedure",05,Diseases and Disorders of the Circulatory System,3,Major,Major,Medical,Private Health Insurance,Medicare,Medicare,,N,Y,219688.52,50696.97
Long Island,Nassau,2908000,000511,NYU Winthrop Hospital,30 to 49,115,M,Black/African American,Not Span/Hispanic,1,Emergency,Home or Self Care,2017,237,Complication of device; implant or graft,058,HEMODIALYSIS,206,"Malfunction,reaction,complication of cardiac/vasc device or procedure",05,Diseases and Disorders of the Circulatory System,3,Major,Moderate,Medical,Medicare,Medicare,Medicaid,,N,Y,26215.79,4819.94
Long Island,Nassau,2908000,000511,NYU Winthrop Hospital,18 to 29,115,F,White,Spanish/Hispanic,3,Emergency,Home or Self Care,2017,237,Complication of device; implant or graft,174,OT NON-OR THER PRC SKIN,206,"Malfunction,reaction,complication of cardiac/vasc device or procedure",05,Diseases and Disorders of the Circulatory System,2,Moderate,Minor,Medical,Medicaid,Medicaid,,,N,Y,173432.02,42668.91
Long Island,Nassau,2908000,000511,NYU Winthrop Hospital,70 or Older,115,F,White,Not Span/Hispanic,3,Emergency,Skilled Nursing Home,2017,237,Complication of device; implant or graft,054,OT VASC CATH; NOT HEART,206,"Malfunction,reaction,complication of cardiac/vasc device or procedure",05,Diseases and Disorders of the Circulatory System,2,Moderate,Major,Medical,Medicare,Medicare,Private Health Insurance,,N,Y,51875.41,12157.43
Long Island,Nassau,2908000,000511,NYU Winthrop Hospital,50 to 69,117,M,White,Not Span/Hispanic,1,Emergency,Home or Self Care,2017,237,Complication of device; implant or graft,197,OTHER DX ULTRASOUND,206,"Malfunction,reaction,complication of cardiac/vasc device or procedure",05,Diseases and Disorders of the Circulatory System,2,Moderate,Minor,Medical,Medicare,Medicare,,,N,Y,80184.98,21472.95
Long Island,Nassau,2908000,000511,NYU Winthrop Hospital,70 or Older,113,M,White,Not Span/Hispanic,1,Emergency,Expired,2017,237,Complication of device; implant or graft,222,BLOOD TRANSFUSION,206,"Malfunction,reaction,complication of cardiac/vasc device or procedure",05,Diseases and Disorders of the Circulatory System,3,Major,Extreme,Medical,Medicare,Medicare,Blue Cross/Blue Shield,,N,Y,31554.83,5480.05
Long Island,Nassau,2908000,000511,NYU Winthrop Hospital,70 or Older,110,M,White,Not Span/Hispanic,11,Emergency,Home or Self Care,2017,237,Complication of device; implant or graft,193,DX ULTRASOUND HEART,206,"Malfunction,reaction,complication of cardiac/vasc device or procedure",05,Diseases and Disorders of the Circulatory System,4,Extreme,Major,Medical,Medicare,Medicare,Blue Cross/Blue Shield,,N,Y,181761.48,40043.94
Long Island,Nassau,2908000,000511,NYU Winthrop Hospital,0 to 17,115,F,White,Not Span/Hispanic,1,Emergency,Home or Self Care,2017,237,Complication of device; implant or graft,063,OT NON-OR THER CARDIO,206,"Malfunction,reaction,complication of cardiac/vasc device or procedure",05,Diseases and Disorders of the Circulatory System,2,Moderate,Minor,Medical,Blue Cross/Blue Shield,,,,N,Y,12061.23,3016.11
Long Island,Nassau,2908000,000511,NYU Winthrop Hospital,50 to 69,110,F,White,Not Span/Hispanic,11,Emergency,Home or Self Care,2017,237,Complication of device; implant or graft,054,OT VASC CATH; NOT HEART,206,"Malfunction,reaction,complication of cardiac/vasc device or procedure",05,Diseases and Disorders of the Circulatory System,4,Extreme,Moderate,Medical,Blue Cross/Blue Shield,,,,N,Y,132642.55,27972.29
Long Island,Nassau,2908000,000511,NYU Winthrop Hospital,70 or Older,117,M,White,Not Span/Hispanic,1,Emergency,Home or Self Care,2017,238,Complications of surgical procedures or medical care,231,OTHER THERAPEUTIC PRCS,206,"Malfunction,reaction,complication of cardiac/vasc device or procedure",05,Diseases and Disorders of the Circulatory System,3,Major,Moderate,Medical,Medicare,Medicare,Blue Cross/Blue Shield,,N,Y,48877.23,11212.93
Long Island,Nassau,2908000,000511,NYU Winthrop Hospital,30 to 49,114,F,Black/African American,Not Span/Hispanic,6,Emergency,Home or Self Care,2017,237,Complication of device; implant or graft,058,HEMODIALYSIS,206,"Malfunction,reaction,complication of cardiac/vasc device or procedure",05,Diseases and Disorders of the Circulatory System,3,Major,Major,Medical,Blue Cross/Blue Shield,,,,N,Y,81155.45,15356.17
Long Island,Nassau,2908000,000511,NYU Winthrop Hospital,70 or Older,115,M,White,Spanish/Hispanic,12,Emergency,Skilled Nursing Home,2017,237,Complication of device; implant or graft,054,OT VASC CATH; NOT HEART,206,"Malfunction,reaction,complication of cardiac/vasc device or procedure",05,Diseases and Disorders of the Circulatory System,3,Major,Major,Medical,Medicare,Medicare,Medicaid,,N,Y,220554.89,58114.37
Long Island,Nassau,2908000,000511,NYU Winthrop Hospital,70 or Older,115,F,White,Not Span/Hispanic,1,Elective,Short-term Hospital,2017,237,Complication of device; implant or graft,193,DX ULTRASOUND HEART,206,"Malfunction,reaction,complication of cardiac/vasc device or procedure",05,Diseases and Disorders of the Circulatory System,2,Moderate,Moderate,Medical,Medicare,Medicare,Private Health Insurance,,N,N,36359.76,6942.00
Long Island,Nassau,2908000,000511,NYU Winthrop Hospital,70 or Older,115,F,White,Not Span/Hispanic,1,Emergency,Inpatient Rehabilitation Facility,2017,238,Complications of surgical procedures or medical care,000,NO PROC,206,"Malfunction,reaction,complication of cardiac/vasc device or procedure",05,Diseases and Disorders of the Circulatory System,3,Major,Major,Medical,Medicare,Medicare,Private Health Insurance,,N,Y,28400.88,5149.66
Long Island,Nassau,2908000,000511,NYU Winthrop Hospital,70 or Older,115,M,White,Not Span/Hispanic,1,Emergency,Home or Self Care,2017,237,Complication of device; implant or graft,000,NO PROC,206,"Malfunction,reaction,complication of cardiac/vasc device or procedure",05,Diseases and Disorders of the Circulatory System,2,Moderate,Minor,Medical,Medicare,Medicare,,,N,Y,24589.28,5166.50
Long Island,Nassau,2908000,000511,NYU Winthrop Hospital,30 to 49,115,M,Black/African American,Not Span/Hispanic,3,Emergency,Home or Self Care,2017,237,Complication of device; implant or graft,054,OT VASC CATH; NOT HEART,206,"Malfunction,reaction,complication of cardiac/vasc device or procedure",05,Diseases and Disorders of the Circulatory System,3,Major,Moderate,Medical,Medicare,Medicare,Blue Cross/Blue Shield,,N,Y,68323.78,14438.33
Long Island,Nassau,2908000,000511,NYU Winthrop Hospital,70 or Older,117,F,White,Not Span/Hispanic,5,Urgent,Home w/ Home Health Services,2017,237,Complication of device; implant or graft,178,CT SCAN CHEST,206,"Malfunction,reaction,complication of cardiac/vasc device or procedure",05,Diseases and Disorders of the Circulatory System,1,Minor,Minor,Medical,Medicare,Medicare,Private Health Insurance,,N,N,63371.50,16469.32
Long Island,Nassau,2908000,000511,NYU Winthrop Hospital,50 to 69,115,M,White,Not Span/Hispanic,1,Emergency,Home or Self Care,2017,237,Complication of device; implant or graft,000,NO PROC,206,"Malfunction,reaction,complication of cardiac/vasc device or procedure",05,Diseases and Disorders of the Circulatory System,2,Moderate,Moderate,Medical,Medicare,Medicare,Medicaid,,N,Y,34088.02,5177.67
Long Island,Nassau,2908000,000511,NYU Winthrop Hospital,50 to 69,110,M,White,Not Span/Hispanic,3,Emergency,Home or Self Care,2017,237,Complication of device; implant or graft,054,OT VASC CATH; NOT HEART,206,"Malfunction,reaction,complication of cardiac/vasc device or procedure",05,Diseases and Disorders of the Circulatory System,2,Moderate,Minor,Medical,Medicaid,Medicaid,,,N,Y,89534.79,23300.51
Long Island,Nassau,2908000,000511,NYU Winthrop Hospital,50 to 69,114,F,Black/African American,Not Span/Hispanic,3,Emergency,Home or Self Care,2017,237,Complication of device; implant or graft,193,DX ULTRASOUND HEART,206,"Malfunction,reaction,complication of cardiac/vasc device or procedure",05,Diseases and Disorders of the Circulatory System,2,Moderate,Moderate,Medical,Private Health Insurance,Self-Pay,,,N,Y,47823.22,8273.74
Long Island,Nassau,2908000,000511,NYU Winthrop Hospital,70 or Older,115,F,Black/African American,Not Span/Hispanic,20,Emergency,Hospice - Home,2017,237,Complication of device; implant or graft,222,BLOOD TRANSFUSION,206,"Malfunction,reaction,complication of cardiac/vasc device or procedure",05,Diseases and Disorders of the Circulatory System,2,Moderate,Moderate,Medical,Medicare,Medicare,Private Health Insurance,,N,Y,327265.30,67581.61
Long Island,Nassau,2908000,000511,NYU Winthrop Hospital,50 to 69,110,M,White,Not Span/Hispanic,10,Emergency,Home w/ Home Health Services,2017,237,Complication of device; implant or graft,054,OT VASC CATH; NOT HEART,206,"Malfunction,reaction,complication of cardiac/vasc device or procedure",05,Diseases and Disorders of the Circulatory System,3,Major,Major,Medical,Medicare,Medicare,Blue Cross/Blue Shield,,N,Y,125662.03,26842.73
Long Island,Nassau,2908000,000511,NYU Winthrop Hospital,50 to 69,117,M,White,Not Span/Hispanic,2,Trauma,Home or Self Care,2017,238,Complications of surgical procedures or medical care,222,BLOOD TRANSFUSION,206,"Malfunction,reaction,complication of cardiac/vasc device or procedure",05,Diseases and Disorders of the Circulatory System,3,Major,Moderate,Medical,Blue Cross/Blue Shield,,,,N,Y,43851.16,12368.31
Long Island,Nassau,2908000,000511,NYU Winthrop Hospital,30 to 49,115,M,White,Not Span/Hispanic,2,Elective,Home or Self Care,2017,237,Complication of device; implant or graft,054,OT VASC CATH; NOT HEART,206,"Malfunction,reaction,complication of cardiac/vasc device or procedure",05,Diseases and Disorders of the Circulatory System,2,Moderate,Minor,Medical,Private Health Insurance,,,,N,N,186346.14,50508.04
