Hospital Service Area,Hospital County,Operating Certificate Number,Permanent Facility Id,Facility Name,Age Group,Zip Code - 3 digits,Gender,Race,Ethnicity,Length of Stay,Type of Admission,Patient Disposition,Discharge Year,CCS Diagnosis Code,CCS Diagnosis Description,CCS Procedure Code,CCS Procedure Description,APR DRG Code,APR DRG Description,APR MDC Code,APR MDC Description,APR Severity of Illness Code,APR Severity of Illness Description,APR Risk of Mortality,APR Medical Surgical Description,Payment Typology 1,Payment Typology 2,Payment Typology 3,Birth Weight,Abortion Edit Indicator,Emergency Department Indicator,Total Charges,Total Costs
New York City,Manhattan,7002001,001438,Bellevue Hospital Center,70 or Older,104,M,Other Race,Spanish/Hispanic,17,Elective,Inpatient Rehabilitation Facility,2020,INJ033,"COMPLICATION OF CARDIOVASCULAR DEVICE, IMPLANT OR GRAFT, INITIAL ENCOUNTER",MAM007,ELECTROCARDIOGRAM (ECG),206,"MALFUNCTION,REACTION,COMPLICATION OF CARDIAC/VASC DEVICE OR PROCEDURE",05,DISEASES AND DISORDERS OF THE CIRCULATORY SYSTEM,4,Extreme,Extreme,Medical,Medicare,,,,,Y,121165.73,69680.47
New York City,Manhattan,7002001,001438,Bellevue Hospital Center,50 to 69,112,M,Other Race,Not Span/Hispanic,52,Emergency,Home or Self Care,2020,INJ033,"COMPLICATION OF CARDIOVASCULAR DEVICE, IMPLANT OR GRAFT, INITIAL ENCOUNTER",CAR024,VENOUS AND ARTERIAL CATHETER PLACEMENT,206,"MALFUNCTION,REACTION,COMPLICATION OF CARDIAC/VASC DEVICE OR PROCEDURE",05,DISEASES AND DISORDERS OF THE CIRCULATORY SYSTEM,3,Major,Major,Medical,Medicaid,,,,,Y,386727.92,222401.04
New York City,Manhattan,7002001,001438,Bellevue Hospital Center,30 to 49,100,F,Other Race,Spanish/Hispanic,3,Elective,Home or Self Care,2020,INJ033,"COMPLICATION OF CARDIOVASCULAR DEVICE, IMPLANT OR GRAFT, INITIAL ENCOUNTER",IMG008,ULTRASONOGRAPHY,206,"MALFUNCTION,REACTION,COMPLICATION OF CARDIAC/VASC DEVICE OR PROCEDURE",05,DISEASES AND DISORDERS OF THE CIRCULATORY SYSTEM,2,Moderate,Moderate,Medical,Private Health Insurance,,,,,N,26212.12,15074.17
New York City,Manhattan,7002001,001438,Bellevue Hospital Center,70 or Older,104,F,Other Race,Spanish/Hispanic,5,Urgent,Home or Self Care,2020,INJ033,"COMPLICATION OF CARDIOVASCULAR DEVICE, IMPLANT OR GRAFT, INITIAL ENCOUNTER",IMG008,ULTRASONOGRAPHY,206,"MALFUNCTION,REACTION,COMPLICATION OF CARDIAC/VASC DEVICE OR PROCEDURE",05,DISEASES AND DISORDERS OF THE CIRCULATORY SYSTEM,3,Major,Major,Medical,Medicare,Medicaid,,,,N,38654.98,22229.86
New York City,Manhattan,7002001,001438,Bellevue Hospital Center,50 to 69,112,M,Black/African American,Not Span/Hispanic,4,Emergency,Home or Self Care,2020,INJ033,"COMPLICATION OF CARDIOVASCULAR DEVICE, IMPLANT OR GRAFT, INITIAL ENCOUNTER",IMG009,PLAIN RADIOGRAPHY,206,"MALFUNCTION,REACTION,COMPLICATION OF CARDIAC/VASC DEVICE OR PROCEDURE",05,DISEASES AND DISORDERS OF THE CIRCULATORY SYSTEM,2,Moderate,Moderate,Medical,Private Health Insurance,,,,,Y,27951.07,16074.21
New York City,Manhattan,7002001,001438,Bellevue Hospital Center,70 or Older,112,M,Black/African American,Not Span/Hispanic,4,Emergency,Home or Self Care,2020,INJ033,"COMPLICATION OF CARDIOVASCULAR DEVICE, IMPLANT OR GRAFT, INITIAL ENCOUNTER",ADM021,"ADMINISTRATION OF THERAPEUTIC SUBSTANCES, NEC",206,"MALFUNCTION,REACTION,COMPLICATION OF CARDIAC/VASC DEVICE OR PROCEDURE",05,DISEASES AND DISORDERS OF THE CIRCULATORY SYSTEM,2,Moderate,Moderate,Medical,Medicare,Medicaid,,,,Y,30957.64,17803.24
New York City,Manhattan,7002001,001438,Bellevue Hospital Center,50 to 69,112,M,Other Race,Not Span/Hispanic,7,Urgent,Home or Self Care,2020,INJ033,"COMPLICATION OF CARDIOVASCULAR DEVICE, IMPLANT OR GRAFT, INITIAL ENCOUNTER",IMG008,ULTRASONOGRAPHY,206,"MALFUNCTION,REACTION,COMPLICATION OF CARDIAC/VASC DEVICE OR PROCEDURE",05,DISEASES AND DISORDERS OF THE CIRCULATORY SYSTEM,3,Major,Major,Medical,Medicaid,,,,,N,42770,24596.34
New York City,Manhattan,7002001,001438,Bellevue Hospital Center,50 to 69,104,M,Other Race,Spanish/Hispanic,27,Urgent,Home or Self Care,2020,INJ033,"COMPLICATION OF CARDIOVASCULAR DEVICE, IMPLANT OR GRAFT, INITIAL ENCOUNTER",RES005,CHEST TUBE PLACEMENT AND THERAPEUTIC THORACENTESIS,206,"MALFUNCTION,REACTION,COMPLICATION OF CARDIAC/VASC DEVICE OR PROCEDURE",05,DISEASES AND DISORDERS OF THE CIRCULATORY SYSTEM,4,Extreme,Extreme,Medical,Private Health Insurance,,,,,N,208343.54,119815.04
New York City,Manhattan,7002001,001438,Bellevue Hospital Center,50 to 69,112,F,Black/African American,Not Span/Hispanic,3,Urgent,Home or Self Care,2020,INJ033,"COMPLICATION OF CARDIOVASCULAR DEVICE, IMPLANT OR GRAFT, INITIAL ENCOUNTER",ADM021,"ADMINISTRATION OF THERAPEUTIC SUBSTANCES, NEC",206,"MALFUNCTION,REACTION,COMPLICATION OF CARDIAC/VASC DEVICE OR PROCEDURE",05,DISEASES AND DISORDERS OF THE CIRCULATORY SYSTEM,2,Moderate,Moderate,Medical,Medicaid,,,,,N,20901.66,12020.21
New York City,Manhattan,7002001,001438,Bellevue Hospital Center,70 or Older,100,M,Other Race,Not Span/Hispanic,2,Emergency,Hospice - Home,2020,INJ033,"COMPLICATION OF CARDIOVASCULAR DEVICE, IMPLANT OR GRAFT, INITIAL ENCOUNTER",ADM001,TRANSFUSION OF BLOOD AND BLOOD PRODUCTS,206,"MALFUNCTION,REACTION,COMPLICATION OF CARDIAC/VASC DEVICE OR PROCEDURE",05,DISEASES AND DISORDERS OF THE CIRCULATORY SYSTEM,4,Extreme,Extreme,Medical,Medicare,,,,,Y,32552.31,18720.31
New York City,Manhattan,7002001,001438,Bellevue Hospital Center,30 to 49,100,M,White,Not Span/Hispanic,42,Emergency,Home or Self Care,2020,INJ033,"COMPLICATION OF CARDIOVASCULAR DEVICE, IMPLANT OR GRAFT, INITIAL ENCOUNTER",CAR024,VENOUS AND ARTERIAL CATHETER PLACEMENT,206,"MALFUNCTION,REACTION,COMPLICATION OF CARDIAC/VASC DEVICE OR PROCEDURE",05,DISEASES AND DISORDERS OF THE CIRCULATORY SYSTEM,4,Extreme,Extreme,Medical,Medicaid,,,,,Y,347038.64,199576.37
New York City,Manhattan,7002001,001438,Bellevue Hospital Center,30 to 49,113,M,Black/African American,Not Span/Hispanic,6,Emergency,Court/Law Enforcement,2020,INJ033,"COMPLICATION OF CARDIOVASCULAR DEVICE, IMPLANT OR GRAFT, INITIAL ENCOUNTER",CAR024,VENOUS AND ARTERIAL CATHETER PLACEMENT,206,"MALFUNCTION,REACTION,COMPLICATION OF CARDIAC/VASC DEVICE OR PROCEDURE",05,DISEASES AND DISORDERS OF THE CIRCULATORY SYSTEM,3,Major,Major,Medical,Medicaid,,,,,Y,56691.39,32602.31
New York City,Manhattan,7002001,001438,Bellevue Hospital Center,50 to 69,104,F,Black/African American,Not Span/Hispanic,4,Urgent,Home or Self Care,2020,INJ033,"COMPLICATION OF CARDIOVASCULAR DEVICE, IMPLANT OR GRAFT, INITIAL ENCOUNTER",CAR025,PLACEMENT OF TUNNELED OR IMPLANTABLE PORTION OF A VASCULAR ACCESS DEVICE,206,"MALFUNCTION,REACTION,COMPLICATION OF CARDIAC/VASC DEVICE OR PROCEDURE",05,DISEASES AND DISORDERS OF THE CIRCULATORY SYSTEM,3,Major,Moderate,Medical,Medicaid,,,,,N,41702.23,23982.29
New York City,Manhattan,7002001,001438,Bellevue Hospital Center,18 to 29,113,F,Other Race,Spanish/Hispanic,1,Emergency,Left Against Medical Advice,2020,INJ033,"COMPLICATION OF CARDIOVASCULAR DEVICE, IMPLANT OR GRAFT, INITIAL ENCOUNTER",ADM005,ADMINISTRATION OF THROMBOLYTICS AND PLATELET INHIBITORS,206,"MALFUNCTION,REACTION,COMPLICATION OF CARDIAC/VASC DEVICE OR PROCEDURE",05,DISEASES AND DISORDERS OF THE CIRCULATORY SYSTEM,2,Moderate,Minor,Medical,Medicaid,,,,,Y,9205.5,5293.94
New York City,Manhattan,7002001,001438,Bellevue Hospital Center,50 to 69,114,M,Black/African American,Not Span/Hispanic,8,Urgent,Home or Self Care,2020,INJ033,"COMPLICATION OF CARDIOVASCULAR DEVICE, IMPLANT OR GRAFT, INITIAL ENCOUNTER",MAM004,CARDIAC STRESS TESTS,206,"MALFUNCTION,REACTION,COMPLICATION OF CARDIAC/VASC DEVICE OR PROCEDURE",05,DISEASES AND DISORDERS OF THE CIRCULATORY SYSTEM,2,Moderate,Moderate,Medical,Medicaid,,,,,N,77417.9,44521.8
New York City,Manhattan,7002001,001438,Bellevue Hospital Center,50 to 69,104,M,Other Race,Spanish/Hispanic,1,Emergency,Home or Self Care,2020,INJ033,"COMPLICATION OF CARDIOVASCULAR DEVICE, IMPLANT OR GRAFT, INITIAL ENCOUNTER",MAM006,PACEMAKER AND DEFIBRILLATOR INTERROGATION,206,"MALFUNCTION,REACTION,COMPLICATION OF CARDIAC/VASC DEVICE OR PROCEDURE",05,DISEASES AND DISORDERS OF THE CIRCULATORY SYSTEM,2,Moderate,Major,Medical,Medicaid,,,,,Y,11084.29,6374.4
New York City,Manhattan,7002001,001438,Bellevue Hospital Center,30 to 49,112,F,Other Race,Spanish/Hispanic,14,Emergency,Home or Self Care,2020,INJ033,"COMPLICATION OF CARDIOVASCULAR DEVICE, IMPLANT OR GRAFT, INITIAL ENCOUNTER",ESA001,HEMODIALYSIS,206,"MALFUNCTION,REACTION,COMPLICATION OF CARDIAC/VASC DEVICE OR PROCEDURE",05,DISEASES AND DISORDERS OF THE CIRCULATORY SYSTEM,3,Major,Major,Medical,Medicaid,,,,,Y,106910.58,61482.56
New York City,Manhattan,7002001,001438,Bellevue Hospital Center,50 to 69,100,M,Other Race,Spanish/Hispanic,3,Emergency,Home or Self Care,2020,INJ033,"COMPLICATION OF CARDIOVASCULAR DEVICE, IMPLANT OR GRAFT, INITIAL ENCOUNTER",IMG008,ULTRASONOGRAPHY,206,"MALFUNCTION,REACTION,COMPLICATION OF CARDIAC/VASC DEVICE OR PROCEDURE",05,DISEASES AND DISORDERS OF THE CIRCULATORY SYSTEM,2,Moderate,Moderate,Medical,Medicaid,,,,,Y,23865.75,13724.81
New York City,Manhattan,7002001,001438,Bellevue Hospital Center,30 to 49,114,M,White,Not Span/Hispanic,26,Urgent,Left Against Medical Advice,2020,INJ033,"COMPLICATION OF CARDIOVASCULAR DEVICE, IMPLANT OR GRAFT, INITIAL ENCOUNTER",CAR024,VENOUS AND ARTERIAL CATHETER PLACEMENT,206,"MALFUNCTION,REACTION,COMPLICATION OF CARDIAC/VASC DEVICE OR PROCEDURE",05,DISEASES AND DISORDERS OF THE CIRCULATORY SYSTEM,4,Extreme,Extreme,Medical,Medicaid,,,,,N,341327.33,196291.89
New York City,Manhattan,7002001,001438,Bellevue Hospital Center,70 or Older,112,F,Other Race,Spanish/Hispanic,13,Emergency,Short-term Hospital,2020,INJ033,"COMPLICATION OF CARDIOVASCULAR DEVICE, IMPLANT OR GRAFT, INITIAL ENCOUNTER",ESA001,HEMODIALYSIS,206,"MALFUNCTION,REACTION,COMPLICATION OF CARDIAC/VASC DEVICE OR PROCEDURE",05,DISEASES AND DISORDERS OF THE CIRCULATORY SYSTEM,3,Major,Major,Medical,Medicaid,,,,,Y,93046.44,53509.52
New York City,Manhattan,7002001,001438,Bellevue Hospital Center,50 to 69,113,M,Other Race,Spanish/Hispanic,1,Elective,Left Against Medical Advice,2020,INJ033,"COMPLICATION OF CARDIOVASCULAR DEVICE, IMPLANT OR GRAFT, INITIAL ENCOUNTER",,,206,"MALFUNCTION,REACTION,COMPLICATION OF CARDIAC/VASC DEVICE OR PROCEDURE",05,DISEASES AND DISORDERS OF THE CIRCULATORY SYSTEM,1,Minor,Minor,Medical,Private Health Insurance,,,,,N,6305.23,3626.04
New York City,Manhattan,7002001,001438,Bellevue Hospital Center,50 to 69,113,F,Other Race,Not Span/Hispanic,29,Urgent,Home or Self Care,2020,INJ033,"COMPLICATION OF CARDIOVASCULAR DEVICE, IMPLANT OR GRAFT, INITIAL ENCOUNTER",IMG008,ULTRASONOGRAPHY,206,"MALFUNCTION,REACTION,COMPLICATION OF CARDIAC/VASC DEVICE OR PROCEDURE",05,DISEASES AND DISORDERS OF THE CIRCULATORY SYSTEM,3,Major,Extreme,Medical,Medicaid,,,,,N,233286.11,134159.11
New York City,Manhattan,7002001,001438,Bellevue Hospital Center,30 to 49,,F,Multi-racial,Not Span/Hispanic,11,Urgent,Home w/ Home Health Services,2020,INJ033,"COMPLICATION OF CARDIOVASCULAR DEVICE, IMPLANT OR GRAFT, INITIAL ENCOUNTER",ADM015,ADMINISTRATION OF ANTIBIOTICS,206,"MALFUNCTION,REACTION,COMPLICATION OF CARDIAC/VASC DEVICE OR PROCEDURE",05,DISEASES AND DISORDERS OF THE CIRCULATORY SYSTEM,4,Extreme,Extreme,Medical,Medicaid,,,,,N,150634.63,86627.57
New York City,Manhattan,7002001,001438,Bellevue Hospital Center,18 to 29,112,M,Black/African American,Not Span/Hispanic,2,Urgent,Psychiatric Hospital or Unit of Hosp,2020,CIR038,POSTPROCEDURAL OR POSTOPERATIVE CIRCULATORY SYSTEM COMPLICATION,IMG008,ULTRASONOGRAPHY,206,"MALFUNCTION,REACTION,COMPLICATION OF CARDIAC/VASC DEVICE OR PROCEDURE",05,DISEASES AND DISORDERS OF THE CIRCULATORY SYSTEM,2,Moderate,Minor,Medical,Medicaid,,,,,N,15408.12,8860.96
New York City,Manhattan,7002001,001438,Bellevue Hospital Center,50 to 69,112,F,White,Not Span/Hispanic,28,Urgent,Expired,2020,INJ033,"COMPLICATION OF CARDIOVASCULAR DEVICE, IMPLANT OR GRAFT, INITIAL ENCOUNTER",MST028,"SUBCUTANEOUS TISSUE AND FASCIA PROCEDURES, NEC",206,"MALFUNCTION,REACTION,COMPLICATION OF CARDIAC/VASC DEVICE OR PROCEDURE",05,DISEASES AND DISORDERS OF THE CIRCULATORY SYSTEM,3,Major,Major,Medical,Medicaid,,,,,N,223234.59,128378.64
New York City,Manhattan,7002001,001438,Bellevue Hospital Center,70 or Older,100,M,White,Not Span/Hispanic,1,Emergency,Home or Self Care,2020,INJ033,"COMPLICATION OF CARDIOVASCULAR DEVICE, IMPLANT OR GRAFT, INITIAL ENCOUNTER",MAM007,ELECTROCARDIOGRAM (ECG),206,"MALFUNCTION,REACTION,COMPLICATION OF CARDIAC/VASC DEVICE OR PROCEDURE",05,DISEASES AND DISORDERS OF THE CIRCULATORY SYSTEM,2,Moderate,Moderate,Medical,Medicare,,,,,Y,9180.96,5279.82
New York City,Manhattan,7002001,001438,Bellevue Hospital Center,70 or Older,112,F,Black/African American,Not Span/Hispanic,14,Urgent,Short-term Hospital,2020,INJ033,"COMPLICATION OF CARDIOVASCULAR DEVICE, IMPLANT OR GRAFT, INITIAL ENCOUNTER",CAR024,VENOUS AND ARTERIAL CATHETER PLACEMENT,206,"MALFUNCTION,REACTION,COMPLICATION OF CARDIAC/VASC DEVICE OR PROCEDURE",05,DISEASES AND DISORDERS OF THE CIRCULATORY SYSTEM,4,Extreme,Extreme,Medical,Medicare,Medicaid,,,,N,132779.17,76359.18
