Hospital Service Area,Hospital County,Operating Certificate Number,Permanent Facility Id,Facility Name,Age Group,Zip Code - 3 digits,Gender,Race,Ethnicity,Length of Stay,Type of Admission,Patient Disposition,Discharge Year,CCS Diagnosis Code,CCS Diagnosis Description,CCS Procedure Code,CCS Procedure Description,APR DRG Code,APR DRG Description,APR MDC Code,APR MDC Description,APR Severity of Illness Code,APR Severity of Illness Description,APR Risk of Mortality,APR Medical Surgical Description,Payment Typology 1,Payment Typology 2,Payment Typology 3,Birth Weight,Abortion Edit Indicator,Emergency Department Indicator,Total Charges,Total Costs
New York City,Manhattan,7002053,001463,NYU Langone Hospitals,30 to 49,103,F,White,Not Span/Hispanic,2,Emergency,Home or Self Care,2019,CIR006,PERICARDITIS AND PERICARDIAL DISEASE,,,207,OTHER CIRCULATORY SYSTEM DIAGNOSES,05,DISEASES AND DISORDERS OF THE CIRCULATORY SYSTEM,3,Major,Minor,Medical,Medicaid,,,,,true,41991.8,10456.23
New York City,Manhattan,7002053,001463,NYU Langone Hospitals,30 to 49,117,M,Other Race,Unknown,2,Emergency,Home or Self Care,2019,CIR031,HYPOTENSION,,,207,OTHER CIRCULATORY SYSTEM DIAGNOSES,05,DISEASES AND DISORDERS OF THE CIRCULATORY SYSTEM,1,Minor,Moderate,Medical,Blue Cross/Blue Shield,Blue Cross/Blue Shield,,,,true,123447.31,20887.74
New York City,Manhattan,7002053,001463,NYU Langone Hospitals,18 to 29,112,M,White,Not Span/Hispanic,1,Emergency,Home or Self Care,2019,CIR006,PERICARDITIS AND PERICARDIAL DISEASE,,,207,OTHER CIRCULATORY SYSTEM DIAGNOSES,05,DISEASES AND DISORDERS OF THE CIRCULATORY SYSTEM,1,Minor,Minor,Medical,Medicaid,,,,,true,34703.18,6143.12
New York City,Manhattan,7002053,001463,NYU Langone Hospitals,50 to 69,112,F,White,Not Span/Hispanic,9,Emergency,Home w/ Home Health Services,2019,CIR006,PERICARDITIS AND PERICARDIAL DISEASE,CAR017,PERICARDIAL PROCEDURES,207,OTHER CIRCULATORY SYSTEM DIAGNOSES,05,DISEASES AND DISORDERS OF THE CIRCULATORY SYSTEM,4,Extreme,Extreme,Medical,Private Health Insurance,,,,,true,220284.29,63420.19
New York City,Manhattan,7002053,001463,NYU Langone Hospitals,70 or Older,113,M,White,Not Span/Hispanic,12,Emergency,Home w/ Home Health Services,2019,CIR006,PERICARDITIS AND PERICARDIAL DISEASE,IMG008,ULTRASONOGRAPHY,207,OTHER CIRCULATORY SYSTEM DIAGNOSES,05,DISEASES AND DISORDERS OF THE CIRCULATORY SYSTEM,4,Extreme,Major,Medical,Medicare,Private Health Insurance,,,,true,182567.68,53611.76
New York City,Manhattan,7002053,001463,NYU Langone Hospitals,30 to 49,OOS,M,White,Not Span/Hispanic,1,Elective,Home or Self Care,2019,CIR006,PERICARDITIS AND PERICARDIAL DISEASE,,,207,OTHER CIRCULATORY SYSTEM DIAGNOSES,05,DISEASES AND DISORDERS OF THE CIRCULATORY SYSTEM,1,Minor,Minor,Medical,Private Health Insurance,,,,,false,44805.92,9003.85
New York City,Manhattan,7002053,001463,NYU Langone Hospitals,50 to 69,112,F,Other Race,Not Span/Hispanic,2,Emergency,Home w/ Home Health Services,2019,CIR031,HYPOTENSION,,,207,OTHER CIRCULATORY SYSTEM DIAGNOSES,05,DISEASES AND DISORDERS OF THE CIRCULATORY SYSTEM,2,Moderate,Moderate,Medical,Private Health Insurance,,,,,true,31057.68,9000.38
New York City,Manhattan,7002053,001463,NYU Langone Hospitals,70 or Older,100,F,White,Not Span/Hispanic,2,Emergency,Home or Self Care,2019,CIR038,POSTPROCEDURAL OR POSTOPERATIVE CIRCULATORY SYSTEM COMPLICATION,,,207,OTHER CIRCULATORY SYSTEM DIAGNOSES,05,DISEASES AND DISORDERS OF THE CIRCULATORY SYSTEM,3,Major,Moderate,Medical,Private Health Insurance,Medicare,,,,true,52486.61,14706.2
New York City,Manhattan,7002053,001463,NYU Langone Hospitals,70 or Older,100,F,White,Not Span/Hispanic,3,Emergency,Home or Self Care,2019,CIR006,PERICARDITIS AND PERICARDIAL DISEASE,CAR017,PERICARDIAL PROCEDURES,207,OTHER CIRCULATORY SYSTEM DIAGNOSES,05,DISEASES AND DISORDERS OF THE CIRCULATORY SYSTEM,3,Major,Moderate,Medical,Medicare,Private Health Insurance,,,,true,54000.09,14988.92
New York City,Manhattan,7002053,001463,NYU Langone Hospitals,50 to 69,100,F,White,Not Span/Hispanic,1,Emergency,Home or Self Care,2019,SYM017,ABNORMAL FINDINGS WITHOUT DIAGNOSIS,,,207,OTHER CIRCULATORY SYSTEM DIAGNOSES,05,DISEASES AND DISORDERS OF THE CIRCULATORY SYSTEM,2,Moderate,Moderate,Medical,Private Health Insurance,,,,,true,27767.09,6466.13
New York City,Manhattan,7002053,001463,NYU Langone Hospitals,18 to 29,112,M,Other Race,Not Span/Hispanic,1,Emergency,Home or Self Care,2019,CIR006,PERICARDITIS AND PERICARDIAL DISEASE,,,207,OTHER CIRCULATORY SYSTEM DIAGNOSES,05,DISEASES AND DISORDERS OF THE CIRCULATORY SYSTEM,1,Minor,Minor,Medical,Blue Cross/Blue Shield,,,,,true,27449.12,8724.35
New York City,Manhattan,7002053,001463,NYU Langone Hospitals,30 to 49,112,M,White,Not Span/Hispanic,1,Emergency,Home or Self Care,2019,CIR006,PERICARDITIS AND PERICARDIAL DISEASE,,,207,OTHER CIRCULATORY SYSTEM DIAGNOSES,05,DISEASES AND DISORDERS OF THE CIRCULATORY SYSTEM,3,Major,Major,Medical,Medicaid,,,,,true,25982.79,5921.09
New York City,Manhattan,7002053,001463,NYU Langone Hospitals,0 to 17,116,M,Other Race,Spanish/Hispanic,19,Elective,Home w/ Home Health Services,2019,CIR014,PULMONARY HEART DISEASE,GIS001,ESOPHAGOGASTRODUODENOSCOPY (EGD) WITH BIOPSY,207,OTHER CIRCULATORY SYSTEM DIAGNOSES,05,DISEASES AND DISORDERS OF THE CIRCULATORY SYSTEM,4,Extreme,Moderate,Medical,Private Health Insurance,,,,,false,383786.24,99777.59
New York City,Manhattan,7002053,001463,NYU Langone Hospitals,30 to 49,112,F,Black/African American,Not Span/Hispanic,1,Emergency,Home or Self Care,2019,CIR006,PERICARDITIS AND PERICARDIAL DISEASE,,,207,OTHER CIRCULATORY SYSTEM DIAGNOSES,05,DISEASES AND DISORDERS OF THE CIRCULATORY SYSTEM,3,Major,Major,Medical,Medicare,Medicaid,,,,true,25633.25,7321.17
New York City,Manhattan,7002053,001463,NYU Langone Hospitals,70 or Older,112,F,Other Race,Not Span/Hispanic,47,Emergency,Skilled Nursing Home,2019,CIR014,PULMONARY HEART DISEASE,ESA004,NON-INVASIVE VENTILATION,207,OTHER CIRCULATORY SYSTEM DIAGNOSES,05,DISEASES AND DISORDERS OF THE CIRCULATORY SYSTEM,4,Extreme,Extreme,Medical,Medicare,Medicaid,,,,true,506414.53,209429.84
New York City,Manhattan,7002053,001463,NYU Langone Hospitals,50 to 69,OOS,F,White,Not Span/Hispanic,10,Emergency,Hospice - Home,2019,CIR005,MYOCARDITIS AND CARDIOMYOPATHY,IMG008,ULTRASONOGRAPHY,207,OTHER CIRCULATORY SYSTEM DIAGNOSES,05,DISEASES AND DISORDERS OF THE CIRCULATORY SYSTEM,3,Major,Major,Medical,Blue Cross/Blue Shield,,,,,true,165466.17,43605.39
New York City,Manhattan,7002053,001463,NYU Langone Hospitals,70 or Older,112,M,White,Not Span/Hispanic,7,Emergency,Home w/ Home Health Services,2019,CIR006,PERICARDITIS AND PERICARDIAL DISEASE,ESA001,HEMODIALYSIS,207,OTHER CIRCULATORY SYSTEM DIAGNOSES,05,DISEASES AND DISORDERS OF THE CIRCULATORY SYSTEM,4,Extreme,Extreme,Medical,Medicare,Medicare,,,,true,162206.33,54258.03
New York City,Manhattan,7002053,001463,NYU Langone Hospitals,70 or Older,112,M,White,Not Span/Hispanic,2,Emergency,Home or Self Care,2019,CIR031,HYPOTENSION,MST001,ARTHROCENTESIS,207,OTHER CIRCULATORY SYSTEM DIAGNOSES,05,DISEASES AND DISORDERS OF THE CIRCULATORY SYSTEM,2,Moderate,Major,Medical,Medicare,Medicare,,,,true,94409.39,12356.86
New York City,Manhattan,7002053,001463,NYU Langone Hospitals,50 to 69,100,F,White,Not Span/Hispanic,2,Emergency,Home or Self Care,2019,CIR006,PERICARDITIS AND PERICARDIAL DISEASE,,,207,OTHER CIRCULATORY SYSTEM DIAGNOSES,05,DISEASES AND DISORDERS OF THE CIRCULATORY SYSTEM,1,Minor,Minor,Medical,Medicaid,,,,,false,28375.61,11166.99
New York City,Manhattan,7002053,001463,NYU Langone Hospitals,0 to 17,117,M,Other Race,Not Span/Hispanic,21,Emergency,Inpatient Rehabilitation Facility,2019,CIR005,MYOCARDITIS AND CARDIOMYOPATHY,CNS002,LUMBAR PUNCTURE,207,OTHER CIRCULATORY SYSTEM DIAGNOSES,05,DISEASES AND DISORDERS OF THE CIRCULATORY SYSTEM,4,Extreme,Moderate,Medical,Private Health Insurance,,,,,false,426686.66,119900.4
New York City,Manhattan,7002053,001463,NYU Langone Hospitals,70 or Older,111,M,Other Race,Spanish/Hispanic,3,Emergency,Home w/ Home Health Services,2019,CIR005,MYOCARDITIS AND CARDIOMYOPATHY,,,207,OTHER CIRCULATORY SYSTEM DIAGNOSES,05,DISEASES AND DISORDERS OF THE CIRCULATORY SYSTEM,3,Major,Major,Medical,Medicare,,,,,true,68437.21,15267.82
New York City,Manhattan,7002053,001463,NYU Langone Hospitals,70 or Older,105,M,White,Not Span/Hispanic,2,Urgent,Home w/ Home Health Services,2019,CIR038,POSTPROCEDURAL OR POSTOPERATIVE CIRCULATORY SYSTEM COMPLICATION,CAR017,PERICARDIAL PROCEDURES,207,OTHER CIRCULATORY SYSTEM DIAGNOSES,05,DISEASES AND DISORDERS OF THE CIRCULATORY SYSTEM,2,Moderate,Major,Medical,Medicare,Medicare,,,,false,61023.56,17712.82
New York City,Manhattan,7002053,001463,NYU Langone Hospitals,70 or Older,112,F,White,Not Span/Hispanic,1,Emergency,Home or Self Care,2019,INJ030,DRUG INDUCED OR TOXIC RELATED CONDITION,,,207,OTHER CIRCULATORY SYSTEM DIAGNOSES,05,DISEASES AND DISORDERS OF THE CIRCULATORY SYSTEM,1,Minor,Moderate,Medical,Medicare,,,,,true,20510.74,5304.09
New York City,Manhattan,7002053,001463,NYU Langone Hospitals,50 to 69,OOS,M,Other Race,Not Span/Hispanic,1,Elective,Home or Self Care,2019,CIR006,PERICARDITIS AND PERICARDIAL DISEASE,ADM006,INFUSION OF VASOPRESSOR,207,OTHER CIRCULATORY SYSTEM DIAGNOSES,05,DISEASES AND DISORDERS OF THE CIRCULATORY SYSTEM,2,Moderate,Moderate,Medical,Private Health Insurance,,,,,false,29333.14,6913.45
New York City,Manhattan,7002053,001463,NYU Langone Hospitals,50 to 69,112,M,White,Not Span/Hispanic,1,Emergency,Home or Self Care,2019,CIR038,POSTPROCEDURAL OR POSTOPERATIVE CIRCULATORY SYSTEM COMPLICATION,ADM021,"ADMINISTRATION OF THERAPEUTIC SUBSTANCES, NEC",207,OTHER CIRCULATORY SYSTEM DIAGNOSES,05,DISEASES AND DISORDERS OF THE CIRCULATORY SYSTEM,2,Moderate,Minor,Medical,Private Health Insurance,,,,,true,18821.53,5288.2
New York City,Manhattan,7002053,001463,NYU Langone Hospitals,70 or Older,100,F,White,Not Span/Hispanic,1,Emergency,Home w/ Home Health Services,2019,CIR006,PERICARDITIS AND PERICARDIAL DISEASE,ADM021,"ADMINISTRATION OF THERAPEUTIC SUBSTANCES, NEC",207,OTHER CIRCULATORY SYSTEM DIAGNOSES,05,DISEASES AND DISORDERS OF THE CIRCULATORY SYSTEM,2,Moderate,Moderate,Medical,Private Health Insurance,,,,,true,29371.85,6947.45
New York City,Manhattan,7002053,001463,NYU Langone Hospitals,18 to 29,OOS,F,White,Not Span/Hispanic,2,Emergency,Home or Self Care,2019,CIR006,PERICARDITIS AND PERICARDIAL DISEASE,,,207,OTHER CIRCULATORY SYSTEM DIAGNOSES,05,DISEASES AND DISORDERS OF THE CIRCULATORY SYSTEM,2,Moderate,Minor,Medical,Private Health Insurance,,,,,true,48529.38,11384.2
New York City,Manhattan,7002053,001463,NYU Langone Hospitals,30 to 49,113,M,Black/African American,Not Span/Hispanic,1,Emergency,Home or Self Care,2019,CIR038,POSTPROCEDURAL OR POSTOPERATIVE CIRCULATORY SYSTEM COMPLICATION,,,207,OTHER CIRCULATORY SYSTEM DIAGNOSES,05,DISEASES AND DISORDERS OF THE CIRCULATORY SYSTEM,2,Moderate,Moderate,Medical,Blue Cross/Blue Shield,,,,,true,37196.75,8173.92
New York City,Manhattan,7002053,001463,NYU Langone Hospitals,50 to 69,100,F,Black/African American,Not Span/Hispanic,1,Emergency,Home or Self Care,2019,SYM012,CIRCULATORY SIGNS AND SYMPTOMS,,,207,OTHER CIRCULATORY SYSTEM DIAGNOSES,05,DISEASES AND DISORDERS OF THE CIRCULATORY SYSTEM,1,Minor,Minor,Medical,Blue Cross/Blue Shield,,,,,true,21433.26,5541.51
New York City,Manhattan,7002053,001463,NYU Langone Hospitals,18 to 29,OOS,F,White,Not Span/Hispanic,1,Emergency,Home or Self Care,2019,CIR006,PERICARDITIS AND PERICARDIAL DISEASE,,,207,OTHER CIRCULATORY SYSTEM DIAGNOSES,05,DISEASES AND DISORDERS OF THE CIRCULATORY SYSTEM,1,Minor,Minor,Medical,Private Health Insurance,,,,,true,17369.92,4936.2
New York City,Manhattan,7002053,001463,NYU Langone Hospitals,30 to 49,112,F,White,Not Span/Hispanic,4,Emergency,Home or Self Care,2019,CIR006,PERICARDITIS AND PERICARDIAL DISEASE,RES005,CHEST TUBE PLACEMENT AND THERAPEUTIC THORACENTESIS,207,OTHER CIRCULATORY SYSTEM DIAGNOSES,05,DISEASES AND DISORDERS OF THE CIRCULATORY SYSTEM,4,Extreme,Major,Medical,Private Health Insurance,,,,,true,66067.69,18518.82
New York City,Manhattan,7002053,001463,NYU Langone Hospitals,50 to 69,112,M,White,Not Span/Hispanic,2,Emergency,Home w/ Home Health Services,2019,INJ030,DRUG INDUCED OR TOXIC RELATED CONDITION,,,207,OTHER CIRCULATORY SYSTEM DIAGNOSES,05,DISEASES AND DISORDERS OF THE CIRCULATORY SYSTEM,2,Moderate,Moderate,Medical,Medicaid,,,,,true,53357.77,13613.55
New York City,Manhattan,7002053,001463,NYU Langone Hospitals,70 or Older,112,F,Other Race,Not Span/Hispanic,4,Emergency,Home w/ Home Health Services,2019,CIR014,PULMONARY HEART DISEASE,,,207,OTHER CIRCULATORY SYSTEM DIAGNOSES,05,DISEASES AND DISORDERS OF THE CIRCULATORY SYSTEM,3,Major,Major,Medical,Medicare,Medicaid,,,,true,48205.96,15096.98
New York City,Manhattan,7002053,001463,NYU Langone Hospitals,18 to 29,100,F,Black/African American,Not Span/Hispanic,3,Emergency,Home or Self Care,2019,CIR006,PERICARDITIS AND PERICARDIAL DISEASE,CAR017,PERICARDIAL PROCEDURES,207,OTHER CIRCULATORY SYSTEM DIAGNOSES,05,DISEASES AND DISORDERS OF THE CIRCULATORY SYSTEM,3,Major,Major,Medical,Private Health Insurance,Private Health Insurance,,,,true,97641.58,29832.34
New York City,Manhattan,7002053,001463,NYU Langone Hospitals,50 to 69,100,F,Black/African American,Spanish/Hispanic,3,Emergency,Home or Self Care,2019,CIR006,PERICARDITIS AND PERICARDIAL DISEASE,,,207,OTHER CIRCULATORY SYSTEM DIAGNOSES,05,DISEASES AND DISORDERS OF THE CIRCULATORY SYSTEM,1,Minor,Minor,Medical,Medicaid,,,,,true,50987.44,14333.53
New York City,Manhattan,7002053,001463,NYU Langone Hospitals,50 to 69,112,M,White,Not Span/Hispanic,2,Emergency,Home or Self Care,2019,CIR014,PULMONARY HEART DISEASE,ESA001,HEMODIALYSIS,207,OTHER CIRCULATORY SYSTEM DIAGNOSES,05,DISEASES AND DISORDERS OF THE CIRCULATORY SYSTEM,3,Major,Major,Medical,Medicare,Blue Cross/Blue Shield,,,,true,52704.5,11861.59
New York City,Manhattan,7002053,001463,NYU Langone Hospitals,18 to 29,100,M,Other Race,Unknown,1,Emergency,Home or Self Care,2019,CIR006,PERICARDITIS AND PERICARDIAL DISEASE,,,207,OTHER CIRCULATORY SYSTEM DIAGNOSES,05,DISEASES AND DISORDERS OF THE CIRCULATORY SYSTEM,1,Minor,Minor,Medical,Private Health Insurance,,,,,true,17286.42,4926.53
New York City,Manhattan,7002053,001463,NYU Langone Hospitals,70 or Older,100,F,White,Not Span/Hispanic,3,Emergency,Home or Self Care,2019,CIR006,PERICARDITIS AND PERICARDIAL DISEASE,,,207,OTHER CIRCULATORY SYSTEM DIAGNOSES,05,DISEASES AND DISORDERS OF THE CIRCULATORY SYSTEM,3,Major,Major,Medical,Medicare,Blue Cross/Blue Shield,,,,true,45043.1,13547.86
New York City,Manhattan,7002053,001463,NYU Langone Hospitals,70 or Older,103,F,White,Not Span/Hispanic,5,Emergency,Home or Self Care,2019,CIR005,MYOCARDITIS AND CARDIOMYOPATHY,,,207,OTHER CIRCULATORY SYSTEM DIAGNOSES,05,DISEASES AND DISORDERS OF THE CIRCULATORY SYSTEM,4,Extreme,Extreme,Medical,Medicare,Medicare,,,,true,111172.96,31124.46
New York City,Manhattan,7002053,001463,NYU Langone Hospitals,0 to 17,113,M,Other Race,Spanish/Hispanic,3,Emergency,Home or Self Care,2019,SYM014,SKIN/SUBCUTANEOUS SIGNS AND SYMPTOMS,MAM011,ELECTROENCEPHALOGRAM (EEG),207,OTHER CIRCULATORY SYSTEM DIAGNOSES,05,DISEASES AND DISORDERS OF THE CIRCULATORY SYSTEM,1,Minor,Minor,Medical,Private Health Insurance,,,,,true,53251.36,17859.81
New York City,Manhattan,7002053,001463,NYU Langone Hospitals,30 to 49,OOS,F,Black/African American,Not Span/Hispanic,22,Emergency,Home w/ Home Health Services,2019,CIR014,PULMONARY HEART DISEASE,CAR024,VENOUS AND ARTERIAL CATHETER PLACEMENT,207,OTHER CIRCULATORY SYSTEM DIAGNOSES,05,DISEASES AND DISORDERS OF THE CIRCULATORY SYSTEM,3,Major,Major,Medical,Blue Cross/Blue Shield,,,,,true,640531.92,181787.59
New York City,Manhattan,7002053,001463,NYU Langone Hospitals,50 to 69,112,M,Other Race,Not Span/Hispanic,2,Emergency,Home w/ Home Health Services,2019,SYM012,CIRCULATORY SIGNS AND SYMPTOMS,,,207,OTHER CIRCULATORY SYSTEM DIAGNOSES,05,DISEASES AND DISORDERS OF THE CIRCULATORY SYSTEM,3,Major,Major,Medical,Private Health Insurance,Medicaid,,,,true,29981.6,8556.68
New York City,Manhattan,7002053,001463,NYU Langone Hospitals,30 to 49,112,M,White,Not Span/Hispanic,4,Emergency,Home or Self Care,2019,CIR005,MYOCARDITIS AND CARDIOMYOPATHY,,,207,OTHER CIRCULATORY SYSTEM DIAGNOSES,05,DISEASES AND DISORDERS OF THE CIRCULATORY SYSTEM,3,Major,Moderate,Medical,Private Health Insurance,,,,,true,58169.95,17897.72
New York City,Manhattan,7002053,001463,NYU Langone Hospitals,70 or Older,112,M,White,Not Span/Hispanic,1,Emergency,Home or Self Care,2019,CIR031,HYPOTENSION,,,207,OTHER CIRCULATORY SYSTEM DIAGNOSES,05,DISEASES AND DISORDERS OF THE CIRCULATORY SYSTEM,1,Minor,Moderate,Medical,Medicare,Medicaid,,,,true,20183.9,5457.34
New York City,Manhattan,7002053,001463,NYU Langone Hospitals,50 to 69,103,M,Black/African American,Not Span/Hispanic,12,Elective,Home w/ Home Health Services,2019,CIR014,PULMONARY HEART DISEASE,CAR024,VENOUS AND ARTERIAL CATHETER PLACEMENT,207,OTHER CIRCULATORY SYSTEM DIAGNOSES,05,DISEASES AND DISORDERS OF THE CIRCULATORY SYSTEM,3,Major,Major,Medical,Medicare,,,,,false,479299.23,105404.25
New York City,Manhattan,7002053,001463,NYU Langone Hospitals,30 to 49,100,M,White,Not Span/Hispanic,4,Emergency,Home or Self Care,2019,CIR005,MYOCARDITIS AND CARDIOMYOPATHY,,,207,OTHER CIRCULATORY SYSTEM DIAGNOSES,05,DISEASES AND DISORDERS OF THE CIRCULATORY SYSTEM,1,Minor,Minor,Medical,Blue Cross/Blue Shield,,,,,true,60478.88,16378.09
New York City,Manhattan,7002053,001463,NYU Langone Hospitals,70 or Older,100,F,White,Not Span/Hispanic,4,Emergency,Home w/ Home Health Services,2019,CIR006,PERICARDITIS AND PERICARDIAL DISEASE,CAR017,PERICARDIAL PROCEDURES,207,OTHER CIRCULATORY SYSTEM DIAGNOSES,05,DISEASES AND DISORDERS OF THE CIRCULATORY SYSTEM,3,Major,Major,Medical,Medicare,Blue Cross/Blue Shield,,,,true,109315.38,36569.03
New York City,Manhattan,7002053,001463,NYU Langone Hospitals,70 or Older,113,M,White,Not Span/Hispanic,3,Emergency,Home w/ Home Health Services,2019,INJ030,DRUG INDUCED OR TOXIC RELATED CONDITION,,,207,OTHER CIRCULATORY SYSTEM DIAGNOSES,05,DISEASES AND DISORDERS OF THE CIRCULATORY SYSTEM,2,Moderate,Major,Medical,Medicare,Medicare,,,,true,53958.01,19929.42
New York City,Manhattan,7002053,001463,NYU Langone Hospitals,70 or Older,100,M,White,Not Span/Hispanic,1,Emergency,Home or Self Care,2019,CIR031,HYPOTENSION,,,207,OTHER CIRCULATORY SYSTEM DIAGNOSES,05,DISEASES AND DISORDERS OF THE CIRCULATORY SYSTEM,3,Major,Major,Medical,Medicare,Blue Cross/Blue Shield,,,,true,15567.51,4633.66
New York City,Manhattan,7002053,001463,NYU Langone Hospitals,70 or Older,112,M,White,Not Span/Hispanic,3,Emergency,Home or Self Care,2019,CIR006,PERICARDITIS AND PERICARDIAL DISEASE,CAR017,PERICARDIAL PROCEDURES,207,OTHER CIRCULATORY SYSTEM DIAGNOSES,05,DISEASES AND DISORDERS OF THE CIRCULATORY SYSTEM,3,Major,Major,Medical,Medicare,Blue Cross/Blue Shield,,,,true,76090.2,22048.38
New York City,Manhattan,7002053,001463,NYU Langone Hospitals,30 to 49,112,F,White,Not Span/Hispanic,4,Emergency,Home or Self Care,2019,CIR006,PERICARDITIS AND PERICARDIAL DISEASE,CAR017,PERICARDIAL PROCEDURES,207,OTHER CIRCULATORY SYSTEM DIAGNOSES,05,DISEASES AND DISORDERS OF THE CIRCULATORY SYSTEM,3,Major,Major,Medical,Private Health Insurance,,,,,true,81513.94,24109.18
New York City,Manhattan,7002053,001463,NYU Langone Hospitals,30 to 49,OOS,M,White,Not Span/Hispanic,1,Emergency,Home or Self Care,2019,CIR006,PERICARDITIS AND PERICARDIAL DISEASE,,,207,OTHER CIRCULATORY SYSTEM DIAGNOSES,05,DISEASES AND DISORDERS OF THE CIRCULATORY SYSTEM,2,Moderate,Minor,Medical,Blue Cross/Blue Shield,,,,,true,14589.71,4544.83
New York City,Manhattan,7002053,001463,NYU Langone Hospitals,50 to 69,116,F,White,Not Span/Hispanic,1,Emergency,Home or Self Care,2019,CIR014,PULMONARY HEART DISEASE,,,207,OTHER CIRCULATORY SYSTEM DIAGNOSES,05,DISEASES AND DISORDERS OF THE CIRCULATORY SYSTEM,4,Extreme,Major,Medical,Private Health Insurance,,,,,false,17461.8,4697.7
New York City,Manhattan,7002053,001463,NYU Langone Hospitals,50 to 69,100,M,White,Not Span/Hispanic,2,Emergency,Home w/ Home Health Services,2019,CIR006,PERICARDITIS AND PERICARDIAL DISEASE,,,207,OTHER CIRCULATORY SYSTEM DIAGNOSES,05,DISEASES AND DISORDERS OF THE CIRCULATORY SYSTEM,1,Minor,Moderate,Medical,Medicare,Medicare,Private Health Insurance,,,true,30697.79,8949.29
New York City,Manhattan,7002053,001463,NYU Langone Hospitals,50 to 69,100,F,Other Race,Spanish/Hispanic,3,Elective,Home w/ Home Health Services,2019,CIR014,PULMONARY HEART DISEASE,,,207,OTHER CIRCULATORY SYSTEM DIAGNOSES,05,DISEASES AND DISORDERS OF THE CIRCULATORY SYSTEM,2,Moderate,Moderate,Medical,Blue Cross/Blue Shield,Medicare,,,,false,52873.65,11090.16
New York City,Manhattan,7002053,001463,NYU Langone Hospitals,50 to 69,104,M,Black/African American,Not Span/Hispanic,1,Emergency,Home or Self Care,2019,CIR006,PERICARDITIS AND PERICARDIAL DISEASE,,,207,OTHER CIRCULATORY SYSTEM DIAGNOSES,05,DISEASES AND DISORDERS OF THE CIRCULATORY SYSTEM,2,Moderate,Minor,Medical,Private Health Insurance,,,,,true,20672.01,5373.66
New York City,Manhattan,7002053,001463,NYU Langone Hospitals,50 to 69,112,F,Other Race,Not Span/Hispanic,3,Emergency,Home or Self Care,2019,CIR006,PERICARDITIS AND PERICARDIAL DISEASE,CAR017,PERICARDIAL PROCEDURES,207,OTHER CIRCULATORY SYSTEM DIAGNOSES,05,DISEASES AND DISORDERS OF THE CIRCULATORY SYSTEM,4,Extreme,Major,Medical,Medicaid,,,,,true,57694.94,15144.17
New York City,Manhattan,7002053,001463,NYU Langone Hospitals,70 or Older,100,F,White,Not Span/Hispanic,6,Emergency,Home w/ Home Health Services,2019,CIR006,PERICARDITIS AND PERICARDIAL DISEASE,CAR017,PERICARDIAL PROCEDURES,207,OTHER CIRCULATORY SYSTEM DIAGNOSES,05,DISEASES AND DISORDERS OF THE CIRCULATORY SYSTEM,4,Extreme,Extreme,Medical,Private Health Insurance,Medicare,,,,true,102382.17,28073.2
New York City,Manhattan,7002053,001463,NYU Langone Hospitals,50 to 69,112,M,Other Race,Not Span/Hispanic,3,Emergency,Home w/ Home Health Services,2019,CIR031,HYPOTENSION,OTR004,ISOLATION PROCEDURES,207,OTHER CIRCULATORY SYSTEM DIAGNOSES,05,DISEASES AND DISORDERS OF THE CIRCULATORY SYSTEM,3,Major,Moderate,Medical,Medicare,,,,,true,43141.2,12745.73
New York City,Manhattan,7002053,001463,NYU Langone Hospitals,30 to 49,OOS,F,Other Race,Spanish/Hispanic,3,Emergency,Home or Self Care,2019,CIR014,PULMONARY HEART DISEASE,ADM021,"ADMINISTRATION OF THERAPEUTIC SUBSTANCES, NEC",207,OTHER CIRCULATORY SYSTEM DIAGNOSES,05,DISEASES AND DISORDERS OF THE CIRCULATORY SYSTEM,2,Moderate,Major,Medical,Blue Cross/Blue Shield,,,,,false,46821.74,11796.86
New York City,Manhattan,7002053,001463,NYU Langone Hospitals,30 to 49,112,F,White,Not Span/Hispanic,2,Emergency,Skilled Nursing Home,2019,CIR031,HYPOTENSION,ESA003,MECHANICAL VENTILATION,207,OTHER CIRCULATORY SYSTEM DIAGNOSES,05,DISEASES AND DISORDERS OF THE CIRCULATORY SYSTEM,2,Moderate,Moderate,Medical,Medicare,Medicaid,,,,true,30995.12,8779.37
New York City,Manhattan,7002053,001463,NYU Langone Hospitals,70 or Older,100,M,Other Race,Spanish/Hispanic,2,Emergency,Home w/ Home Health Services,2019,INJ030,DRUG INDUCED OR TOXIC RELATED CONDITION,,,207,OTHER CIRCULATORY SYSTEM DIAGNOSES,05,DISEASES AND DISORDERS OF THE CIRCULATORY SYSTEM,3,Major,Major,Medical,Medicare,Medicaid,,,,true,27650.2,8298.12
New York City,Manhattan,7002053,001463,NYU Langone Hospitals,70 or Older,112,M,White,Not Span/Hispanic,6,Emergency,Home w/ Home Health Services,2019,CIR006,PERICARDITIS AND PERICARDIAL DISEASE,CAR017,PERICARDIAL PROCEDURES,207,OTHER CIRCULATORY SYSTEM DIAGNOSES,05,DISEASES AND DISORDERS OF THE CIRCULATORY SYSTEM,4,Extreme,Extreme,Medical,Medicare,Medicaid,,,,true,121053.03,31418.8