Hospital Service Area,Hospital County,Operating Certificate Number,Permanent Facility Id,Facility Name,Age Group,Zip Code - 3 digits,Gender,Race,Ethnicity,Length of Stay,Type of Admission,Patient Disposition,Discharge Year,CCS Diagnosis Code,CCS Diagnosis Description,CCS Procedure Code,CCS Procedure Description,APR DRG Code,APR DRG Description,APR MDC Code,APR MDC Description,APR Severity of Illness Code,APR Severity of Illness Description,APR Risk of Mortality,APR Medical Surgical Description,Payment Typology 1,Payment Typology 2,Payment Typology 3,Birth Weight,Abortion Edit Indicator,Emergency Department Indicator,Total Charges,Total Costs
Long Island,Suffolk,5123000,000885,Long Island Community Hospital,70 or Older,117,F,White,Not Span/Hispanic,1,Emergency,Left Against Medical Advice,2020,CIR006,PERICARDITIS AND PERICARDIAL DISEASE,,,207,OTHER CIRCULATORY SYSTEM DIAGNOSES,05,DISEASES AND DISORDERS OF THE CIRCULATORY SYSTEM,1,Minor,Minor,Medical,Medicare,Medicare,Private Health Insurance,,,Y,27537.72,3001.26
Long Island,Suffolk,5123000,000885,Long Island Community Hospital,70 or Older,117,F,White,Not Span/Hispanic,3,Emergency,Home w/ Home Health Services,2020,SYM012,CIRCULATORY SIGNS AND SYMPTOMS,,,207,OTHER CIRCULATORY SYSTEM DIAGNOSES,05,DISEASES AND DISORDERS OF THE CIRCULATORY SYSTEM,2,Moderate,Moderate,Medical,Medicare,Medicare,Blue Cross/Blue Shield,,,Y,42876.19,4684.23
Long Island,Suffolk,5123000,000885,Long Island Community Hospital,50 to 69,119,F,White,Not Span/Hispanic,1,Emergency,Home or Self Care,2020,CIR031,HYPOTENSION,,,207,OTHER CIRCULATORY SYSTEM DIAGNOSES,05,DISEASES AND DISORDERS OF THE CIRCULATORY SYSTEM,1,Minor,Minor,Medical,Blue Cross/Blue Shield,,,,,Y,30329.83,4200.68
Long Island,Suffolk,5123000,000885,Long Island Community Hospital,50 to 69,117,M,White,Not Span/Hispanic,20,Emergency,Expired,2020,CIR031,HYPOTENSION,ADM006,INFUSION OF VASOPRESSOR,207,OTHER CIRCULATORY SYSTEM DIAGNOSES,05,DISEASES AND DISORDERS OF THE CIRCULATORY SYSTEM,4,Extreme,Extreme,Medical,Private Health Insurance,Medicaid,,,,Y,212402.25,43981.61
Long Island,Suffolk,5123000,000885,Long Island Community Hospital,70 or Older,119,F,White,Not Span/Hispanic,6,Emergency,Skilled Nursing Home,2020,CIR015,OTHER AND ILL-DEFINED HEART DISEASE,RES003,THORACENTESIS (DIAGNOSTIC),207,OTHER CIRCULATORY SYSTEM DIAGNOSES,05,DISEASES AND DISORDERS OF THE CIRCULATORY SYSTEM,4,Extreme,Extreme,Medical,Medicare,Medicare,Private Health Insurance,,,Y,54587.46,9873.27
Long Island,Suffolk,5123000,000885,Long Island Community Hospital,30 to 49,117,M,Black/African American,Not Span/Hispanic,4,Emergency,Home or Self Care,2020,CIR006,PERICARDITIS AND PERICARDIAL DISEASE,,,207,OTHER CIRCULATORY SYSTEM DIAGNOSES,05,DISEASES AND DISORDERS OF THE CIRCULATORY SYSTEM,1,Minor,Minor,Medical,Medicare,Medicare,Medicaid,,,Y,30918.17,6152.86
Long Island,Suffolk,5123000,000885,Long Island Community Hospital,70 or Older,117,M,White,Not Span/Hispanic,3,Emergency,Home w/ Home Health Services,2020,CIR031,HYPOTENSION,,,207,OTHER CIRCULATORY SYSTEM DIAGNOSES,05,DISEASES AND DISORDERS OF THE CIRCULATORY SYSTEM,1,Minor,Moderate,Medical,Medicare,Medicare,Medicaid,,,Y,26809.69,5040.12
Long Island,Suffolk,5123000,000885,Long Island Community Hospital,50 to 69,119,F,White,Not Span/Hispanic,5,Elective,Home w/ Home Health Services,2020,CIR031,HYPOTENSION,,,207,OTHER CIRCULATORY SYSTEM DIAGNOSES,05,DISEASES AND DISORDERS OF THE CIRCULATORY SYSTEM,2,Moderate,Moderate,Medical,Medicare,,,,,N,29715.2,6505.36
Long Island,Suffolk,5123000,000885,Long Island Community Hospital,50 to 69,117,M,White,Not Span/Hispanic,3,Emergency,Short-term Hospital,2020,INJ010,"INTERNAL ORGAN INJURY, INITIAL ENCOUNTER",,,207,OTHER CIRCULATORY SYSTEM DIAGNOSES,05,DISEASES AND DISORDERS OF THE CIRCULATORY SYSTEM,2,Moderate,Moderate,Medical,Private Health Insurance,,,,,Y,55973.86,6791.5
Long Island,Suffolk,5123000,000885,Long Island Community Hospital,70 or Older,117,M,White,Not Span/Hispanic,2,Emergency,Home or Self Care,2020,CIR031,HYPOTENSION,,,207,OTHER CIRCULATORY SYSTEM DIAGNOSES,05,DISEASES AND DISORDERS OF THE CIRCULATORY SYSTEM,2,Moderate,Major,Medical,Medicare,Medicare,Blue Cross/Blue Shield,,,Y,43518.07,5778.14
Long Island,Suffolk,5123000,000885,Long Island Community Hospital,50 to 69,119,M,White,Not Span/Hispanic,3,Emergency,Short-term Hospital,2020,CIR014,PULMONARY HEART DISEASE,ESA004,NON-INVASIVE VENTILATION,207,OTHER CIRCULATORY SYSTEM DIAGNOSES,05,DISEASES AND DISORDERS OF THE CIRCULATORY SYSTEM,4,Extreme,Extreme,Medical,Medicare,Medicare,,,,Y,57737.75,6699.57
Long Island,Suffolk,5123000,000885,Long Island Community Hospital,50 to 69,117,F,White,Not Span/Hispanic,55,Urgent,Skilled Nursing Home,2020,CIR031,HYPOTENSION,,,207,OTHER CIRCULATORY SYSTEM DIAGNOSES,05,DISEASES AND DISORDERS OF THE CIRCULATORY SYSTEM,1,Minor,Minor,Medical,Medicare,Medicare,Medicaid,,,N,240309,67140.77
Long Island,Suffolk,5123000,000885,Long Island Community Hospital,30 to 49,117,M,White,Not Span/Hispanic,1,Urgent,Home or Self Care,2020,SYM012,CIRCULATORY SIGNS AND SYMPTOMS,,,207,OTHER CIRCULATORY SYSTEM DIAGNOSES,05,DISEASES AND DISORDERS OF THE CIRCULATORY SYSTEM,1,Minor,Minor,Medical,Medicaid,,,,,N,6049.62,1396.48
Long Island,Suffolk,5123000,000885,Long Island Community Hospital,50 to 69,117,M,White,Not Span/Hispanic,19,Emergency,Skilled Nursing Home,2020,CIR031,HYPOTENSION,ADM003,ADMINISTRATION OF ALBUMIN AND GLOBULIN,207,OTHER CIRCULATORY SYSTEM DIAGNOSES,05,DISEASES AND DISORDERS OF THE CIRCULATORY SYSTEM,3,Major,Major,Medical,Private Health Insurance,Medicaid,,,,Y,166696.76,35136.88
Long Island,Suffolk,5123000,000885,Long Island Community Hospital,50 to 69,117,F,White,Not Span/Hispanic,1,Emergency,Home or Self Care,2020,INJ010,"INTERNAL ORGAN INJURY, INITIAL ENCOUNTER",,,207,OTHER CIRCULATORY SYSTEM DIAGNOSES,05,DISEASES AND DISORDERS OF THE CIRCULATORY SYSTEM,1,Minor,Minor,Medical,Private Health Insurance,Medicare,Medicare,,,Y,40311.62,3263.54
Long Island,Suffolk,5123000,000885,Long Island Community Hospital,50 to 69,117,F,White,Not Span/Hispanic,5,Emergency,Home or Self Care,2020,INJ030,DRUG INDUCED OR TOXIC RELATED CONDITION,CAR024,VENOUS AND ARTERIAL CATHETER PLACEMENT,207,OTHER CIRCULATORY SYSTEM DIAGNOSES,05,DISEASES AND DISORDERS OF THE CIRCULATORY SYSTEM,1,Minor,Major,Medical,Medicare,Medicare,Medicaid,,,Y,94940.02,10129.2
Long Island,Suffolk,5123000,000885,Long Island Community Hospital,70 or Older,117,M,White,Not Span/Hispanic,17,Emergency,Skilled Nursing Home,2020,CIR006,PERICARDITIS AND PERICARDIAL DISEASE,CAR017,PERICARDIAL PROCEDURES,207,OTHER CIRCULATORY SYSTEM DIAGNOSES,05,DISEASES AND DISORDERS OF THE CIRCULATORY SYSTEM,4,Extreme,Extreme,Medical,Medicare,Medicare,Blue Cross/Blue Shield,,,Y,228517.42,43015.7
Long Island,Suffolk,5123000,000885,Long Island Community Hospital,70 or Older,119,F,Other Race,Not Span/Hispanic,1,Emergency,Short-term Hospital,2020,CIR006,PERICARDITIS AND PERICARDIAL DISEASE,ESA004,NON-INVASIVE VENTILATION,207,OTHER CIRCULATORY SYSTEM DIAGNOSES,05,DISEASES AND DISORDERS OF THE CIRCULATORY SYSTEM,3,Major,Extreme,Medical,Medicare,Blue Cross/Blue Shield,,,,Y,18866.22,3149.83
Long Island,Suffolk,5123000,000885,Long Island Community Hospital,50 to 69,117,F,Other Race,Not Span/Hispanic,6,Emergency,Home or Self Care,2020,CIR006,PERICARDITIS AND PERICARDIAL DISEASE,CAR017,PERICARDIAL PROCEDURES,207,OTHER CIRCULATORY SYSTEM DIAGNOSES,05,DISEASES AND DISORDERS OF THE CIRCULATORY SYSTEM,3,Major,Major,Medical,Private Health Insurance,,,,,Y,69768.71,13352.76
Long Island,Suffolk,5123000,000885,Long Island Community Hospital,70 or Older,119,F,Other Race,Not Span/Hispanic,3,Emergency,Skilled Nursing Home,2020,INJ030,DRUG INDUCED OR TOXIC RELATED CONDITION,,,207,OTHER CIRCULATORY SYSTEM DIAGNOSES,05,DISEASES AND DISORDERS OF THE CIRCULATORY SYSTEM,1,Minor,Moderate,Medical,Medicare,Medicare,Medicaid,,,Y,24332.51,4912.69
Long Island,Suffolk,5123000,000885,Long Island Community Hospital,30 to 49,117,M,White,Not Span/Hispanic,1,Emergency,Home or Self Care,2020,SYM012,CIRCULATORY SIGNS AND SYMPTOMS,GIS004,GI SYSTEM ENDOSCOPY WITHOUT BIOPSY (DIAGNOSTIC),207,OTHER CIRCULATORY SYSTEM DIAGNOSES,05,DISEASES AND DISORDERS OF THE CIRCULATORY SYSTEM,2,Moderate,Minor,Medical,Private Health Insurance,Medicaid,,,,Y,18614.26,4287.3
Long Island,Suffolk,5123000,000885,Long Island Community Hospital,70 or Older,117,M,White,Not Span/Hispanic,3,Emergency,Home or Self Care,2020,INJ030,DRUG INDUCED OR TOXIC RELATED CONDITION,,,207,OTHER CIRCULATORY SYSTEM DIAGNOSES,05,DISEASES AND DISORDERS OF THE CIRCULATORY SYSTEM,1,Minor,Moderate,Medical,Medicare,Medicare,Private Health Insurance,,,Y,23359.5,4686.36
Long Island,Suffolk,5123000,000885,Long Island Community Hospital,70 or Older,117,F,Black/African American,Not Span/Hispanic,1,Emergency,Home or Self Care,2020,SYM017,ABNORMAL FINDINGS WITHOUT DIAGNOSIS,,,207,OTHER CIRCULATORY SYSTEM DIAGNOSES,05,DISEASES AND DISORDERS OF THE CIRCULATORY SYSTEM,1,Minor,Moderate,Medical,Medicare,Medicare,Blue Cross/Blue Shield,,,Y,24598.88,3278.73
Long Island,Suffolk,5123000,000885,Long Island Community Hospital,70 or Older,117,M,Other Race,Not Span/Hispanic,4,Emergency,Home or Self Care,2020,CIR031,HYPOTENSION,,,207,OTHER CIRCULATORY SYSTEM DIAGNOSES,05,DISEASES AND DISORDERS OF THE CIRCULATORY SYSTEM,1,Minor,Minor,Medical,Medicare,,,,,Y,35107.08,5926.7
Long Island,Suffolk,5123000,000885,Long Island Community Hospital,70 or Older,117,M,White,Not Span/Hispanic,1,Emergency,Home or Self Care,2020,CIR031,HYPOTENSION,,,207,OTHER CIRCULATORY SYSTEM DIAGNOSES,05,DISEASES AND DISORDERS OF THE CIRCULATORY SYSTEM,1,Minor,Moderate,Medical,Medicare,Medicare,Private Health Insurance,,,Y,37305.83,2386
Long Island,Suffolk,5123000,000885,Long Island Community Hospital,50 to 69,119,M,White,Not Span/Hispanic,8,Emergency,Skilled Nursing Home,2020,CIR006,PERICARDITIS AND PERICARDIAL DISEASE,ESA001,HEMODIALYSIS,207,OTHER CIRCULATORY SYSTEM DIAGNOSES,05,DISEASES AND DISORDERS OF THE CIRCULATORY SYSTEM,3,Major,Major,Medical,Medicare,Medicare,Medicaid,,,Y,94076.75,16022.41
Long Island,Suffolk,5123000,000885,Long Island Community Hospital,70 or Older,119,F,White,Not Span/Hispanic,2,Emergency,Home w/ Home Health Services,2020,INJ030,DRUG INDUCED OR TOXIC RELATED CONDITION,,,207,OTHER CIRCULATORY SYSTEM DIAGNOSES,05,DISEASES AND DISORDERS OF THE CIRCULATORY SYSTEM,1,Minor,Moderate,Medical,Medicare,Medicare,Private Health Insurance,,,Y,24357.93,4269.64
