Hospital Service Area,Hospital County,Operating Certificate Number,Permanent Facility Id,Facility Name,Age Group,Zip Code - 3 digits,Gender,Race,Ethnicity,Length of Stay,Type of Admission,Patient Disposition,Discharge Year,CCS Diagnosis Code,CCS Diagnosis Description,CCS Procedure Code,CCS Procedure Description,APR DRG Code,APR DRG Description,APR MDC Code,APR MDC Description,APR Severity of Illness Code,APR Severity of Illness Description,APR Risk of Mortality,APR Medical Surgical Description,Payment Typology 1,Payment Typology 2,Payment Typology 3,Birth Weight,Abortion Edit Indicator,Emergency Department Indicator,Total Charges,Total Costs
New York City,Manhattan,7002017,001450,Lenox Hill Hospital,18 to 29,112,M,White,Not Span/Hispanic,17,Elective,Home or Self Care,2019,NEO056,ENDOCRINE SYSTEM CANCERS - ALL OTHER TYPES,CNS005,VENTRICULOSTOMY [PERCUTANEOUS APPROACH],021,CRANIOTOMY EXCEPT FOR TRAUMA,01,DISEASES AND DISORDERS OF THE NERVOUS SYSTEM,4,Extreme,Major,Surgical,Medicaid,,,,,false,436446.82,152311.45
New York City,Manhattan,7002001,001438,Bellevue Hospital Center,50 to 69,112,F,Black/African American,Not Span/Hispanic,12,Emergency,Expired,2019,NEO070,SECONDARY MALIGNANCIES,CNS010,CEREBROSPINAL FLUID SHUNT PROCEDURES,021,CRANIOTOMY EXCEPT FOR TRAUMA,01,DISEASES AND DISORDERS OF THE NERVOUS SYSTEM,4,Extreme,Extreme,Surgical,Private Health Insurance,,,,,false,85970.32,57135.87
Long Island,Suffolk,5151001,000245,Stony Brook University Hospital,70 or Older,117,M,White,Not Span/Hispanic,37,Emergency,Inpatient Rehabilitation Facility,2019,NVS009,EPILEPSY; CONVULSIONS,MST029,"MUSCULOSKELETAL DEVICE PROCEDURES, NEC",021,CRANIOTOMY EXCEPT FOR TRAUMA,01,DISEASES AND DISORDERS OF THE NERVOUS SYSTEM,4,Extreme,Extreme,Surgical,Medicare,Private Health Insurance,,,,true,651281.07,202109.13
New York City,Manhattan,7002053,001463,NYU Langone Hospitals,50 to 69,112,M,Black/African American,Not Span/Hispanic,14,Emergency,Inpatient Rehabilitation Facility,2019,CIR020,CEREBRAL INFARCTION,CAR014,PERIPHERAL ARTERIAL BYPASS PROCEDURES,021,CRANIOTOMY EXCEPT FOR TRAUMA,01,DISEASES AND DISORDERS OF THE NERVOUS SYSTEM,3,Major,Major,Surgical,Medicaid,,,,,false,370129.46,94313.82
New York City,Manhattan,7002053,001463,NYU Langone Hospitals,30 to 49,113,F,Multi-racial,Spanish/Hispanic,5,Emergency,Home or Self Care,2019,NVS009,EPILEPSY; CONVULSIONS,MAM012,ICP AND OTHER CNS MONITORING (EXCLUDING EEG),021,CRANIOTOMY EXCEPT FOR TRAUMA,01,DISEASES AND DISORDERS OF THE NERVOUS SYSTEM,2,Moderate,Minor,Surgical,Medicare,Medicaid,,,,true,460129.51,72931.43
New York City,Manhattan,7002054,001458,New York-Presbyterian Hospital - New York Weill Cornell Center,50 to 69,112,F,White,Not Span/Hispanic,4,Elective,Home or Self Care,2019,NEO073,BENIGN NEOPLASMS,CNS001,MINIMALLY INVASIVE CNS BIOPSY,021,CRANIOTOMY EXCEPT FOR TRAUMA,01,DISEASES AND DISORDERS OF THE NERVOUS SYSTEM,2,Moderate,Moderate,Surgical,Medicare,Self-Pay,,,,false,173276.79,59355.91
New York City,Manhattan,7002054,001458,New York-Presbyterian Hospital - New York Weill Cornell Center,30 to 49,OOS,F,Black/African American,Not Span/Hispanic,2,Elective,Home or Self Care,2019,NVS020,OTHER SPECIFIED NERVOUS SYSTEM DISORDERS,CNS009,DECOMPRESSIVE CRANIECTOMY,021,CRANIOTOMY EXCEPT FOR TRAUMA,01,DISEASES AND DISORDERS OF THE NERVOUS SYSTEM,1,Minor,Minor,Surgical,Blue Cross/Blue Shield,Self-Pay,,,,false,60693.89,21585.59
New York City,Kings,7002053,001304,NYU Langone Hospital-Brooklyn,50 to 69,112,M,Other Race,Not Span/Hispanic,5,Emergency,Skilled Nursing Home,2019,CIR021,ACUTE HEMORRHAGIC CEREBROVASCULAR DISEASE,CNS004,INTRACRANIAL EPIDURAL AND SUBDURAL SPACE DRAINAGE,021,CRANIOTOMY EXCEPT FOR TRAUMA,01,DISEASES AND DISORDERS OF THE NERVOUS SYSTEM,3,Major,Major,Surgical,Medicare,,,,,true,205066.6,49047.78
New York City,Manhattan,7002054,001458,New York-Presbyterian Hospital - New York Weill Cornell Center,50 to 69,114,F,Other Race,Spanish/Hispanic,19,Emergency,Skilled Nursing Home,2019,CIR021,ACUTE HEMORRHAGIC CEREBROVASCULAR DISEASE,CNS005,VENTRICULOSTOMY [PERCUTANEOUS APPROACH],021,CRANIOTOMY EXCEPT FOR TRAUMA,01,DISEASES AND DISORDERS OF THE NERVOUS SYSTEM,4,Extreme,Extreme,Surgical,Medicare,Medicaid,Self-Pay,,,false,489324.39,208201.22
New York City,Manhattan,7002053,001463,NYU Langone Hospitals,70 or Older,112,F,White,Not Span/Hispanic,4,Elective,Home w/ Home Health Services,2019,CIR024,OTHER AND ILL-DEFINED CEREBROVASCULAR DISEASE,CAR010,LIGATION AND EMBOLIZATION OF VESSELS,021,CRANIOTOMY EXCEPT FOR TRAUMA,01,DISEASES AND DISORDERS OF THE NERVOUS SYSTEM,2,Moderate,Moderate,Surgical,Medicare,Medicaid,,,,false,211030.47,46813.13
New York City,Manhattan,7002054,001458,New York-Presbyterian Hospital - New York Weill Cornell Center,50 to 69,112,F,White,Not Span/Hispanic,8,Elective,Inpatient Rehabilitation Facility,2019,NEO073,BENIGN NEOPLASMS,CNS007,CNS EXCISION PROCEDURES,021,CRANIOTOMY EXCEPT FOR TRAUMA,01,DISEASES AND DISORDERS OF THE NERVOUS SYSTEM,3,Major,Major,Surgical,"Managed Care, Unspecified",Medicaid,Self-Pay,,,false,264989.28,112385.13
New York City,Manhattan,7002001,001438,Bellevue Hospital Center,70 or Older,112,F,Other Race,Not Span/Hispanic,17,Emergency,Inpatient Rehabilitation Facility,2019,CIR021,ACUTE HEMORRHAGIC CEREBROVASCULAR DISEASE,CNS005,VENTRICULOSTOMY [PERCUTANEOUS APPROACH],021,CRANIOTOMY EXCEPT FOR TRAUMA,01,DISEASES AND DISORDERS OF THE NERVOUS SYSTEM,4,Extreme,Major,Surgical,Medicaid,Medicaid,,,,false,125475.8,83391.22
New York City,Manhattan,7002054,001458,New York-Presbyterian Hospital - New York Weill Cornell Center,50 to 69,OOS,M,Other Race,Not Span/Hispanic,3,Elective,Home or Self Care,2019,NEO073,BENIGN NEOPLASMS,CNS007,CNS EXCISION PROCEDURES,021,CRANIOTOMY EXCEPT FOR TRAUMA,01,DISEASES AND DISORDERS OF THE NERVOUS SYSTEM,2,Moderate,Minor,Surgical,Blue Cross/Blue Shield,Self-Pay,,,,false,132441.36,52679.57
New York City,Manhattan,7002001,001438,Bellevue Hospital Center,18 to 29,113,F,Other Race,Spanish/Hispanic,4,Elective,Home or Self Care,2019,NVS020,OTHER SPECIFIED NERVOUS SYSTEM DISORDERS,CNS009,DECOMPRESSIVE CRANIECTOMY,021,CRANIOTOMY EXCEPT FOR TRAUMA,01,DISEASES AND DISORDERS OF THE NERVOUS SYSTEM,2,Moderate,Minor,Surgical,Medicaid,Medicaid,,,,false,27193.71,18072.94
New York City,Richmond,7004003,001740,Staten Island University Hosp-North,50 to 69,103,F,White,Not Span/Hispanic,15,Emergency,Inpatient Rehabilitation Facility,2019,NEO070,SECONDARY MALIGNANCIES,CNS007,CNS EXCISION PROCEDURES,021,CRANIOTOMY EXCEPT FOR TRAUMA,01,DISEASES AND DISORDERS OF THE NERVOUS SYSTEM,3,Major,Major,Surgical,Medicare,Medicare,,,,true,166706.11,43176.39
New York City,Manhattan,7002054,001458,New York-Presbyterian Hospital - New York Weill Cornell Center,30 to 49,110,M,Other Race,Not Span/Hispanic,5,Elective,Home or Self Care,2019,NEO048,NERVOUS SYSTEM CANCERS - BRAIN,CNS007,CNS EXCISION PROCEDURES,021,CRANIOTOMY EXCEPT FOR TRAUMA,01,DISEASES AND DISORDERS OF THE NERVOUS SYSTEM,2,Moderate,Minor,Surgical,Private Health Insurance,Self-Pay,,,,false,159785.7,62443.58
New York City,Manhattan,7002024,001456,Mount Sinai Hospital,50 to 69,112,F,Other Race,Not Span/Hispanic,2,Elective,Home w/ Home Health Services,2019,MAL004,NERVOUS SYSTEM CONGENITAL ANOMALIES,CNS011,MENINGES REPAIR,021,CRANIOTOMY EXCEPT FOR TRAUMA,01,DISEASES AND DISORDERS OF THE NERVOUS SYSTEM,2,Moderate,Minor,Surgical,Medicaid,Self-Pay,,,,false,86496.79,26853.55
Hudson Valley,Westchester,5902001,001045,White Plains Hospital Center,50 to 69,OOS,F,Other Race,Not Span/Hispanic,3,Elective,Home or Self Care,2019,NVS017,NERVE AND NERVE ROOT DISORDERS,CNS014,"CNS PROCEDURES, NEC",021,CRANIOTOMY EXCEPT FOR TRAUMA,01,DISEASES AND DISORDERS OF THE NERVOUS SYSTEM,1,Minor,Minor,Surgical,Private Health Insurance,,,,,false,77879,13777.13
Western NY,Erie,1404000,000267,Kenmore Mercy Hospital,30 to 49,141,F,White,Not Span/Hispanic,2,Elective,Home or Self Care,2019,NEO048,NERVOUS SYSTEM CANCERS - BRAIN,CNS007,CNS EXCISION PROCEDURES,021,CRANIOTOMY EXCEPT FOR TRAUMA,01,DISEASES AND DISORDERS OF THE NERVOUS SYSTEM,2,Moderate,Minor,Surgical,Medicaid,,,,,false,26418.77,11447.39
New York City,Manhattan,7002053,001463,NYU Langone Hospitals,50 to 69,119,F,White,Not Span/Hispanic,9,Elective,Home or Self Care,2019,NVS009,EPILEPSY; CONVULSIONS,CNS014,"CNS PROCEDURES, NEC",021,CRANIOTOMY EXCEPT FOR TRAUMA,01,DISEASES AND DISORDERS OF THE NERVOUS SYSTEM,2,Moderate,Minor,Surgical,Private Health Insurance,,,,,false,602673.9,92455.63
Central NY,Oneida,3202003,000599,Faxton-St Lukes Healthcare St Lukes Division,50 to 69,135,M,Black/African American,Not Span/Hispanic,16,Emergency,Psychiatric Hospital or Unit of Hosp,2019,CIR021,ACUTE HEMORRHAGIC CEREBROVASCULAR DISEASE,CNS004,INTRACRANIAL EPIDURAL AND SUBDURAL SPACE DRAINAGE,021,CRANIOTOMY EXCEPT FOR TRAUMA,01,DISEASES AND DISORDERS OF THE NERVOUS SYSTEM,4,Extreme,Extreme,Surgical,Medicare,Medicaid,,,,true,141434.04,35175.05
New York City,Manhattan,7002053,001463,NYU Langone Hospitals,50 to 69,112,M,White,Unknown,8,Emergency,Home or Self Care,2019,NEO048,NERVOUS SYSTEM CANCERS - BRAIN,CNS007,CNS EXCISION PROCEDURES,021,CRANIOTOMY EXCEPT FOR TRAUMA,01,DISEASES AND DISORDERS OF THE NERVOUS SYSTEM,4,Extreme,Major,Surgical,Private Health Insurance,,,,,false,367310.74,72950.76
Capital/Adirond,Albany,0101000,000001,Albany Medical Center Hospital,30 to 49,120,F,White,Not Span/Hispanic,6,Elective,Home or Self Care,2019,NEO073,BENIGN NEOPLASMS,CNS007,CNS EXCISION PROCEDURES,021,CRANIOTOMY EXCEPT FOR TRAUMA,01,DISEASES AND DISORDERS OF THE NERVOUS SYSTEM,1,Minor,Moderate,Surgical,"Managed Care, Unspecified",,,,,false,77046.13,31243.5
Capital/Adirond,Albany,0101000,000001,Albany Medical Center Hospital,30 to 49,OOS,F,White,Not Span/Hispanic,1,Elective,Home or Self Care,2019,NVS006,OTHER SPECIFIED HEREDITARY AND DEGENERATIVE NERVOUS SYSTEM CONDITIONS,CNS012,CNS NEUROSTIMULATOR PROCEDURES,021,CRANIOTOMY EXCEPT FOR TRAUMA,01,DISEASES AND DISORDERS OF THE NERVOUS SYSTEM,1,Minor,Minor,Surgical,Private Health Insurance,,,,,false,48279,24881.6
Capital/Adirond,Albany,0101000,000001,Albany Medical Center Hospital,30 to 49,124,F,White,Not Span/Hispanic,4,Elective,Home w/ Home Health Services,2019,CIR024,OTHER AND ILL-DEFINED CEREBROVASCULAR DISEASE,CAR010,LIGATION AND EMBOLIZATION OF VESSELS,021,CRANIOTOMY EXCEPT FOR TRAUMA,01,DISEASES AND DISORDERS OF THE NERVOUS SYSTEM,2,Moderate,Minor,Surgical,"Managed Care, Unspecified",,,,,false,54069.89,20705.03
Hudson Valley,Westchester,5932000,001129,Phelps Hospital,70 or Older,105,F,White,Not Span/Hispanic,6,Emergency,Home w/ Home Health Services,2019,NEO048,NERVOUS SYSTEM CANCERS - BRAIN,CNS007,CNS EXCISION PROCEDURES,021,CRANIOTOMY EXCEPT FOR TRAUMA,01,DISEASES AND DISORDERS OF THE NERVOUS SYSTEM,2,Moderate,Moderate,Surgical,Medicare,Blue Cross/Blue Shield,,,,true,144546.43,23537.27
Hudson Valley,Dutchess,1302001,000181,Vassar Brothers Medical Center,70 or Older,125,M,White,Not Span/Hispanic,10,Emergency,Skilled Nursing Home,2019,INJ073,"INJURY, SEQUELA",CNS004,INTRACRANIAL EPIDURAL AND SUBDURAL SPACE DRAINAGE,021,CRANIOTOMY EXCEPT FOR TRAUMA,01,DISEASES AND DISORDERS OF THE NERVOUS SYSTEM,3,Major,Major,Surgical,Medicare,Federal/State/Local/VA,,,,true,86559.48,33447.46
New York City,Bronx,7000008,001172,Lincoln Medical & Mental Health Center,70 or Older,104,F,Other Race,Spanish/Hispanic,1,Emergency,Short-term Hospital,2019,CIR021,ACUTE HEMORRHAGIC CEREBROVASCULAR DISEASE,CNS005,VENTRICULOSTOMY [PERCUTANEOUS APPROACH],021,CRANIOTOMY EXCEPT FOR TRAUMA,01,DISEASES AND DISORDERS OF THE NERVOUS SYSTEM,3,Major,Major,Surgical,Medicare,Medicare,Medicaid,,,true,11611.1,6857.02
New York City,Manhattan,7002032,001466,Mount Sinai West,18 to 29,112,M,Other Race,Spanish/Hispanic,8,Elective,Home or Self Care,2019,NVS009,EPILEPSY; CONVULSIONS,CNS014,"CNS PROCEDURES, NEC",021,CRANIOTOMY EXCEPT FOR TRAUMA,01,DISEASES AND DISORDERS OF THE NERVOUS SYSTEM,2,Moderate,Moderate,Surgical,Medicaid,Medicaid,Self-Pay,,,false,245070.1,77810.92
New York City,Manhattan,7002054,001458,New York-Presbyterian Hospital - New York Weill Cornell Center,70 or Older,100,F,White,Not Span/Hispanic,3,Emergency,Home w/ Home Health Services,2019,NEO070,SECONDARY MALIGNANCIES,CNS007,CNS EXCISION PROCEDURES,021,CRANIOTOMY EXCEPT FOR TRAUMA,01,DISEASES AND DISORDERS OF THE NERVOUS SYSTEM,3,Major,Major,Surgical,Medicare,Private Health Insurance,Self-Pay,,,true,111844.95,35333.52
New York City,Manhattan,7002054,001458,New York-Presbyterian Hospital - New York Weill Cornell Center,30 to 49,100,M,White,Not Span/Hispanic,7,Emergency,Home or Self Care,2019,NEO048,NERVOUS SYSTEM CANCERS - BRAIN,CNS007,CNS EXCISION PROCEDURES,021,CRANIOTOMY EXCEPT FOR TRAUMA,01,DISEASES AND DISORDERS OF THE NERVOUS SYSTEM,4,Extreme,Major,Surgical,Blue Cross/Blue Shield,Self-Pay,,,,true,173589.57,65132.29
Western NY,Erie,1401014,000208,John R. Oishei Children's Hospital,0 to 17,142,M,White,Not Span/Hispanic,10,Emergency,Home w/ Home Health Services,2019,NEO048,NERVOUS SYSTEM CANCERS - BRAIN,CNS007,CNS EXCISION PROCEDURES,021,CRANIOTOMY EXCEPT FOR TRAUMA,01,DISEASES AND DISORDERS OF THE NERVOUS SYSTEM,2,Moderate,Minor,Surgical,Blue Cross/Blue Shield,Self-Pay,,,,true,169526.92,65881.64
Western NY,Erie,1401014,000208,John R. Oishei Children's Hospital,18 to 29,140,F,White,Not Span/Hispanic,7,Urgent,Home or Self Care,2019,NVS009,EPILEPSY; CONVULSIONS,MAM011,ELECTROENCEPHALOGRAM (EEG),021,CRANIOTOMY EXCEPT FOR TRAUMA,01,DISEASES AND DISORDERS OF THE NERVOUS SYSTEM,2,Moderate,Minor,Surgical,Private Health Insurance,Self-Pay,,,,false,42746.71,21191.24
Southern Tier,Broome,0303001,000058,United Health Services Hospitals Inc. - Wilson Medical Center,50 to 69,137,F,White,Not Span/Hispanic,12,Emergency,Inpatient Rehabilitation Facility,2019,CIR021,ACUTE HEMORRHAGIC CEREBROVASCULAR DISEASE,CNS009,DECOMPRESSIVE CRANIECTOMY,021,CRANIOTOMY EXCEPT FOR TRAUMA,01,DISEASES AND DISORDERS OF THE NERVOUS SYSTEM,4,Extreme,Extreme,Surgical,Medicaid,,,,,true,89846.14,38994.99
New York City,Manhattan,7002054,001458,New York-Presbyterian Hospital - New York Weill Cornell Center,18 to 29,104,F,Other Race,Not Span/Hispanic,7,Elective,Skilled Nursing Home,2019,NVS020,OTHER SPECIFIED NERVOUS SYSTEM DISORDERS,CNS007,CNS EXCISION PROCEDURES,021,CRANIOTOMY EXCEPT FOR TRAUMA,01,DISEASES AND DISORDERS OF THE NERVOUS SYSTEM,1,Minor,Minor,Surgical,"Managed Care, Unspecified",Medicaid,Self-Pay,,,false,165618.38,73552.9
New York City,Manhattan,7002054,001458,New York-Presbyterian Hospital - New York Weill Cornell Center,30 to 49,100,M,White,Not Span/Hispanic,35,Emergency,Inpatient Rehabilitation Facility,2019,CIR020,CEREBRAL INFARCTION,CNS009,DECOMPRESSIVE CRANIECTOMY,021,CRANIOTOMY EXCEPT FOR TRAUMA,01,DISEASES AND DISORDERS OF THE NERVOUS SYSTEM,3,Major,Major,Surgical,Private Health Insurance,Self-Pay,,,,false,1035289.84,468167.95
New York City,Manhattan,7002054,001458,New York-Presbyterian Hospital - New York Weill Cornell Center,70 or Older,100,F,White,Not Span/Hispanic,10,Emergency,Expired,2019,CIR021,ACUTE HEMORRHAGIC CEREBROVASCULAR DISEASE,ESA003,MECHANICAL VENTILATION,021,CRANIOTOMY EXCEPT FOR TRAUMA,01,DISEASES AND DISORDERS OF THE NERVOUS SYSTEM,4,Extreme,Extreme,Surgical,Medicare,Private Health Insurance,Self-Pay,,,true,390291.83,167921.58
New York City,Manhattan,7002054,001458,New York-Presbyterian Hospital - New York Weill Cornell Center,70 or Older,110,M,Other Race,Not Span/Hispanic,22,Elective,Inpatient Rehabilitation Facility,2019,NEO048,NERVOUS SYSTEM CANCERS - BRAIN,CNS007,CNS EXCISION PROCEDURES,021,CRANIOTOMY EXCEPT FOR TRAUMA,01,DISEASES AND DISORDERS OF THE NERVOUS SYSTEM,4,Extreme,Extreme,Surgical,Medicare,Private Health Insurance,Self-Pay,,,false,745051.67,318348.08
New York City,Manhattan,7002054,001458,New York-Presbyterian Hospital - New York Weill Cornell Center,30 to 49,113,F,Other Race,Not Span/Hispanic,3,Emergency,Home or Self Care,2019,CIR021,ACUTE HEMORRHAGIC CEREBROVASCULAR DISEASE,CAR011,ANEURYSM REPAIR PROCEDURES,021,CRANIOTOMY EXCEPT FOR TRAUMA,01,DISEASES AND DISORDERS OF THE NERVOUS SYSTEM,3,Major,Minor,Surgical,Private Health Insurance,Self-Pay,,,,true,117029.08,55368.01
New York City,Kings,7001020,001305,Maimonides Medical Center,70 or Older,112,M,Other Race,Not Span/Hispanic,4,Emergency,Skilled Nursing Home,2019,CIR021,ACUTE HEMORRHAGIC CEREBROVASCULAR DISEASE,CNS004,INTRACRANIAL EPIDURAL AND SUBDURAL SPACE DRAINAGE,021,CRANIOTOMY EXCEPT FOR TRAUMA,01,DISEASES AND DISORDERS OF THE NERVOUS SYSTEM,4,Extreme,Extreme,Surgical,Medicare,Medicare,Medicaid,,,true,70745.08,15467.25
New York City,Manhattan,7002054,001458,New York-Presbyterian Hospital - New York Weill Cornell Center,18 to 29,OOS,F,White,Not Span/Hispanic,6,Elective,Home or Self Care,2019,MAL004,NERVOUS SYSTEM CONGENITAL ANOMALIES,CNS008,SPINAL CORD DECOMPRESSION,021,CRANIOTOMY EXCEPT FOR TRAUMA,01,DISEASES AND DISORDERS OF THE NERVOUS SYSTEM,3,Major,Moderate,Surgical,Blue Cross/Blue Shield,Self-Pay,,,,false,158703.89,72984.09
Long Island,Suffolk,5154001,000925,Good Samaritan Hospital Medical Center,0 to 17,117,F,Other Race,Spanish/Hispanic,31,Emergency,Home or Self Care,2019,NVS001,MENINGITIS,CNS006,OTHER CNS DRAINAGE AND RELATED PROCEDURES,021,CRANIOTOMY EXCEPT FOR TRAUMA,01,DISEASES AND DISORDERS OF THE NERVOUS SYSTEM,4,Extreme,Major,Surgical,Medicaid,,,,,true,423843.85,141023.52
Long Island,Suffolk,5154001,000925,Good Samaritan Hospital Medical Center,50 to 69,117,F,White,Not Span/Hispanic,17,Emergency,Inpatient Rehabilitation Facility,2019,NEO048,NERVOUS SYSTEM CANCERS - BRAIN,CNS006,OTHER CNS DRAINAGE AND RELATED PROCEDURES,021,CRANIOTOMY EXCEPT FOR TRAUMA,01,DISEASES AND DISORDERS OF THE NERVOUS SYSTEM,4,Extreme,Extreme,Surgical,Private Health Insurance,,,,,true,237825.25,49842.35
New York City,Richmond,7004003,001740,Staten Island University Hosp-North,70 or Older,103,F,Other Race,Not Span/Hispanic,5,Elective,Inpatient Rehabilitation Facility,2019,NEO073,BENIGN NEOPLASMS,CNS007,CNS EXCISION PROCEDURES,021,CRANIOTOMY EXCEPT FOR TRAUMA,01,DISEASES AND DISORDERS OF THE NERVOUS SYSTEM,2,Moderate,Moderate,Surgical,Medicare,Medicare,Medicaid,,,false,66359.42,19111.49
New York City,Manhattan,7002053,001463,NYU Langone Hospitals,70 or Older,112,M,White,Not Span/Hispanic,1,Elective,Home or Self Care,2019,NEO073,BENIGN NEOPLASMS,CNS007,CNS EXCISION PROCEDURES,021,CRANIOTOMY EXCEPT FOR TRAUMA,01,DISEASES AND DISORDERS OF THE NERVOUS SYSTEM,4,Extreme,Major,Surgical,Medicare,Medicaid,,,,false,166638.25,27018.87
New York City,Manhattan,7002053,001463,NYU Langone Hospitals,0 to 17,OOS,F,White,Not Span/Hispanic,6,Elective,Home or Self Care,2019,NVS009,EPILEPSY; CONVULSIONS,MAM012,ICP AND OTHER CNS MONITORING (EXCLUDING EEG),021,CRANIOTOMY EXCEPT FOR TRAUMA,01,DISEASES AND DISORDERS OF THE NERVOUS SYSTEM,2,Moderate,Minor,Surgical,Private Health Insurance,,,,,false,212847.06,34824.41
New York City,Manhattan,7002053,001463,NYU Langone Hospitals,50 to 69,OOS,M,White,Not Span/Hispanic,5,Elective,Home w/ Home Health Services,2019,NEO048,NERVOUS SYSTEM CANCERS - BRAIN,CNS007,CNS EXCISION PROCEDURES,021,CRANIOTOMY EXCEPT FOR TRAUMA,01,DISEASES AND DISORDERS OF THE NERVOUS SYSTEM,2,Moderate,Moderate,Surgical,Medicare,Private Health Insurance,,,,false,250489.59,56628.44
New York City,Manhattan,7002053,001463,NYU Langone Hospitals,70 or Older,OOS,F,White,Not Span/Hispanic,3,Elective,Home or Self Care,2019,NEO073,BENIGN NEOPLASMS,CNS007,CNS EXCISION PROCEDURES,021,CRANIOTOMY EXCEPT FOR TRAUMA,01,DISEASES AND DISORDERS OF THE NERVOUS SYSTEM,3,Major,Major,Surgical,Medicare,Private Health Insurance,,,,false,228413.67,45642.26
New York City,Manhattan,7002053,001463,NYU Langone Hospitals,50 to 69,100,F,White,Not Span/Hispanic,4,Emergency,Inpatient Rehabilitation Facility,2019,NEO048,NERVOUS SYSTEM CANCERS - BRAIN,CNS007,CNS EXCISION PROCEDURES,021,CRANIOTOMY EXCEPT FOR TRAUMA,01,DISEASES AND DISORDERS OF THE NERVOUS SYSTEM,4,Extreme,Major,Surgical,Private Health Insurance,,,,,true,275003.02,55437.32
Western NY,Erie,1401005,000210,Erie County Medical Center,70 or Older,142,F,White,Not Span/Hispanic,10,Emergency,Expired,2019,CIR021,ACUTE HEMORRHAGIC CEREBROVASCULAR DISEASE,CNS006,OTHER CNS DRAINAGE AND RELATED PROCEDURES,021,CRANIOTOMY EXCEPT FOR TRAUMA,01,DISEASES AND DISORDERS OF THE NERVOUS SYSTEM,4,Extreme,Major,Surgical,Medicare,Medicare,,,,true,36889.47,22672.17
Central NY,Onondaga,3301007,000635,University Hospital SUNY Health Science Center,30 to 49,136,M,White,Not Span/Hispanic,30,Emergency,Skilled Nursing Home,2019,NVS014,CNS ABSCESS,CNS007,CNS EXCISION PROCEDURES,021,CRANIOTOMY EXCEPT FOR TRAUMA,01,DISEASES AND DISORDERS OF THE NERVOUS SYSTEM,4,Extreme,Extreme,Surgical,Medicare,Medicaid,,,,false,460428.3,123677.58
Western NY,Erie,1401005,000210,Erie County Medical Center,30 to 49,140,M,Other Race,Not Span/Hispanic,3,Elective,Court/Law Enforcement,2019,NEO073,BENIGN NEOPLASMS,CNS007,CNS EXCISION PROCEDURES,021,CRANIOTOMY EXCEPT FOR TRAUMA,01,DISEASES AND DISORDERS OF THE NERVOUS SYSTEM,2,Moderate,Minor,Surgical,Department of Corrections,,,,,false,16610.71,10554.47
Long Island,Nassau,2951001,000541,North Shore University Hospital,30 to 49,117,F,White,Not Span/Hispanic,29,Emergency,Inpatient Rehabilitation Facility,2019,CIR021,ACUTE HEMORRHAGIC CEREBROVASCULAR DISEASE,CAR010,LIGATION AND EMBOLIZATION OF VESSELS,021,CRANIOTOMY EXCEPT FOR TRAUMA,01,DISEASES AND DISORDERS OF THE NERVOUS SYSTEM,4,Extreme,Extreme,Surgical,Private Health Insurance,,,,,true,725957.29,168437.04
New York City,Manhattan,7002053,001463,NYU Langone Hospitals,70 or Older,117,F,White,Not Span/Hispanic,9,Elective,Inpatient Rehabilitation Facility,2019,NEO048,NERVOUS SYSTEM CANCERS - BRAIN,CNS007,CNS EXCISION PROCEDURES,021,CRANIOTOMY EXCEPT FOR TRAUMA,01,DISEASES AND DISORDERS OF THE NERVOUS SYSTEM,4,Extreme,Major,Surgical,Medicare,Blue Cross/Blue Shield,,,,false,318200.04,85990.02
Western NY,Erie,1401014,000208,John R. Oishei Children's Hospital,0 to 17,141,M,White,Not Span/Hispanic,4,Emergency,Home or Self Care,2019,NVS020,OTHER SPECIFIED NERVOUS SYSTEM DISORDERS,CNS010,CEREBROSPINAL FLUID SHUNT PROCEDURES,021,CRANIOTOMY EXCEPT FOR TRAUMA,01,DISEASES AND DISORDERS OF THE NERVOUS SYSTEM,1,Minor,Minor,Surgical,Blue Cross/Blue Shield,Self-Pay,,,,true,62736.53,23259.67
New York City,Manhattan,7002054,001458,New York-Presbyterian Hospital - New York Weill Cornell Center,18 to 29,104,F,Other Race,Not Span/Hispanic,2,Elective,Home or Self Care,2019,MAL004,NERVOUS SYSTEM CONGENITAL ANOMALIES,CNS010,CEREBROSPINAL FLUID SHUNT PROCEDURES,021,CRANIOTOMY EXCEPT FOR TRAUMA,01,DISEASES AND DISORDERS OF THE NERVOUS SYSTEM,3,Major,Moderate,Surgical,Private Health Insurance,Self-Pay,,,,false,73254.51,30084.49
Finger Lakes,Monroe,2701005,000413,Strong Memorial Hospital,50 to 69,145,F,White,Not Span/Hispanic,18,Emergency,Inpatient Rehabilitation Facility,2019,NEO073,BENIGN NEOPLASMS,CNS006,OTHER CNS DRAINAGE AND RELATED PROCEDURES,021,CRANIOTOMY EXCEPT FOR TRAUMA,01,DISEASES AND DISORDERS OF THE NERVOUS SYSTEM,4,Extreme,Extreme,Surgical,Private Health Insurance,Medicare,,,,true,132278.26,59104.41
Central NY,Oneida,3202003,000599,Faxton-St Lukes Healthcare St Lukes Division,50 to 69,135,F,White,Not Span/Hispanic,17,Emergency,Skilled Nursing Home,2019,NEO070,SECONDARY MALIGNANCIES,CNS007,CNS EXCISION PROCEDURES,021,CRANIOTOMY EXCEPT FOR TRAUMA,01,DISEASES AND DISORDERS OF THE NERVOUS SYSTEM,4,Extreme,Major,Surgical,Medicare,Federal/State/Local/VA,,,,true,201250.17,54715.13
Hudson Valley,Dutchess,5957001,000180,Mid-Hudson Valley Division of Westchester Medical Center,70 or Older,126,M,White,Not Span/Hispanic,4,Elective,Home or Self Care,2019,NVS020,OTHER SPECIFIED NERVOUS SYSTEM DISORDERS,CNS011,MENINGES REPAIR,021,CRANIOTOMY EXCEPT FOR TRAUMA,01,DISEASES AND DISORDERS OF THE NERVOUS SYSTEM,1,Minor,Minor,Surgical,Medicare,Blue Cross/Blue Shield,,,,false,52315.02,10530.93