Hospital Service Area,Hospital County,Operating Certificate Number,Permanent Facility Id,Facility Name,Age Group,Zip Code - 3 digits,Gender,Race,Ethnicity,Length of Stay,Type of Admission,Patient Disposition,Discharge Year,CCS Diagnosis Code,CCS Diagnosis Description,CCS Procedure Code,CCS Procedure Description,APR DRG Code,APR DRG Description,APR MDC Code,APR MDC Description,APR Severity of Illness Code,APR Severity of Illness Description,APR Risk of Mortality,APR Medical Surgical Description,Payment Typology 1,Payment Typology 2,Payment Typology 3,Birth Weight,Abortion Edit Indicator,Emergency Department Indicator,Total Charges,Total Costs
New York City,Manhattan,7002053,001463,NYU Langone Hospitals,50 to 69,112,M,Black/African American,Not Span/Hispanic,14,Emergency,Inpatient Rehabilitation Facility,2019,CIR020,CEREBRAL INFARCTION,CAR014,PERIPHERAL ARTERIAL BYPASS PROCEDURES,021,CRANIOTOMY EXCEPT FOR TRAUMA,01,DISEASES AND DISORDERS OF THE NERVOUS SYSTEM,3,Major,Major,Surgical,Medicaid,,,,,false,370129.46,94313.82
New York City,Manhattan,7002053,001463,NYU Langone Hospitals,30 to 49,113,F,Multi-racial,Spanish/Hispanic,5,Emergency,Home or Self Care,2019,NVS009,EPILEPSY; CONVULSIONS,MAM012,ICP AND OTHER CNS MONITORING (EXCLUDING EEG),021,CRANIOTOMY EXCEPT FOR TRAUMA,01,DISEASES AND DISORDERS OF THE NERVOUS SYSTEM,2,Moderate,Minor,Surgical,Medicare,Medicaid,,,,true,460129.51,72931.43
New York City,Manhattan,7002053,001463,NYU Langone Hospitals,70 or Older,112,F,White,Not Span/Hispanic,4,Elective,Home w/ Home Health Services,2019,CIR024,OTHER AND ILL-DEFINED CEREBROVASCULAR DISEASE,CAR010,LIGATION AND EMBOLIZATION OF VESSELS,021,CRANIOTOMY EXCEPT FOR TRAUMA,01,DISEASES AND DISORDERS OF THE NERVOUS SYSTEM,2,Moderate,Moderate,Surgical,Medicare,Medicaid,,,,false,211030.47,46813.13
New York City,Manhattan,7002053,001463,NYU Langone Hospitals,50 to 69,119,F,White,Not Span/Hispanic,9,Elective,Home or Self Care,2019,NVS009,EPILEPSY; CONVULSIONS,CNS014,"CNS PROCEDURES, NEC",021,CRANIOTOMY EXCEPT FOR TRAUMA,01,DISEASES AND DISORDERS OF THE NERVOUS SYSTEM,2,Moderate,Minor,Surgical,Private Health Insurance,,,,,false,602673.9,92455.63
New York City,Manhattan,7002053,001463,NYU Langone Hospitals,50 to 69,112,M,White,Unknown,8,Emergency,Home or Self Care,2019,NEO048,NERVOUS SYSTEM CANCERS - BRAIN,CNS007,CNS EXCISION PROCEDURES,021,CRANIOTOMY EXCEPT FOR TRAUMA,01,DISEASES AND DISORDERS OF THE NERVOUS SYSTEM,4,Extreme,Major,Surgical,Private Health Insurance,,,,,false,367310.74,72950.76
New York City,Manhattan,7002053,001463,NYU Langone Hospitals,70 or Older,112,M,White,Not Span/Hispanic,1,Elective,Home or Self Care,2019,NEO073,BENIGN NEOPLASMS,CNS007,CNS EXCISION PROCEDURES,021,CRANIOTOMY EXCEPT FOR TRAUMA,01,DISEASES AND DISORDERS OF THE NERVOUS SYSTEM,4,Extreme,Major,Surgical,Medicare,Medicaid,,,,false,166638.25,27018.87
New York City,Manhattan,7002053,001463,NYU Langone Hospitals,0 to 17,OOS,F,White,Not Span/Hispanic,6,Elective,Home or Self Care,2019,NVS009,EPILEPSY; CONVULSIONS,MAM012,ICP AND OTHER CNS MONITORING (EXCLUDING EEG),021,CRANIOTOMY EXCEPT FOR TRAUMA,01,DISEASES AND DISORDERS OF THE NERVOUS SYSTEM,2,Moderate,Minor,Surgical,Private Health Insurance,,,,,false,212847.06,34824.41
New York City,Manhattan,7002053,001463,NYU Langone Hospitals,50 to 69,OOS,M,White,Not Span/Hispanic,5,Elective,Home w/ Home Health Services,2019,NEO048,NERVOUS SYSTEM CANCERS - BRAIN,CNS007,CNS EXCISION PROCEDURES,021,CRANIOTOMY EXCEPT FOR TRAUMA,01,DISEASES AND DISORDERS OF THE NERVOUS SYSTEM,2,Moderate,Moderate,Surgical,Medicare,Private Health Insurance,,,,false,250489.59,56628.44
New York City,Manhattan,7002053,001463,NYU Langone Hospitals,70 or Older,OOS,F,White,Not Span/Hispanic,3,Elective,Home or Self Care,2019,NEO073,BENIGN NEOPLASMS,CNS007,CNS EXCISION PROCEDURES,021,CRANIOTOMY EXCEPT FOR TRAUMA,01,DISEASES AND DISORDERS OF THE NERVOUS SYSTEM,3,Major,Major,Surgical,Medicare,Private Health Insurance,,,,false,228413.67,45642.26
New York City,Manhattan,7002053,001463,NYU Langone Hospitals,50 to 69,100,F,White,Not Span/Hispanic,4,Emergency,Inpatient Rehabilitation Facility,2019,NEO048,NERVOUS SYSTEM CANCERS - BRAIN,CNS007,CNS EXCISION PROCEDURES,021,CRANIOTOMY EXCEPT FOR TRAUMA,01,DISEASES AND DISORDERS OF THE NERVOUS SYSTEM,4,Extreme,Major,Surgical,Private Health Insurance,,,,,true,275003.02,55437.32
New York City,Manhattan,7002053,001463,NYU Langone Hospitals,70 or Older,117,F,White,Not Span/Hispanic,9,Elective,Inpatient Rehabilitation Facility,2019,NEO048,NERVOUS SYSTEM CANCERS - BRAIN,CNS007,CNS EXCISION PROCEDURES,021,CRANIOTOMY EXCEPT FOR TRAUMA,01,DISEASES AND DISORDERS OF THE NERVOUS SYSTEM,4,Extreme,Major,Surgical,Medicare,Blue Cross/Blue Shield,,,,false,318200.04,85990.02
New York City,Manhattan,7002053,001463,NYU Langone Hospitals,50 to 69,100,M,White,Not Span/Hispanic,48,Emergency,Hospice - Medical Facility,2019,NVS014,CNS ABSCESS,CNS006,OTHER CNS DRAINAGE AND RELATED PROCEDURES,021,CRANIOTOMY EXCEPT FOR TRAUMA,01,DISEASES AND DISORDERS OF THE NERVOUS SYSTEM,4,Extreme,Extreme,Surgical,Private Health Insurance,Medicare,,,,true,1148668.46,314855.38
New York City,Manhattan,7002053,001463,NYU Langone Hospitals,70 or Older,113,F,Other Race,Spanish/Hispanic,3,Elective,Home w/ Home Health Services,2019,CIR024,OTHER AND ILL-DEFINED CEREBROVASCULAR DISEASE,CAR011,ANEURYSM REPAIR PROCEDURES,021,CRANIOTOMY EXCEPT FOR TRAUMA,01,DISEASES AND DISORDERS OF THE NERVOUS SYSTEM,2,Moderate,Minor,Surgical,Medicare,,,,,false,236967.98,47303.81
New York City,Manhattan,7002053,001463,NYU Langone Hospitals,50 to 69,125,M,White,Not Span/Hispanic,6,Elective,Skilled Nursing Home,2019,NEO073,BENIGN NEOPLASMS,RAD004,"RADIATION THERAPY, NEC",021,CRANIOTOMY EXCEPT FOR TRAUMA,01,DISEASES AND DISORDERS OF THE NERVOUS SYSTEM,3,Major,Major,Surgical,Medicare,Blue Cross/Blue Shield,,,,false,393237.94,82982.68
New York City,Manhattan,7002053,001463,NYU Langone Hospitals,30 to 49,OOS,M,Other Race,Spanish/Hispanic,2,Elective,Home or Self Care,2019,NEO048,NERVOUS SYSTEM CANCERS - BRAIN,CNS007,CNS EXCISION PROCEDURES,021,CRANIOTOMY EXCEPT FOR TRAUMA,01,DISEASES AND DISORDERS OF THE NERVOUS SYSTEM,3,Major,Major,Surgical,Blue Cross/Blue Shield,,,,,false,204202.66,37240.99
New York City,Manhattan,7002053,001463,NYU Langone Hospitals,0 to 17,109,M,White,Not Span/Hispanic,11,Elective,Home or Self Care,2019,NVS009,EPILEPSY; CONVULSIONS,CNS007,CNS EXCISION PROCEDURES,021,CRANIOTOMY EXCEPT FOR TRAUMA,01,DISEASES AND DISORDERS OF THE NERVOUS SYSTEM,2,Moderate,Minor,Surgical,Medicaid,,,,,false,657298.27,117624.41
New York City,Manhattan,7002053,001463,NYU Langone Hospitals,18 to 29,112,F,Black/African American,Not Span/Hispanic,8,Elective,Home or Self Care,2019,NVS020,OTHER SPECIFIED NERVOUS SYSTEM DISORDERS,CNS010,CEREBROSPINAL FLUID SHUNT PROCEDURES,021,CRANIOTOMY EXCEPT FOR TRAUMA,01,DISEASES AND DISORDERS OF THE NERVOUS SYSTEM,4,Extreme,Major,Surgical,Blue Cross/Blue Shield,,,,,false,235279.15,67693.9
New York City,Manhattan,7002053,001463,NYU Langone Hospitals,70 or Older,112,M,White,Not Span/Hispanic,6,Urgent,Inpatient Rehabilitation Facility,2019,NEO048,NERVOUS SYSTEM CANCERS - BRAIN,RAD004,"RADIATION THERAPY, NEC",021,CRANIOTOMY EXCEPT FOR TRAUMA,01,DISEASES AND DISORDERS OF THE NERVOUS SYSTEM,4,Extreme,Extreme,Surgical,Medicare,,,,,false,357061.45,73288.9
New York City,Manhattan,7002053,001463,NYU Langone Hospitals,0 to 17,107,M,Other Race,Not Span/Hispanic,7,Elective,Home or Self Care,2019,NVS009,EPILEPSY; CONVULSIONS,CNS012,CNS NEUROSTIMULATOR PROCEDURES,021,CRANIOTOMY EXCEPT FOR TRAUMA,01,DISEASES AND DISORDERS OF THE NERVOUS SYSTEM,2,Moderate,Minor,Surgical,Blue Cross/Blue Shield,,,,,false,482088.98,84483.65
New York City,Manhattan,7002053,001463,NYU Langone Hospitals,18 to 29,112,M,White,Not Span/Hispanic,15,Elective,Home or Self Care,2019,NVS009,EPILEPSY; CONVULSIONS,CNS014,"CNS PROCEDURES, NEC",021,CRANIOTOMY EXCEPT FOR TRAUMA,01,DISEASES AND DISORDERS OF THE NERVOUS SYSTEM,2,Moderate,Minor,Surgical,Blue Cross/Blue Shield,,,,,false,728474.69,106712.55
New York City,Manhattan,7002053,001463,NYU Langone Hospitals,30 to 49,103,M,Other Race,Not Span/Hispanic,6,Emergency,Home or Self Care,2019,NVS021,POSTPROCEDURAL OR POSTOPERATIVE NERVOUS SYSTEM COMPLICATION,CNS011,MENINGES REPAIR,021,CRANIOTOMY EXCEPT FOR TRAUMA,01,DISEASES AND DISORDERS OF THE NERVOUS SYSTEM,3,Major,Moderate,Surgical,Private Health Insurance,,,,,true,185589.16,53349.49
New York City,Manhattan,7002053,001463,NYU Langone Hospitals,18 to 29,112,M,Black/African American,Not Span/Hispanic,8,Emergency,Home w/ Home Health Services,2019,NEO070,SECONDARY MALIGNANCIES,CNS007,CNS EXCISION PROCEDURES,021,CRANIOTOMY EXCEPT FOR TRAUMA,01,DISEASES AND DISORDERS OF THE NERVOUS SYSTEM,4,Extreme,Major,Surgical,Blue Cross/Blue Shield,,,,,true,294872.6,63748.44
New York City,Manhattan,7002053,001463,NYU Langone Hospitals,30 to 49,OOS,F,Other Race,Spanish/Hispanic,3,Elective,Home or Self Care,2019,NEO073,BENIGN NEOPLASMS,CNS007,CNS EXCISION PROCEDURES,021,CRANIOTOMY EXCEPT FOR TRAUMA,01,DISEASES AND DISORDERS OF THE NERVOUS SYSTEM,2,Moderate,Moderate,Surgical,Blue Cross/Blue Shield,,,,,false,248937.94,44293.1
New York City,Manhattan,7002053,001463,NYU Langone Hospitals,50 to 69,100,F,Black/African American,Not Span/Hispanic,11,Emergency,Inpatient Rehabilitation Facility,2019,NEO073,BENIGN NEOPLASMS,CNS007,CNS EXCISION PROCEDURES,021,CRANIOTOMY EXCEPT FOR TRAUMA,01,DISEASES AND DISORDERS OF THE NERVOUS SYSTEM,4,Extreme,Major,Surgical,Medicare,Medicaid,,,,true,338430.96,79245.61
New York City,Manhattan,7002053,001463,NYU Langone Hospitals,50 to 69,100,M,Other Race,Not Span/Hispanic,5,Emergency,Home w/ Home Health Services,2019,NEO070,SECONDARY MALIGNANCIES,CNS007,CNS EXCISION PROCEDURES,021,CRANIOTOMY EXCEPT FOR TRAUMA,01,DISEASES AND DISORDERS OF THE NERVOUS SYSTEM,4,Extreme,Major,Surgical,Blue Cross/Blue Shield,,,,,true,209496.44,46162.51
New York City,Manhattan,7002053,001463,NYU Langone Hospitals,50 to 69,100,F,White,Not Span/Hispanic,5,Elective,Home w/ Home Health Services,2019,NVS009,EPILEPSY; CONVULSIONS,CNS012,CNS NEUROSTIMULATOR PROCEDURES,021,CRANIOTOMY EXCEPT FOR TRAUMA,01,DISEASES AND DISORDERS OF THE NERVOUS SYSTEM,2,Moderate,Minor,Surgical,Private Health Insurance,,,,,false,829727.85,143838.07
New York City,Manhattan,7002053,001463,NYU Langone Hospitals,50 to 69,100,M,White,Not Span/Hispanic,1,Elective,Home or Self Care,2019,NVS006,OTHER SPECIFIED HEREDITARY AND DEGENERATIVE NERVOUS SYSTEM CONDITIONS,CNS012,CNS NEUROSTIMULATOR PROCEDURES,021,CRANIOTOMY EXCEPT FOR TRAUMA,01,DISEASES AND DISORDERS OF THE NERVOUS SYSTEM,1,Minor,Minor,Surgical,Medicare,Private Health Insurance,,,,false,173664.75,30110
New York City,Manhattan,7002053,001463,NYU Langone Hospitals,50 to 69,113,F,Other Race,Not Span/Hispanic,5,Urgent,Home or Self Care,2019,NEO073,BENIGN NEOPLASMS,CNS007,CNS EXCISION PROCEDURES,021,CRANIOTOMY EXCEPT FOR TRAUMA,01,DISEASES AND DISORDERS OF THE NERVOUS SYSTEM,2,Moderate,Minor,Surgical,Medicaid,,,,,false,257287.98,50950.47
New York City,Manhattan,7002053,001463,NYU Langone Hospitals,70 or Older,119,M,White,Not Span/Hispanic,1,Elective,Home w/ Home Health Services,2019,NEO070,SECONDARY MALIGNANCIES,CNS007,CNS EXCISION PROCEDURES,021,CRANIOTOMY EXCEPT FOR TRAUMA,01,DISEASES AND DISORDERS OF THE NERVOUS SYSTEM,2,Moderate,Moderate,Surgical,Medicare,Blue Cross/Blue Shield,,,,false,112230.53,20496.56
New York City,Manhattan,7002053,001463,NYU Langone Hospitals,50 to 69,114,F,Black/African American,Not Span/Hispanic,3,Elective,Home or Self Care,2019,CIR024,OTHER AND ILL-DEFINED CEREBROVASCULAR DISEASE,CAR011,ANEURYSM REPAIR PROCEDURES,021,CRANIOTOMY EXCEPT FOR TRAUMA,01,DISEASES AND DISORDERS OF THE NERVOUS SYSTEM,2,Moderate,Minor,Surgical,Blue Cross/Blue Shield,,,,,false,212976.85,44676.64
New York City,Manhattan,7002053,001463,NYU Langone Hospitals,50 to 69,112,F,Black/African American,Not Span/Hispanic,3,Elective,Home or Self Care,2019,NEO073,BENIGN NEOPLASMS,CNS007,CNS EXCISION PROCEDURES,021,CRANIOTOMY EXCEPT FOR TRAUMA,01,DISEASES AND DISORDERS OF THE NERVOUS SYSTEM,4,Extreme,Major,Surgical,Blue Cross/Blue Shield,,,,,false,193189.87,39981.97
New York City,Manhattan,7002053,001463,NYU Langone Hospitals,18 to 29,100,M,Other Race,Unknown,2,Elective,Home or Self Care,2019,INJ037,"COMPLICATION OF OTHER SURGICAL OR MEDICAL CARE, INJURY, INITIAL ENCOUNTER",CNS014,"CNS PROCEDURES, NEC",021,CRANIOTOMY EXCEPT FOR TRAUMA,01,DISEASES AND DISORDERS OF THE NERVOUS SYSTEM,2,Moderate,Minor,Surgical,Medicaid,,,,,false,83635.7,21297.69
New York City,Manhattan,7002053,001463,NYU Langone Hospitals,18 to 29,117,M,White,Not Span/Hispanic,3,Elective,Home or Self Care,2019,NVS009,EPILEPSY; CONVULSIONS,CNS007,CNS EXCISION PROCEDURES,021,CRANIOTOMY EXCEPT FOR TRAUMA,01,DISEASES AND DISORDERS OF THE NERVOUS SYSTEM,2,Moderate,Minor,Surgical,Blue Cross/Blue Shield,,,,,false,211729.28,43416.93
New York City,Manhattan,7002053,001463,NYU Langone Hospitals,70 or Older,112,F,White,Not Span/Hispanic,2,Elective,Skilled Nursing Home,2019,NEO073,BENIGN NEOPLASMS,CNS007,CNS EXCISION PROCEDURES,021,CRANIOTOMY EXCEPT FOR TRAUMA,01,DISEASES AND DISORDERS OF THE NERVOUS SYSTEM,4,Extreme,Major,Surgical,Medicare,Medicare,,,,false,184820.77,33639.47
New York City,Manhattan,7002053,001463,NYU Langone Hospitals,50 to 69,100,F,White,Not Span/Hispanic,7,Elective,Home w/ Home Health Services,2019,NEO073,BENIGN NEOPLASMS,CNS007,CNS EXCISION PROCEDURES,021,CRANIOTOMY EXCEPT FOR TRAUMA,01,DISEASES AND DISORDERS OF THE NERVOUS SYSTEM,3,Major,Moderate,Surgical,Blue Cross/Blue Shield,,,,,false,268174.45,63950.97
New York City,Manhattan,7002053,001463,NYU Langone Hospitals,70 or Older,100,F,White,Not Span/Hispanic,1,Elective,Home or Self Care,2019,NVS004,PARKINSON`S DISEASE,CNS012,CNS NEUROSTIMULATOR PROCEDURES,021,CRANIOTOMY EXCEPT FOR TRAUMA,01,DISEASES AND DISORDERS OF THE NERVOUS SYSTEM,1,Minor,Minor,Surgical,Medicaid,,,,,false,170587.17,29692.09
New York City,Manhattan,7002053,001463,NYU Langone Hospitals,18 to 29,OOS,M,White,Not Span/Hispanic,10,Elective,Home or Self Care,2019,NVS009,EPILEPSY; CONVULSIONS,CNS014,"CNS PROCEDURES, NEC",021,CRANIOTOMY EXCEPT FOR TRAUMA,01,DISEASES AND DISORDERS OF THE NERVOUS SYSTEM,2,Moderate,Moderate,Surgical,Private Health Insurance,,,,,false,643773.08,94746.09
New York City,Manhattan,7002053,001463,NYU Langone Hospitals,50 to 69,113,M,Other Race,Not Span/Hispanic,3,Emergency,Home or Self Care,2019,INJ037,"COMPLICATION OF OTHER SURGICAL OR MEDICAL CARE, INJURY, INITIAL ENCOUNTER",CNS012,CNS NEUROSTIMULATOR PROCEDURES,021,CRANIOTOMY EXCEPT FOR TRAUMA,01,DISEASES AND DISORDERS OF THE NERVOUS SYSTEM,2,Moderate,Moderate,Surgical,Blue Cross/Blue Shield,Medicare,,,,true,85872.92,19742.11
New York City,Manhattan,7002053,001463,NYU Langone Hospitals,70 or Older,107,F,White,Not Span/Hispanic,8,Urgent,Inpatient Rehabilitation Facility,2019,NEO048,NERVOUS SYSTEM CANCERS - BRAIN,CNS007,CNS EXCISION PROCEDURES,021,CRANIOTOMY EXCEPT FOR TRAUMA,01,DISEASES AND DISORDERS OF THE NERVOUS SYSTEM,4,Extreme,Extreme,Surgical,Medicare,,,,,false,288219.88,61886.99
New York City,Manhattan,7002053,001463,NYU Langone Hospitals,50 to 69,OOS,M,White,Not Span/Hispanic,2,Elective,Home or Self Care,2019,NVS009,EPILEPSY; CONVULSIONS,CNS012,CNS NEUROSTIMULATOR PROCEDURES,021,CRANIOTOMY EXCEPT FOR TRAUMA,01,DISEASES AND DISORDERS OF THE NERVOUS SYSTEM,2,Moderate,Moderate,Surgical,Medicare,Blue Cross/Blue Shield,,,,false,747616.93,118255.53
New York City,Manhattan,7002053,001463,NYU Langone Hospitals,18 to 29,119,F,White,Not Span/Hispanic,4,Emergency,Home or Self Care,2019,NEO070,SECONDARY MALIGNANCIES,CNS007,CNS EXCISION PROCEDURES,021,CRANIOTOMY EXCEPT FOR TRAUMA,01,DISEASES AND DISORDERS OF THE NERVOUS SYSTEM,4,Extreme,Major,Surgical,Private Health Insurance,,,,,false,216433.61,45488.44
New York City,Manhattan,7002053,001463,NYU Langone Hospitals,50 to 69,113,M,White,Not Span/Hispanic,2,Elective,Home or Self Care,2019,NEO073,BENIGN NEOPLASMS,CNS007,CNS EXCISION PROCEDURES,021,CRANIOTOMY EXCEPT FOR TRAUMA,01,DISEASES AND DISORDERS OF THE NERVOUS SYSTEM,1,Minor,Minor,Surgical,Blue Cross/Blue Shield,,,,,false,117841.35,23991.58
New York City,Manhattan,7002053,001463,NYU Langone Hospitals,50 to 69,112,M,Other Race,Not Span/Hispanic,1,Elective,Home or Self Care,2019,MAL004,NERVOUS SYSTEM CONGENITAL ANOMALIES,CNS010,CEREBROSPINAL FLUID SHUNT PROCEDURES,021,CRANIOTOMY EXCEPT FOR TRAUMA,01,DISEASES AND DISORDERS OF THE NERVOUS SYSTEM,1,Minor,Minor,Surgical,Medicaid,,,,,false,55143.08,11941.04
New York City,Manhattan,7002053,001463,NYU Langone Hospitals,30 to 49,117,M,White,Not Span/Hispanic,10,Elective,Home w/ Home Health Services,2019,NVS009,EPILEPSY; CONVULSIONS,CNS014,"CNS PROCEDURES, NEC",021,CRANIOTOMY EXCEPT FOR TRAUMA,01,DISEASES AND DISORDERS OF THE NERVOUS SYSTEM,2,Moderate,Minor,Surgical,Private Health Insurance,,,,,false,651455.07,104036.24
New York City,Manhattan,7002053,001463,NYU Langone Hospitals,30 to 49,112,F,White,Not Span/Hispanic,3,Elective,Home or Self Care,2019,NVS009,EPILEPSY; CONVULSIONS,CNS012,CNS NEUROSTIMULATOR PROCEDURES,021,CRANIOTOMY EXCEPT FOR TRAUMA,01,DISEASES AND DISORDERS OF THE NERVOUS SYSTEM,2,Moderate,Minor,Surgical,Medicaid,,,,,false,714693.82,116622.45
New York City,Manhattan,7002053,001463,NYU Langone Hospitals,18 to 29,OOS,M,White,Not Span/Hispanic,1,Elective,Home or Self Care,2019,MBD014,NEURODEVELOPMENTAL DISORDERS,CNS012,CNS NEUROSTIMULATOR PROCEDURES,021,CRANIOTOMY EXCEPT FOR TRAUMA,01,DISEASES AND DISORDERS OF THE NERVOUS SYSTEM,1,Minor,Minor,Surgical,Medicare,Medicaid,,,,false,246893.54,40448.47
New York City,Manhattan,7002053,001463,NYU Langone Hospitals,30 to 49,101,F,White,Not Span/Hispanic,2,Elective,Home or Self Care,2019,NEO073,BENIGN NEOPLASMS,CNS007,CNS EXCISION PROCEDURES,021,CRANIOTOMY EXCEPT FOR TRAUMA,01,DISEASES AND DISORDERS OF THE NERVOUS SYSTEM,1,Minor,Minor,Surgical,Private Health Insurance,,,,,false,164247.08,31970.93
New York City,Manhattan,7002053,001463,NYU Langone Hospitals,30 to 49,112,M,White,Not Span/Hispanic,2,Elective,Home or Self Care,2019,NVS009,EPILEPSY; CONVULSIONS,CNS007,CNS EXCISION PROCEDURES,021,CRANIOTOMY EXCEPT FOR TRAUMA,01,DISEASES AND DISORDERS OF THE NERVOUS SYSTEM,2,Moderate,Minor,Surgical,Private Health Insurance,,,,,false,191669.47,33967.65
New York City,Manhattan,7002053,001463,NYU Langone Hospitals,50 to 69,OOS,F,White,Not Span/Hispanic,3,Elective,Home or Self Care,2019,NEO048,NERVOUS SYSTEM CANCERS - BRAIN,CNS007,CNS EXCISION PROCEDURES,021,CRANIOTOMY EXCEPT FOR TRAUMA,01,DISEASES AND DISORDERS OF THE NERVOUS SYSTEM,3,Major,Major,Surgical,Private Health Insurance,,,,,false,178407.41,33960.31
New York City,Manhattan,7002053,001463,NYU Langone Hospitals,70 or Older,OOS,M,White,Not Span/Hispanic,3,Elective,Home w/ Home Health Services,2019,NEO072,NEOPLASMS OF UNSPECIFIED NATURE OR UNCERTAIN BEHAVIOR,CNS007,CNS EXCISION PROCEDURES,021,CRANIOTOMY EXCEPT FOR TRAUMA,01,DISEASES AND DISORDERS OF THE NERVOUS SYSTEM,4,Extreme,Major,Surgical,Medicare,Medicare,,,,false,128811.68,31835.13
New York City,Manhattan,7002053,001463,NYU Langone Hospitals,30 to 49,103,M,White,Not Span/Hispanic,5,Elective,Home or Self Care,2019,NEO070,SECONDARY MALIGNANCIES,CNS007,CNS EXCISION PROCEDURES,021,CRANIOTOMY EXCEPT FOR TRAUMA,01,DISEASES AND DISORDERS OF THE NERVOUS SYSTEM,2,Moderate,Moderate,Surgical,Medicaid,,,,,false,185936.92,39874.19
New York City,Manhattan,7002053,001463,NYU Langone Hospitals,30 to 49,OOS,F,White,Not Span/Hispanic,3,Elective,Home or Self Care,2019,NEO073,BENIGN NEOPLASMS,CNS007,CNS EXCISION PROCEDURES,021,CRANIOTOMY EXCEPT FOR TRAUMA,01,DISEASES AND DISORDERS OF THE NERVOUS SYSTEM,1,Minor,Minor,Surgical,Blue Cross/Blue Shield,,,,,false,210831.12,44125.68
New York City,Manhattan,7002053,001463,NYU Langone Hospitals,50 to 69,100,M,White,Not Span/Hispanic,5,Emergency,Home or Self Care,2019,NEO048,NERVOUS SYSTEM CANCERS - BRAIN,CNS007,CNS EXCISION PROCEDURES,021,CRANIOTOMY EXCEPT FOR TRAUMA,01,DISEASES AND DISORDERS OF THE NERVOUS SYSTEM,3,Major,Moderate,Surgical,Private Health Insurance,,,,,true,251155.77,52265.35
New York City,Manhattan,7002053,001463,NYU Langone Hospitals,50 to 69,100,F,White,Not Span/Hispanic,2,Elective,Home or Self Care,2019,MAL001,CARDIAC AND CIRCULATORY CONGENITAL ANOMALIES,CAR020,SAPHENOUS VEIN HARVEST AND OTHER THERAPEUTIC VESSEL REMOVAL,021,CRANIOTOMY EXCEPT FOR TRAUMA,01,DISEASES AND DISORDERS OF THE NERVOUS SYSTEM,1,Minor,Minor,Surgical,Blue Cross/Blue Shield,,,,,false,335672.53,57744.01
New York City,Manhattan,7002053,001463,NYU Langone Hospitals,0 to 17,117,M,Black/African American,Not Span/Hispanic,3,Emergency,Home w/ Home Health Services,2019,INJ037,"COMPLICATION OF OTHER SURGICAL OR MEDICAL CARE, INJURY, INITIAL ENCOUNTER",CNS014,"CNS PROCEDURES, NEC",021,CRANIOTOMY EXCEPT FOR TRAUMA,01,DISEASES AND DISORDERS OF THE NERVOUS SYSTEM,4,Extreme,Major,Surgical,Medicaid,,,,,false,90351.95,23825.86
New York City,Manhattan,7002053,001463,NYU Langone Hospitals,30 to 49,113,F,White,Not Span/Hispanic,2,Elective,Home or Self Care,2019,NVS009,EPILEPSY; CONVULSIONS,MST029,"MUSCULOSKELETAL DEVICE PROCEDURES, NEC",021,CRANIOTOMY EXCEPT FOR TRAUMA,01,DISEASES AND DISORDERS OF THE NERVOUS SYSTEM,2,Moderate,Minor,Surgical,Blue Cross/Blue Shield,,,,,false,735225.68,116848.07
New York City,Manhattan,7002053,001463,NYU Langone Hospitals,50 to 69,OOS,M,White,Not Span/Hispanic,2,Elective,Home or Self Care,2019,MAL001,CARDIAC AND CIRCULATORY CONGENITAL ANOMALIES,CNS007,CNS EXCISION PROCEDURES,021,CRANIOTOMY EXCEPT FOR TRAUMA,01,DISEASES AND DISORDERS OF THE NERVOUS SYSTEM,2,Moderate,Minor,Surgical,Blue Cross/Blue Shield,,,,,false,357186.33,59222.07
New York City,Manhattan,7002053,001463,NYU Langone Hospitals,50 to 69,OOS,M,White,Not Span/Hispanic,12,Emergency,Inpatient Rehabilitation Facility,2019,NEO073,BENIGN NEOPLASMS,CNS007,CNS EXCISION PROCEDURES,021,CRANIOTOMY EXCEPT FOR TRAUMA,01,DISEASES AND DISORDERS OF THE NERVOUS SYSTEM,4,Extreme,Extreme,Surgical,Medicare,,,,,true,578470.25,134262.8
New York City,Manhattan,7002053,001463,NYU Langone Hospitals,70 or Older,113,M,White,Not Span/Hispanic,1,Elective,Home or Self Care,2019,NVS004,PARKINSON`S DISEASE,CNS012,CNS NEUROSTIMULATOR PROCEDURES,021,CRANIOTOMY EXCEPT FOR TRAUMA,01,DISEASES AND DISORDERS OF THE NERVOUS SYSTEM,1,Minor,Minor,Surgical,Medicare,Blue Cross/Blue Shield,,,,false,174444.71,30022.24
New York City,Manhattan,7002053,001463,NYU Langone Hospitals,50 to 69,100,M,Other Race,Not Span/Hispanic,2,Elective,Home or Self Care,2019,NVS017,NERVE AND NERVE ROOT DISORDERS,CNS014,"CNS PROCEDURES, NEC",021,CRANIOTOMY EXCEPT FOR TRAUMA,01,DISEASES AND DISORDERS OF THE NERVOUS SYSTEM,1,Minor,Minor,Surgical,Blue Cross/Blue Shield,,,,,false,166716.92,32564.33
New York City,Manhattan,7002053,001463,NYU Langone Hospitals,50 to 69,OOS,M,White,Not Span/Hispanic,3,Elective,Home or Self Care,2019,NEO073,BENIGN NEOPLASMS,CNS007,CNS EXCISION PROCEDURES,021,CRANIOTOMY EXCEPT FOR TRAUMA,01,DISEASES AND DISORDERS OF THE NERVOUS SYSTEM,4,Extreme,Major,Surgical,Blue Cross/Blue Shield,,,,,false,292357.85,55162.81
New York City,Manhattan,7002053,001463,NYU Langone Hospitals,30 to 49,117,F,White,Not Span/Hispanic,4,Elective,Home or Self Care,2019,NEO073,BENIGN NEOPLASMS,CNS007,CNS EXCISION PROCEDURES,021,CRANIOTOMY EXCEPT FOR TRAUMA,01,DISEASES AND DISORDERS OF THE NERVOUS SYSTEM,4,Extreme,Major,Surgical,Private Health Insurance,,,,,false,234319.77,50358.77
New York City,Manhattan,7002053,001463,NYU Langone Hospitals,30 to 49,112,M,White,Not Span/Hispanic,4,Emergency,Home or Self Care,2019,CIR021,ACUTE HEMORRHAGIC CEREBROVASCULAR DISEASE,CNS004,INTRACRANIAL EPIDURAL AND SUBDURAL SPACE DRAINAGE,021,CRANIOTOMY EXCEPT FOR TRAUMA,01,DISEASES AND DISORDERS OF THE NERVOUS SYSTEM,2,Moderate,Moderate,Surgical,Medicaid,,,,,true,281186.52,58746