Hospital Service Area,Hospital County,Operating Certificate Number,Permanent Facility Id,Facility Name,Age Group,Zip Code - 3 digits,Gender,Race,Ethnicity,Length of Stay,Type of Admission,Patient Disposition,Discharge Year,CCS Diagnosis Code,CCS Diagnosis Description,CCS Procedure Code,CCS Procedure Description,APR DRG Code,APR DRG Description,APR MDC Code,APR MDC Description,APR Severity of Illness Code,APR Severity of Illness Description,APR Risk of Mortality,APR Medical Surgical Description,Payment Typology 1,Payment Typology 2,Payment Typology 3,Birth Weight,Abortion Edit Indicator,Emergency Department Indicator,Total Charges,Total Costs
Long Island,Suffolk,5151001,000245,Stony Brook University Hospital,70 or Older,117,M,White,Not Span/Hispanic,3,Elective,Skilled Nursing Home,2019,NVS020,OTHER SPECIFIED NERVOUS SYSTEM DISORDERS,CNS010,CEREBROSPINAL FLUID SHUNT PROCEDURES,022,VENTRICULAR SHUNT PROCEDURES,01,DISEASES AND DISORDERS OF THE NERVOUS SYSTEM,1,Minor,Minor,Surgical,Medicare,Blue Cross/Blue Shield,,,,false,56761.59,22577.18
New York City,Manhattan,7002054,001458,New York-Presbyterian Hospital - New York Weill Cornell Center,0 to 17,,M,Multi-racial,Not Span/Hispanic,1,Elective,Home or Self Care,2019,MAL004,NERVOUS SYSTEM CONGENITAL ANOMALIES,CNS010,CEREBROSPINAL FLUID SHUNT PROCEDURES,022,VENTRICULAR SHUNT PROCEDURES,01,DISEASES AND DISORDERS OF THE NERVOUS SYSTEM,2,Moderate,Minor,Surgical,"Managed Care, Unspecified",Medicaid,Self-Pay,,,false,53765.91,23775
New York City,Manhattan,7002054,001458,New York-Presbyterian Hospital - New York Weill Cornell Center,0 to 17,OOS,M,White,Not Span/Hispanic,2,Elective,Home or Self Care,2019,INJ037,"COMPLICATION OF OTHER SURGICAL OR MEDICAL CARE, INJURY, INITIAL ENCOUNTER",CNS014,"CNS PROCEDURES, NEC",022,VENTRICULAR SHUNT PROCEDURES,01,DISEASES AND DISORDERS OF THE NERVOUS SYSTEM,2,Moderate,Minor,Surgical,Private Health Insurance,Self-Pay,,,,false,63951.81,27148.07
New York City,Bronx,7000006,001169,Montefiore Medical Center - Henry & Lucy Moses Div,70 or Older,104,F,Other Race,Spanish/Hispanic,7,Elective,Skilled Nursing Home,2019,NVS020,OTHER SPECIFIED NERVOUS SYSTEM DISORDERS,CNS010,CEREBROSPINAL FLUID SHUNT PROCEDURES,022,VENTRICULAR SHUNT PROCEDURES,01,DISEASES AND DISORDERS OF THE NERVOUS SYSTEM,1,Minor,Minor,Surgical,Medicare,,,,,false,122975.53,32677.52
Long Island,Suffolk,5154001,000925,Good Samaritan Hospital Medical Center,70 or Older,117,M,White,Not Span/Hispanic,11,Emergency,Home w/ Home Health Services,2019,NVS020,OTHER SPECIFIED NERVOUS SYSTEM DISORDERS,CNS010,CEREBROSPINAL FLUID SHUNT PROCEDURES,022,VENTRICULAR SHUNT PROCEDURES,01,DISEASES AND DISORDERS OF THE NERVOUS SYSTEM,2,Moderate,Minor,Surgical,Blue Cross/Blue Shield,Medicare,,,,true,151829.18,28441.23
New York City,Queens,7003010,001637,New York - Presbyterian/Queens,50 to 69,113,F,Other Race,Spanish/Hispanic,25,Emergency,Skilled Nursing Home,2019,NVS020,OTHER SPECIFIED NERVOUS SYSTEM DISORDERS,CNS010,CEREBROSPINAL FLUID SHUNT PROCEDURES,022,VENTRICULAR SHUNT PROCEDURES,01,DISEASES AND DISORDERS OF THE NERVOUS SYSTEM,3,Major,Major,Surgical,Medicare,Medicare,Medicaid,,,true,257108.61,76281.03
Southern Tier,Broome,0303001,000058,United Health Services Hospitals Inc. - Wilson Medical Center,70 or Older,139,M,White,Not Span/Hispanic,14,Emergency,Skilled Nursing Home,2019,NVS020,OTHER SPECIFIED NERVOUS SYSTEM DISORDERS,CNS010,CEREBROSPINAL FLUID SHUNT PROCEDURES,022,VENTRICULAR SHUNT PROCEDURES,01,DISEASES AND DISORDERS OF THE NERVOUS SYSTEM,4,Extreme,Major,Surgical,Medicare,Medicare,Private Health Insurance,,,true,83073.4,41489.49
Capital/Adirond,Albany,0101004,000005,St. Peter's Hospital,50 to 69,120,F,White,Not Span/Hispanic,6,Emergency,Home or Self Care,2019,NEO072,NEOPLASMS OF UNSPECIFIED NATURE OR UNCERTAIN BEHAVIOR,CNS010,CEREBROSPINAL FLUID SHUNT PROCEDURES,022,VENTRICULAR SHUNT PROCEDURES,01,DISEASES AND DISORDERS OF THE NERVOUS SYSTEM,3,Major,Major,Surgical,Medicare,Blue Cross/Blue Shield,,,,true,73839.15,24146.2
New York City,Manhattan,7002024,001456,Mount Sinai Hospital,70 or Older,125,F,White,Not Span/Hispanic,3,Elective,Home or Self Care,2019,NVS020,OTHER SPECIFIED NERVOUS SYSTEM DISORDERS,CNS014,"CNS PROCEDURES, NEC",022,VENTRICULAR SHUNT PROCEDURES,01,DISEASES AND DISORDERS OF THE NERVOUS SYSTEM,2,Moderate,Minor,Surgical,Medicare,Blue Cross/Blue Shield,Self-Pay,,,false,79841.74,27273.1
New York City,Manhattan,7002054,001464,New York-Presbyterian Hospital - Columbia Presbyterian Center,0 to 17,104,F,White,Spanish/Hispanic,1,Emergency,Home w/ Home Health Services,2019,NEO048,NERVOUS SYSTEM CANCERS - BRAIN,CNS010,CEREBROSPINAL FLUID SHUNT PROCEDURES,022,VENTRICULAR SHUNT PROCEDURES,01,DISEASES AND DISORDERS OF THE NERVOUS SYSTEM,4,Extreme,Major,Surgical,Medicaid,Medicaid,Self-Pay,,,true,51295.42,18875.83
New York City,Kings,7002053,001304,NYU Langone Hospital-Brooklyn,50 to 69,112,F,White,Not Span/Hispanic,1,Elective,Home or Self Care,2019,NVS020,OTHER SPECIFIED NERVOUS SYSTEM DISORDERS,CNS010,CEREBROSPINAL FLUID SHUNT PROCEDURES,022,VENTRICULAR SHUNT PROCEDURES,01,DISEASES AND DISORDERS OF THE NERVOUS SYSTEM,1,Minor,Minor,Surgical,Private Health Insurance,,,,,false,143195.07,23050.67
Hudson Valley,Westchester,5957001,001139,Westchester Medical Center,0 to 17,106,F,Other Race,Unknown,6,Emergency,Cancer Center or Children's Hospital,2019,NVS020,OTHER SPECIFIED NERVOUS SYSTEM DISORDERS,CNS010,CEREBROSPINAL FLUID SHUNT PROCEDURES,022,VENTRICULAR SHUNT PROCEDURES,01,DISEASES AND DISORDERS OF THE NERVOUS SYSTEM,1,Minor,Minor,Surgical,Medicaid,Medicaid,,,,true,229479.43,42295.24
Long Island,Suffolk,5151001,000245,Stony Brook University Hospital,18 to 29,117,M,White,Not Span/Hispanic,2,Elective,Home w/ Home Health Services,2019,INJ037,"COMPLICATION OF OTHER SURGICAL OR MEDICAL CARE, INJURY, INITIAL ENCOUNTER",CNS014,"CNS PROCEDURES, NEC",022,VENTRICULAR SHUNT PROCEDURES,01,DISEASES AND DISORDERS OF THE NERVOUS SYSTEM,2,Moderate,Minor,Surgical,Medicare,Medicare,Medicaid,,,false,34391.62,12576.08
Long Island,Nassau,2951001,000541,North Shore University Hospital,70 or Older,113,M,Black/African American,Not Span/Hispanic,1,Elective,Home w/ Home Health Services,2019,NVS020,OTHER SPECIFIED NERVOUS SYSTEM DISORDERS,CNS010,CEREBROSPINAL FLUID SHUNT PROCEDURES,022,VENTRICULAR SHUNT PROCEDURES,01,DISEASES AND DISORDERS OF THE NERVOUS SYSTEM,1,Minor,Minor,Surgical,Medicare,Private Health Insurance,,,,false,81330.18,21728.42
New York City,Manhattan,7002024,001456,Mount Sinai Hospital,70 or Older,116,F,White,Not Span/Hispanic,1,Elective,Home or Self Care,2019,NVS020,OTHER SPECIFIED NERVOUS SYSTEM DISORDERS,CNS014,"CNS PROCEDURES, NEC",022,VENTRICULAR SHUNT PROCEDURES,01,DISEASES AND DISORDERS OF THE NERVOUS SYSTEM,1,Minor,Minor,Surgical,Medicare,Private Health Insurance,Self-Pay,,,false,50076.11,16394.21
New York City,Manhattan,7002053,001463,NYU Langone Hospitals,50 to 69,OOS,F,White,Not Span/Hispanic,11,Emergency,Home or Self Care,2019,NVS021,POSTPROCEDURAL OR POSTOPERATIVE NERVOUS SYSTEM COMPLICATION,CNS010,CEREBROSPINAL FLUID SHUNT PROCEDURES,022,VENTRICULAR SHUNT PROCEDURES,01,DISEASES AND DISORDERS OF THE NERVOUS SYSTEM,2,Moderate,Moderate,Surgical,Blue Cross/Blue Shield,,,,,false,293284.13,92253.16
New York City,Manhattan,7002053,001463,NYU Langone Hospitals,70 or Older,113,F,White,Not Span/Hispanic,4,Elective,Inpatient Rehabilitation Facility,2019,NVS020,OTHER SPECIFIED NERVOUS SYSTEM DISORDERS,CNS010,CEREBROSPINAL FLUID SHUNT PROCEDURES,022,VENTRICULAR SHUNT PROCEDURES,01,DISEASES AND DISORDERS OF THE NERVOUS SYSTEM,2,Moderate,Minor,Surgical,Medicare,Blue Cross/Blue Shield,,,,false,136700.42,37868.81
New York City,Manhattan,7002053,001463,NYU Langone Hospitals,18 to 29,112,M,Other Race,Not Span/Hispanic,4,Emergency,Inpatient Rehabilitation Facility,2019,INJ037,"COMPLICATION OF OTHER SURGICAL OR MEDICAL CARE, INJURY, INITIAL ENCOUNTER",CNS014,"CNS PROCEDURES, NEC",022,VENTRICULAR SHUNT PROCEDURES,01,DISEASES AND DISORDERS OF THE NERVOUS SYSTEM,3,Major,Moderate,Surgical,Miscellaneous/Other,Medicaid,,,,false,190206.93,46239.95
New York City,Kings,7001021,001306,New York - Presbyterian Brooklyn Methodist Hospital,70 or Older,112,M,White,Not Span/Hispanic,2,Elective,Inpatient Rehabilitation Facility,2019,NVS020,OTHER SPECIFIED NERVOUS SYSTEM DISORDERS,CNS010,CEREBROSPINAL FLUID SHUNT PROCEDURES,022,VENTRICULAR SHUNT PROCEDURES,01,DISEASES AND DISORDERS OF THE NERVOUS SYSTEM,2,Moderate,Minor,Surgical,Medicare,Blue Cross/Blue Shield,Self-Pay,,,false,37815.24,18248.32
New York City,Manhattan,7002054,001458,New York-Presbyterian Hospital - New York Weill Cornell Center,0 to 17,112,M,Other Race,Not Span/Hispanic,5,Elective,Home or Self Care,2019,NVS020,OTHER SPECIFIED NERVOUS SYSTEM DISORDERS,CNS010,CEREBROSPINAL FLUID SHUNT PROCEDURES,022,VENTRICULAR SHUNT PROCEDURES,01,DISEASES AND DISORDERS OF THE NERVOUS SYSTEM,3,Major,Minor,Surgical,Private Health Insurance,Self-Pay,,,,false,119061.88,55457.67
New York City,Manhattan,7002054,001458,New York-Presbyterian Hospital - New York Weill Cornell Center,70 or Older,101,M,Other Race,Not Span/Hispanic,1,Elective,Inpatient Rehabilitation Facility,2019,NVS020,OTHER SPECIFIED NERVOUS SYSTEM DISORDERS,CNS010,CEREBROSPINAL FLUID SHUNT PROCEDURES,022,VENTRICULAR SHUNT PROCEDURES,01,DISEASES AND DISORDERS OF THE NERVOUS SYSTEM,3,Major,Minor,Surgical,Medicare,Private Health Insurance,Self-Pay,,,false,53394.37,19031.54
New York City,Manhattan,7002054,001458,New York-Presbyterian Hospital - New York Weill Cornell Center,70 or Older,112,M,White,Not Span/Hispanic,1,Elective,Skilled Nursing Home,2019,NVS020,OTHER SPECIFIED NERVOUS SYSTEM DISORDERS,CNS010,CEREBROSPINAL FLUID SHUNT PROCEDURES,022,VENTRICULAR SHUNT PROCEDURES,01,DISEASES AND DISORDERS OF THE NERVOUS SYSTEM,1,Minor,Minor,Surgical,Medicare,Blue Cross/Blue Shield,Self-Pay,,,false,48154.98,17029.95
New York City,Manhattan,7002054,001458,New York-Presbyterian Hospital - New York Weill Cornell Center,30 to 49,100,M,Multi-racial,Not Span/Hispanic,2,Emergency,Home or Self Care,2019,INJ037,"COMPLICATION OF OTHER SURGICAL OR MEDICAL CARE, INJURY, INITIAL ENCOUNTER",CNS014,"CNS PROCEDURES, NEC",022,VENTRICULAR SHUNT PROCEDURES,01,DISEASES AND DISORDERS OF THE NERVOUS SYSTEM,1,Minor,Minor,Surgical,Medicaid,Self-Pay,,,,false,43405.27,12075.59
Long Island,Nassau,2951001,000541,North Shore University Hospital,50 to 69,118,F,White,Not Span/Hispanic,1,Elective,Home or Self Care,2019,NVS020,OTHER SPECIFIED NERVOUS SYSTEM DISORDERS,CNS010,CEREBROSPINAL FLUID SHUNT PROCEDURES,022,VENTRICULAR SHUNT PROCEDURES,01,DISEASES AND DISORDERS OF THE NERVOUS SYSTEM,2,Moderate,Moderate,Surgical,Private Health Insurance,,,,,false,49527.39,14319.28
New York City,Manhattan,7002054,001458,New York-Presbyterian Hospital - New York Weill Cornell Center,0 to 17,104,M,Multi-racial,Spanish/Hispanic,4,Emergency,Home w/ Home Health Services,2019,INJ037,"COMPLICATION OF OTHER SURGICAL OR MEDICAL CARE, INJURY, INITIAL ENCOUNTER",CNS014,"CNS PROCEDURES, NEC",022,VENTRICULAR SHUNT PROCEDURES,01,DISEASES AND DISORDERS OF THE NERVOUS SYSTEM,2,Moderate,Minor,Surgical,"Managed Care, Unspecified",Medicaid,Self-Pay,,,true,116060.87,50736.87
New York City,Manhattan,7002054,001464,New York-Presbyterian Hospital - Columbia Presbyterian Center,70 or Older,104,F,Other Race,Spanish/Hispanic,6,Emergency,Skilled Nursing Home,2019,NVS020,OTHER SPECIFIED NERVOUS SYSTEM DISORDERS,CNS010,CEREBROSPINAL FLUID SHUNT PROCEDURES,022,VENTRICULAR SHUNT PROCEDURES,01,DISEASES AND DISORDERS OF THE NERVOUS SYSTEM,4,Extreme,Moderate,Surgical,Medicare,Medicaid,Self-Pay,,,true,141734.85,60968.17
New York City,Manhattan,7002054,001458,New York-Presbyterian Hospital - New York Weill Cornell Center,70 or Older,108,F,White,Not Span/Hispanic,1,Elective,Home or Self Care,2019,NVS020,OTHER SPECIFIED NERVOUS SYSTEM DISORDERS,CNS010,CEREBROSPINAL FLUID SHUNT PROCEDURES,022,VENTRICULAR SHUNT PROCEDURES,01,DISEASES AND DISORDERS OF THE NERVOUS SYSTEM,1,Minor,Minor,Surgical,Medicare,Blue Cross/Blue Shield,Self-Pay,,,false,60349.63,21371.63
New York City,Queens,7003010,001637,New York - Presbyterian/Queens,30 to 49,113,F,White,Not Span/Hispanic,2,Emergency,Home or Self Care,2019,INJ037,"COMPLICATION OF OTHER SURGICAL OR MEDICAL CARE, INJURY, INITIAL ENCOUNTER",CNS014,"CNS PROCEDURES, NEC",022,VENTRICULAR SHUNT PROCEDURES,01,DISEASES AND DISORDERS OF THE NERVOUS SYSTEM,1,Minor,Minor,Surgical,Private Health Insurance,Self-Pay,,,,true,38671.12,12116.8
New York City,Bronx,7000002,001165,Jacobi Medical Center,0 to 17,104,M,Other Race,Spanish/Hispanic,2,Elective,Home or Self Care,2019,NVS020,OTHER SPECIFIED NERVOUS SYSTEM DISORDERS,CNS010,CEREBROSPINAL FLUID SHUNT PROCEDURES,022,VENTRICULAR SHUNT PROCEDURES,01,DISEASES AND DISORDERS OF THE NERVOUS SYSTEM,2,Moderate,Minor,Surgical,Medicaid,Medicaid,,,,false,21429.8,12678.94
New York City,Manhattan,7002054,001458,New York-Presbyterian Hospital - New York Weill Cornell Center,18 to 29,112,M,Black/African American,Not Span/Hispanic,1,Elective,Home or Self Care,2019,INJ037,"COMPLICATION OF OTHER SURGICAL OR MEDICAL CARE, INJURY, INITIAL ENCOUNTER",CNS014,"CNS PROCEDURES, NEC",022,VENTRICULAR SHUNT PROCEDURES,01,DISEASES AND DISORDERS OF THE NERVOUS SYSTEM,1,Minor,Minor,Surgical,"Managed Care, Unspecified",Medicaid,Self-Pay,,,false,40902.53,16468.74
New York City,Manhattan,7002054,001458,New York-Presbyterian Hospital - New York Weill Cornell Center,70 or Older,100,F,Black/African American,Not Span/Hispanic,2,Elective,Home or Self Care,2019,NVS020,OTHER SPECIFIED NERVOUS SYSTEM DISORDERS,CNS010,CEREBROSPINAL FLUID SHUNT PROCEDURES,022,VENTRICULAR SHUNT PROCEDURES,01,DISEASES AND DISORDERS OF THE NERVOUS SYSTEM,1,Minor,Minor,Surgical,Medicare,Medicare,Self-Pay,,,false,59273.57,19869.38
Capital/Adirond,Albany,0101000,000001,Albany Medical Center Hospital,0 to 17,121,F,White,Not Span/Hispanic,1,Emergency,Home or Self Care,2019,INJ037,"COMPLICATION OF OTHER SURGICAL OR MEDICAL CARE, INJURY, INITIAL ENCOUNTER",CNS014,"CNS PROCEDURES, NEC",022,VENTRICULAR SHUNT PROCEDURES,01,DISEASES AND DISORDERS OF THE NERVOUS SYSTEM,2,Moderate,Minor,Surgical,"Managed Care, Unspecified",,,,,true,33360.25,14175.85
New York City,Bronx,7000014,001176,SBH Health System,30 to 49,104,F,White,Spanish/Hispanic,1,Elective,Home w/ Home Health Services,2019,NVS020,OTHER SPECIFIED NERVOUS SYSTEM DISORDERS,CNS010,CEREBROSPINAL FLUID SHUNT PROCEDURES,022,VENTRICULAR SHUNT PROCEDURES,01,DISEASES AND DISORDERS OF THE NERVOUS SYSTEM,1,Minor,Minor,Surgical,Medicaid,Medicaid,,,,false,44562.8,19114.34
Central NY,Onondaga,3301007,000635,University Hospital SUNY Health Science Center,18 to 29,136,M,White,Not Span/Hispanic,6,Emergency,Home or Self Care,2019,NVS020,OTHER SPECIFIED NERVOUS SYSTEM DISORDERS,CNS010,CEREBROSPINAL FLUID SHUNT PROCEDURES,022,VENTRICULAR SHUNT PROCEDURES,01,DISEASES AND DISORDERS OF THE NERVOUS SYSTEM,4,Extreme,Moderate,Surgical,Federal/State/Local/VA,,,,,true,100481.09,26856.5
New York City,Queens,7003010,001637,New York - Presbyterian/Queens,50 to 69,113,M,White,Spanish/Hispanic,1,Elective,Home or Self Care,2019,NVS020,OTHER SPECIFIED NERVOUS SYSTEM DISORDERS,CNS010,CEREBROSPINAL FLUID SHUNT PROCEDURES,022,VENTRICULAR SHUNT PROCEDURES,01,DISEASES AND DISORDERS OF THE NERVOUS SYSTEM,1,Minor,Minor,Surgical,Medicare,Medicare,Self-Pay,,,false,32862.26,16594.29
Finger Lakes,Monroe,2701005,000413,Strong Memorial Hospital,18 to 29,148,F,White,Not Span/Hispanic,1,Elective,Home or Self Care,2019,MAL004,NERVOUS SYSTEM CONGENITAL ANOMALIES,CNS010,CEREBROSPINAL FLUID SHUNT PROCEDURES,022,VENTRICULAR SHUNT PROCEDURES,01,DISEASES AND DISORDERS OF THE NERVOUS SYSTEM,2,Moderate,Minor,Surgical,Medicaid,,,,,false,48691.77,24204.02
Western NY,Erie,1401014,000207,Buffalo General Medical Center,70 or Older,141,M,White,Not Span/Hispanic,2,Elective,Home w/ Home Health Services,2019,NVS020,OTHER SPECIFIED NERVOUS SYSTEM DISORDERS,CNS010,CEREBROSPINAL FLUID SHUNT PROCEDURES,022,VENTRICULAR SHUNT PROCEDURES,01,DISEASES AND DISORDERS OF THE NERVOUS SYSTEM,1,Minor,Minor,Surgical,Medicare,Self-Pay,,,,false,42918.8,14514.83
Central NY,Onondaga,3301007,000635,University Hospital SUNY Health Science Center,30 to 49,130,F,White,Not Span/Hispanic,2,Emergency,Home or Self Care,2019,NVS020,OTHER SPECIFIED NERVOUS SYSTEM DISORDERS,CNS010,CEREBROSPINAL FLUID SHUNT PROCEDURES,022,VENTRICULAR SHUNT PROCEDURES,01,DISEASES AND DISORDERS OF THE NERVOUS SYSTEM,1,Minor,Minor,Surgical,Private Health Insurance,,,,,true,53361.93,13807.67
New York City,Manhattan,7002054,001458,New York-Presbyterian Hospital - New York Weill Cornell Center,70 or Older,113,F,Other Race,Spanish/Hispanic,1,Elective,Home or Self Care,2019,NVS020,OTHER SPECIFIED NERVOUS SYSTEM DISORDERS,CNS010,CEREBROSPINAL FLUID SHUNT PROCEDURES,022,VENTRICULAR SHUNT PROCEDURES,01,DISEASES AND DISORDERS OF THE NERVOUS SYSTEM,1,Minor,Minor,Surgical,Medicare,Medicare,Medicaid,,,false,52551.49,18611.19
Long Island,Suffolk,5153000,000913,Huntington Hospital,70 or Older,117,M,White,Not Span/Hispanic,1,Elective,Home or Self Care,2019,NVS020,OTHER SPECIFIED NERVOUS SYSTEM DISORDERS,CNS010,CEREBROSPINAL FLUID SHUNT PROCEDURES,022,VENTRICULAR SHUNT PROCEDURES,01,DISEASES AND DISORDERS OF THE NERVOUS SYSTEM,1,Minor,Minor,Surgical,Medicare,Blue Cross/Blue Shield,,,,false,36296.85,10647.72
New York City,Manhattan,7002054,001464,New York-Presbyterian Hospital - Columbia Presbyterian Center,50 to 69,100,M,Black/African American,Not Span/Hispanic,35,Urgent,Inpatient Rehabilitation Facility,2019,MAL001,CARDIAC AND CIRCULATORY CONGENITAL ANOMALIES,RAD003,STEREOTACTIC RADIOSURGERY,022,VENTRICULAR SHUNT PROCEDURES,01,DISEASES AND DISORDERS OF THE NERVOUS SYSTEM,3,Major,Major,Surgical,Private Health Insurance,Self-Pay,,,,false,605854.22,197191
Capital/Adirond,Albany,0101000,000001,Albany Medical Center Hospital,50 to 69,134,F,White,Not Span/Hispanic,1,Elective,Home or Self Care,2019,NVS020,OTHER SPECIFIED NERVOUS SYSTEM DISORDERS,CNS010,CEREBROSPINAL FLUID SHUNT PROCEDURES,022,VENTRICULAR SHUNT PROCEDURES,01,DISEASES AND DISORDERS OF THE NERVOUS SYSTEM,2,Moderate,Minor,Surgical,Blue Cross/Blue Shield,,,,,false,28977.95,13999.8
Finger Lakes,Monroe,2701005,000413,Strong Memorial Hospital,50 to 69,144,M,White,Not Span/Hispanic,7,Emergency,Home or Self Care,2019,NVS020,OTHER SPECIFIED NERVOUS SYSTEM DISORDERS,CNS010,CEREBROSPINAL FLUID SHUNT PROCEDURES,022,VENTRICULAR SHUNT PROCEDURES,01,DISEASES AND DISORDERS OF THE NERVOUS SYSTEM,1,Minor,Minor,Surgical,Medicare,,,,,true,50048.49,22207.9
New York City,Manhattan,7002054,001464,New York-Presbyterian Hospital - Columbia Presbyterian Center,70 or Older,OOS,M,Other Race,Not Span/Hispanic,4,Elective,Inpatient Rehabilitation Facility,2019,NVS020,OTHER SPECIFIED NERVOUS SYSTEM DISORDERS,CNS010,CEREBROSPINAL FLUID SHUNT PROCEDURES,022,VENTRICULAR SHUNT PROCEDURES,01,DISEASES AND DISORDERS OF THE NERVOUS SYSTEM,2,Moderate,Minor,Surgical,Medicare,Blue Cross/Blue Shield,Self-Pay,,,false,66409.17,18589.63
Western NY,Erie,1401014,000207,Buffalo General Medical Center,70 or Older,140,M,White,Not Span/Hispanic,2,Urgent,Home w/ Home Health Services,2019,NVS020,OTHER SPECIFIED NERVOUS SYSTEM DISORDERS,CNS010,CEREBROSPINAL FLUID SHUNT PROCEDURES,022,VENTRICULAR SHUNT PROCEDURES,01,DISEASES AND DISORDERS OF THE NERVOUS SYSTEM,2,Moderate,Minor,Surgical,Medicare,Self-Pay,,,,false,43323.7,14803.41
Long Island,Nassau,2950001,000527,Mount Sinai South Nassau,0 to 17,OOS,M,White,Unknown,9,Emergency,Home or Self Care,2019,INJ037,"COMPLICATION OF OTHER SURGICAL OR MEDICAL CARE, INJURY, INITIAL ENCOUNTER",MAM012,ICP AND OTHER CNS MONITORING (EXCLUDING EEG),022,VENTRICULAR SHUNT PROCEDURES,01,DISEASES AND DISORDERS OF THE NERVOUS SYSTEM,4,Extreme,Major,Surgical,Blue Cross/Blue Shield,,,,,true,243562.73,172722.46
New York City,Manhattan,7002017,001450,Lenox Hill Hospital,30 to 49,112,F,Black/African American,Not Span/Hispanic,12,Elective,Home or Self Care,2019,MAL004,NERVOUS SYSTEM CONGENITAL ANOMALIES,CNS010,CEREBROSPINAL FLUID SHUNT PROCEDURES,022,VENTRICULAR SHUNT PROCEDURES,01,DISEASES AND DISORDERS OF THE NERVOUS SYSTEM,2,Moderate,Minor,Surgical,Medicaid,Medicaid,,,,false,227527.16,52418.2
New York City,Manhattan,7002017,001450,Lenox Hill Hospital,70 or Older,OOS,M,White,Not Span/Hispanic,2,Elective,Home or Self Care,2019,NVS020,OTHER SPECIFIED NERVOUS SYSTEM DISORDERS,CNS010,CEREBROSPINAL FLUID SHUNT PROCEDURES,022,VENTRICULAR SHUNT PROCEDURES,01,DISEASES AND DISORDERS OF THE NERVOUS SYSTEM,2,Moderate,Minor,Surgical,Medicare,Blue Cross/Blue Shield,,,,false,86361.35,24961.08
New York City,Manhattan,7002054,001458,New York-Presbyterian Hospital - New York Weill Cornell Center,70 or Older,OOS,M,White,Not Span/Hispanic,2,Elective,Inpatient Rehabilitation Facility,2019,NVS020,OTHER SPECIFIED NERVOUS SYSTEM DISORDERS,CNS010,CEREBROSPINAL FLUID SHUNT PROCEDURES,022,VENTRICULAR SHUNT PROCEDURES,01,DISEASES AND DISORDERS OF THE NERVOUS SYSTEM,2,Moderate,Minor,Surgical,Medicare,Private Health Insurance,Self-Pay,,,false,86559.14,37751.66
Western NY,Erie,1401014,000207,Buffalo General Medical Center,50 to 69,142,F,White,Not Span/Hispanic,5,Emergency,Home w/ Home Health Services,2019,NVS020,OTHER SPECIFIED NERVOUS SYSTEM DISORDERS,CNS010,CEREBROSPINAL FLUID SHUNT PROCEDURES,022,VENTRICULAR SHUNT PROCEDURES,01,DISEASES AND DISORDERS OF THE NERVOUS SYSTEM,2,Moderate,Minor,Surgical,Medicare,Blue Cross/Blue Shield,Self-Pay,,,true,67773.16,21298.61
New York City,Manhattan,7002053,001463,NYU Langone Hospitals,50 to 69,OOS,M,White,Not Span/Hispanic,1,Elective,Home or Self Care,2019,INJ037,"COMPLICATION OF OTHER SURGICAL OR MEDICAL CARE, INJURY, INITIAL ENCOUNTER",CNS010,CEREBROSPINAL FLUID SHUNT PROCEDURES,022,VENTRICULAR SHUNT PROCEDURES,01,DISEASES AND DISORDERS OF THE NERVOUS SYSTEM,2,Moderate,Minor,Surgical,Medicare,Private Health Insurance,,,,false,84093.59,11780.59
New York City,Manhattan,7002053,001463,NYU Langone Hospitals,70 or Older,112,M,White,Not Span/Hispanic,9,Elective,Skilled Nursing Home,2019,NVS020,OTHER SPECIFIED NERVOUS SYSTEM DISORDERS,CNS010,CEREBROSPINAL FLUID SHUNT PROCEDURES,022,VENTRICULAR SHUNT PROCEDURES,01,DISEASES AND DISORDERS OF THE NERVOUS SYSTEM,4,Extreme,Major,Surgical,Medicare,Private Health Insurance,,,,false,235693.31,57215.97
Western NY,Erie,1401014,000207,Buffalo General Medical Center,18 to 29,141,F,White,Not Span/Hispanic,2,Emergency,Home or Self Care,2019,INJ037,"COMPLICATION OF OTHER SURGICAL OR MEDICAL CARE, INJURY, INITIAL ENCOUNTER",CNS014,"CNS PROCEDURES, NEC",022,VENTRICULAR SHUNT PROCEDURES,01,DISEASES AND DISORDERS OF THE NERVOUS SYSTEM,3,Major,Moderate,Surgical,Private Health Insurance,Medicaid,Self-Pay,,,true,44760.25,14992.11
Long Island,Nassau,2953000,000563,St. Francis Hospital & Heart Center,70 or Older,115,F,White,Not Span/Hispanic,6,Elective,Home w/ Home Health Services,2019,NVS020,OTHER SPECIFIED NERVOUS SYSTEM DISORDERS,CNS010,CEREBROSPINAL FLUID SHUNT PROCEDURES,022,VENTRICULAR SHUNT PROCEDURES,01,DISEASES AND DISORDERS OF THE NERVOUS SYSTEM,2,Moderate,Minor,Surgical,Medicare,Blue Cross/Blue Shield,,,,false,99571.88,18517.68
Long Island,Nassau,2909000,000513,Mercy Hospital,18 to 29,114,F,Black/African American,Not Span/Hispanic,8,Emergency,Home w/ Home Health Services,2019,INJ037,"COMPLICATION OF OTHER SURGICAL OR MEDICAL CARE, INJURY, INITIAL ENCOUNTER",CNS014,"CNS PROCEDURES, NEC",022,VENTRICULAR SHUNT PROCEDURES,01,DISEASES AND DISORDERS OF THE NERVOUS SYSTEM,2,Moderate,Minor,Surgical,Medicaid,Medicaid,,,,true,100744.11,16399.92