Hospital Service Area,Hospital County,Operating Certificate Number,Permanent Facility Id,Facility Name,Age Group,Zip Code - 3 digits,Gender,Race,Ethnicity,Length of Stay,Type of Admission,Patient Disposition,Discharge Year,CCS Diagnosis Code,CCS Diagnosis Description,CCS Procedure Code,CCS Procedure Description,APR DRG Code,APR DRG Description,APR MDC Code,APR MDC Description,APR Severity of Illness Code,APR Severity of Illness Description,APR Risk of Mortality,APR Medical Surgical Description,Payment Typology 1,Payment Typology 2,Payment Typology 3,Birth Weight,Abortion Edit Indicator,Emergency Department Indicator,Total Charges,Total Costs
New York City,Manhattan,7002001,001438,Bellevue Hospital Center,30 to 49,100,M,White,Not Span/Hispanic,50,Emergency,Inpatient Rehabilitation Facility,2020,NVS020,OTHER SPECIFIED NERVOUS SYSTEM DISORDERS,CNS010,CEREBROSPINAL FLUID SHUNT PROCEDURES,022,VENTRICULAR SHUNT PROCEDURES,01,DISEASES AND DISORDERS OF THE NERVOUS SYSTEM,2,Moderate,Minor,Surgical,Private Health Insurance,,,,,Y,365340.46,210101.45
New York City,Manhattan,7002001,001438,Bellevue Hospital Center,0 to 17,112,M,Black/African American,Spanish/Hispanic,4,Emergency,Home or Self Care,2020,INJ037,"COMPLICATION OF OTHER SURGICAL OR MEDICAL CARE, INJURY, INITIAL ENCOUNTER",CNS014,"CNS PROCEDURES, NEC",022,VENTRICULAR SHUNT PROCEDURES,01,DISEASES AND DISORDERS OF THE NERVOUS SYSTEM,2,Moderate,Minor,Surgical,Medicaid,,,,,Y,53613.71,30832.39
New York City,Manhattan,7002001,001438,Bellevue Hospital Center,0 to 17,112,M,Black/African American,Spanish/Hispanic,2,Emergency,Home or Self Care,2020,INJ037,"COMPLICATION OF OTHER SURGICAL OR MEDICAL CARE, INJURY, INITIAL ENCOUNTER",CNS014,"CNS PROCEDURES, NEC",022,VENTRICULAR SHUNT PROCEDURES,01,DISEASES AND DISORDERS OF THE NERVOUS SYSTEM,3,Major,Minor,Surgical,Medicaid,,,,,Y,32853.97,18893.79
New York City,Manhattan,7002001,001438,Bellevue Hospital Center,30 to 49,104,F,Other Race,Unknown,3,Emergency,Medicaid Cert Nursing Facility,2020,NVS020,OTHER SPECIFIED NERVOUS SYSTEM DISORDERS,CNS010,CEREBROSPINAL FLUID SHUNT PROCEDURES,022,VENTRICULAR SHUNT PROCEDURES,01,DISEASES AND DISORDERS OF THE NERVOUS SYSTEM,2,Moderate,Minor,Surgical,Medicaid,,,,,Y,63362.14,36438.55
New York City,Manhattan,7002001,001438,Bellevue Hospital Center,30 to 49,113,F,Other Race,Unknown,6,Urgent,Inpatient Rehabilitation Facility,2020,NVS020,OTHER SPECIFIED NERVOUS SYSTEM DISORDERS,CNS010,CEREBROSPINAL FLUID SHUNT PROCEDURES,022,VENTRICULAR SHUNT PROCEDURES,01,DISEASES AND DISORDERS OF THE NERVOUS SYSTEM,3,Major,Major,Surgical,Medicaid,,,,,N,72797.76,41864.83
New York City,Manhattan,7002001,001438,Bellevue Hospital Center,50 to 69,104,F,Other Race,Spanish/Hispanic,3,Emergency,Home or Self Care,2020,INJ037,"COMPLICATION OF OTHER SURGICAL OR MEDICAL CARE, INJURY, INITIAL ENCOUNTER",CNS010,CEREBROSPINAL FLUID SHUNT PROCEDURES,022,VENTRICULAR SHUNT PROCEDURES,01,DISEASES AND DISORDERS OF THE NERVOUS SYSTEM,3,Major,Extreme,Surgical,Medicaid,,,,,Y,50094.55,28808.57
New York City,Manhattan,7002001,001438,Bellevue Hospital Center,30 to 49,104,F,Black/African American,Not Span/Hispanic,4,Elective,Inpatient Rehabilitation Facility,2020,NVS020,OTHER SPECIFIED NERVOUS SYSTEM DISORDERS,CNS010,CEREBROSPINAL FLUID SHUNT PROCEDURES,022,VENTRICULAR SHUNT PROCEDURES,01,DISEASES AND DISORDERS OF THE NERVOUS SYSTEM,3,Major,Moderate,Surgical,Medicare,Medicaid,,,,N,30256.29,17399.91
New York City,Manhattan,7002001,001438,Bellevue Hospital Center,0 to 17,OOS,M,Black/African American,Not Span/Hispanic,5,Emergency,Home or Self Care,2020,MAL004,NERVOUS SYSTEM CONGENITAL ANOMALIES,CNS010,CEREBROSPINAL FLUID SHUNT PROCEDURES,022,VENTRICULAR SHUNT PROCEDURES,01,DISEASES AND DISORDERS OF THE NERVOUS SYSTEM,2,Moderate,Minor,Surgical,Medicaid,,,,,Y,59859.41,34424.19
New York City,Manhattan,7002001,001438,Bellevue Hospital Center,0 to 17,104,F,Other Race,Not Span/Hispanic,6,Emergency,Facility w/ Custodial/Supportive Care,2020,INJ037,"COMPLICATION OF OTHER SURGICAL OR MEDICAL CARE, INJURY, INITIAL ENCOUNTER",CNS014,"CNS PROCEDURES, NEC",022,VENTRICULAR SHUNT PROCEDURES,01,DISEASES AND DISORDERS OF THE NERVOUS SYSTEM,2,Moderate,Moderate,Surgical,Medicaid,,,,,Y,60596.58,34848.12
New York City,Manhattan,7002001,001438,Bellevue Hospital Center,30 to 49,104,M,Other Race,Spanish/Hispanic,13,Emergency,Home w/ Home Health Services,2020,NVS020,OTHER SPECIFIED NERVOUS SYSTEM DISORDERS,CNS010,CEREBROSPINAL FLUID SHUNT PROCEDURES,022,VENTRICULAR SHUNT PROCEDURES,01,DISEASES AND DISORDERS OF THE NERVOUS SYSTEM,4,Extreme,Major,Surgical,Medicaid,,,,,Y,157981.82,90852.82
New York City,Manhattan,7002001,001438,Bellevue Hospital Center,0 to 17,112,F,Black/African American,Spanish/Hispanic,11,Emergency,Another Type Not Listed,2020,INJ037,"COMPLICATION OF OTHER SURGICAL OR MEDICAL CARE, INJURY, INITIAL ENCOUNTER",CNS010,CEREBROSPINAL FLUID SHUNT PROCEDURES,022,VENTRICULAR SHUNT PROCEDURES,01,DISEASES AND DISORDERS OF THE NERVOUS SYSTEM,3,Major,Major,Surgical,Medicaid,,,,,Y,121192.05,69695.61
New York City,Manhattan,7002001,001438,Bellevue Hospital Center,50 to 69,114,F,Black/African American,Not Span/Hispanic,15,Urgent,Inpatient Rehabilitation Facility,2020,NVS020,OTHER SPECIFIED NERVOUS SYSTEM DISORDERS,CNS010,CEREBROSPINAL FLUID SHUNT PROCEDURES,022,VENTRICULAR SHUNT PROCEDURES,01,DISEASES AND DISORDERS OF THE NERVOUS SYSTEM,2,Moderate,Minor,Surgical,Medicare,Medicaid,,,,N,192337,110609.93
New York City,Manhattan,7002001,001438,Bellevue Hospital Center,0 to 17,,F,White,Unknown,66,Urgent,Cancer Center or Children's Hospital,2020,NVS020,OTHER SPECIFIED NERVOUS SYSTEM DISORDERS,CNS010,CEREBROSPINAL FLUID SHUNT PROCEDURES,022,VENTRICULAR SHUNT PROCEDURES,01,DISEASES AND DISORDERS OF THE NERVOUS SYSTEM,4,Extreme,Moderate,Surgical,Private Health Insurance,,,,,N,547771.49,315014.62
New York City,Manhattan,7002001,001438,Bellevue Hospital Center,30 to 49,114,F,Other Race,Not Span/Hispanic,10,Emergency,Home or Self Care,2020,INJ037,"COMPLICATION OF OTHER SURGICAL OR MEDICAL CARE, INJURY, INITIAL ENCOUNTER",CNS014,"CNS PROCEDURES, NEC",022,VENTRICULAR SHUNT PROCEDURES,01,DISEASES AND DISORDERS OF THE NERVOUS SYSTEM,2,Moderate,Major,Surgical,Medicaid,,,,,Y,115211.46,66256.27
