Hospital Service Area,Hospital County,Operating Certificate Number,Permanent Facility Id,Facility Name,Age Group,Zip Code - 3 digits,Gender,Race,Ethnicity,Length of Stay,Type of Admission,Patient Disposition,Discharge Year,CCS Diagnosis Code,CCS Diagnosis Description,CCS Procedure Code,CCS Procedure Description,APR DRG Code,APR DRG Description,APR MDC Code,APR MDC Description,APR Severity of Illness Code,APR Severity of Illness Description,APR Risk of Mortality,APR Medical Surgical Description,Payment Typology 1,Payment Typology 2,Payment Typology 3,Birth Weight,Abortion Edit Indicator,Emergency Department Indicator,Total Charges,Total Costs
New York City,Manhattan,7002001,001438,Bellevue Hospital Center,50 to 69,100,M,Other Race,Not Span/Hispanic,66,Emergency,Home or Self Care,2017,012,Cancer of esophagus,094,OT OR UP GI THER PRCS,220,"Major stomach, esophageal & duodenal procedures",06,Diseases and Disorders of the Digestive System,3,Major,Major,Surgical,Medicaid,,,,N,N,478279.94,308370.03
New York City,Manhattan,7002001,001438,Bellevue Hospital Center,70 or Older,112,M,Other Race,Not Span/Hispanic,22,Emergency,Home w/ Home Health Services,2017,013,Cancer of stomach,074,GASTRECTOMY; PART/TOTAL,220,"Major stomach, esophageal & duodenal procedures",06,Diseases and Disorders of the Digestive System,3,Major,Major,Surgical,Medicare,Medicare,,,N,Y,141238.32,91063.12
New York City,Manhattan,7002001,001438,Bellevue Hospital Center,30 to 49,100,M,White,Not Span/Hispanic,4,Emergency,Home or Self Care,2017,138,Esophageal disorders,094,OT OR UP GI THER PRCS,220,"Major stomach, esophageal & duodenal procedures",06,Diseases and Disorders of the Digestive System,1,Minor,Minor,Surgical,Medicaid,,,,N,N,22136.12,14272.22
New York City,Manhattan,7002001,001438,Bellevue Hospital Center,50 to 69,100,F,Other Race,Not Span/Hispanic,3,Emergency,Home or Self Care,2017,138,Esophageal disorders,094,OT OR UP GI THER PRCS,220,"Major stomach, esophageal & duodenal procedures",06,Diseases and Disorders of the Digestive System,1,Minor,Minor,Surgical,Medicaid,Medicaid,,,N,N,18193.59,11730.28
New York City,Manhattan,7002001,001438,Bellevue Hospital Center,50 to 69,104,M,Other Race,Not Span/Hispanic,36,Emergency,Home w/ Home Health Services,2017,013,Cancer of stomach,094,OT OR UP GI THER PRCS,220,"Major stomach, esophageal & duodenal procedures",06,Diseases and Disorders of the Digestive System,4,Extreme,Extreme,Surgical,Medicaid,Medicaid,,,N,N,268800.86,173308.82
New York City,Manhattan,7002001,001438,Bellevue Hospital Center,30 to 49,112,F,Other Race,Spanish/Hispanic,20,Emergency,Home w/ Home Health Services,2017,238,Complications of surgical procedures or medical care,094,OT OR UP GI THER PRCS,220,"Major stomach, esophageal & duodenal procedures",06,Diseases and Disorders of the Digestive System,3,Major,Minor,Surgical,Medicaid,Medicaid,,,N,Y,108924.95,70229.14
New York City,Manhattan,7002001,001438,Bellevue Hospital Center,30 to 49,104,M,Other Race,Spanish/Hispanic,2,Emergency,Home or Self Care,2017,138,Esophageal disorders,094,OT OR UP GI THER PRCS,220,"Major stomach, esophageal & duodenal procedures",06,Diseases and Disorders of the Digestive System,1,Minor,Minor,Surgical,Self-Pay,,,,N,N,13053.82,8416.42
New York City,Manhattan,7002001,001438,Bellevue Hospital Center,50 to 69,104,M,Other Race,Not Span/Hispanic,20,Elective,Home w/ Home Health Services,2017,155,Other gastrointestinal disorders,096,OT OR LOW GI THER PRCS,220,"Major stomach, esophageal & duodenal procedures",06,Diseases and Disorders of the Digestive System,3,Major,Moderate,Surgical,Medicaid,,,,N,N,111622.56,71968.42
New York City,Manhattan,7002001,001438,Bellevue Hospital Center,70 or Older,112,F,Black/African American,Not Span/Hispanic,18,Emergency,Home or Self Care,2017,138,Esophageal disorders,094,OT OR UP GI THER PRCS,220,"Major stomach, esophageal & duodenal procedures",06,Diseases and Disorders of the Digestive System,1,Minor,Moderate,Surgical,Medicare,Medicare,,,N,Y,98158.33,63287.39
New York City,Manhattan,7002001,001438,Bellevue Hospital Center,30 to 49,104,F,Other Race,Not Span/Hispanic,2,Emergency,Home or Self Care,2017,238,Complications of surgical procedures or medical care,094,OT OR UP GI THER PRCS,220,"Major stomach, esophageal & duodenal procedures",06,Diseases and Disorders of the Digestive System,1,Minor,Minor,Surgical,Medicaid,,,,N,Y,14459.01,9322.42
New York City,Manhattan,7002001,001438,Bellevue Hospital Center,70 or Older,113,M,Other Race,Not Span/Hispanic,10,Elective,Home or Self Care,2017,012,Cancer of esophagus,094,OT OR UP GI THER PRCS,220,"Major stomach, esophageal & duodenal procedures",06,Diseases and Disorders of the Digestive System,3,Major,Minor,Surgical,Medicaid,,,,N,N,64215.36,41402.72
New York City,Manhattan,7002001,001438,Bellevue Hospital Center,30 to 49,112,F,White,Not Span/Hispanic,7,Emergency,Home or Self Care,2017,238,Complications of surgical procedures or medical care,094,OT OR UP GI THER PRCS,220,"Major stomach, esophageal & duodenal procedures",06,Diseases and Disorders of the Digestive System,1,Minor,Minor,Surgical,Medicaid,Medicaid,,,N,N,43847.14,28270.36
New York City,Manhattan,7002001,001438,Bellevue Hospital Center,50 to 69,112,M,Black/African American,Not Span/Hispanic,11,Elective,Home or Self Care,2017,047,Other and unspecified benign neoplasm,094,OT OR UP GI THER PRCS,220,"Major stomach, esophageal & duodenal procedures",06,Diseases and Disorders of the Digestive System,3,Major,Major,Surgical,Medicare,Medicare,,,N,N,66744.55,43033.42
New York City,Manhattan,7002001,001438,Bellevue Hospital Center,50 to 69,113,F,Black/African American,Not Span/Hispanic,13,Emergency,Home or Self Care,2017,238,Complications of surgical procedures or medical care,042,OT OR RX PRCS RESP SYS,220,"Major stomach, esophageal & duodenal procedures",06,Diseases and Disorders of the Digestive System,3,Major,Moderate,Surgical,Medicaid,Medicaid,,,N,Y,77137.09,49733.98
New York City,Manhattan,7002001,001438,Bellevue Hospital Center,30 to 49,112,F,Other Race,Not Span/Hispanic,1,Emergency,Home or Self Care,2017,155,Other gastrointestinal disorders,094,OT OR UP GI THER PRCS,220,"Major stomach, esophageal & duodenal procedures",06,Diseases and Disorders of the Digestive System,2,Moderate,Minor,Surgical,Medicaid,Medicaid,,,N,N,6456.35,4162.72
New York City,Manhattan,7002001,001438,Bellevue Hospital Center,30 to 49,111,M,Other Race,Not Span/Hispanic,2,Emergency,Home or Self Care,2017,138,Esophageal disorders,094,OT OR UP GI THER PRCS,220,"Major stomach, esophageal & duodenal procedures",06,Diseases and Disorders of the Digestive System,1,Minor,Minor,Surgical,Medicaid,Medicaid,,,N,N,13053.82,8416.42
New York City,Manhattan,7002001,001438,Bellevue Hospital Center,50 to 69,100,F,Other Race,Spanish/Hispanic,7,Emergency,Home or Self Care,2017,138,Esophageal disorders,094,OT OR UP GI THER PRCS,220,"Major stomach, esophageal & duodenal procedures",06,Diseases and Disorders of the Digestive System,1,Minor,Minor,Surgical,Medicaid,Medicaid,,,N,Y,39682.31,25585.09
New York City,Manhattan,7002001,001438,Bellevue Hospital Center,50 to 69,111,M,Other Race,Not Span/Hispanic,4,Elective,Expired,2017,018,Cancer of other GI organs; peritoneum,099,OT OR GI THER PRCS,220,"Major stomach, esophageal & duodenal procedures",06,Diseases and Disorders of the Digestive System,1,Minor,Minor,Surgical,Medicaid,,,,N,N,26552.76,17119.84
New York City,Manhattan,7002001,001438,Bellevue Hospital Center,70 or Older,112,F,White,Not Span/Hispanic,53,Emergency,Skilled Nursing Home,2017,014,Cancer of colon,078,COLORECTAL RESECTION,220,"Major stomach, esophageal & duodenal procedures",06,Diseases and Disorders of the Digestive System,4,Extreme,Extreme,Surgical,Medicare,,,,N,N,294318.12,189761.02
New York City,Manhattan,7002001,001438,Bellevue Hospital Center,50 to 69,112,F,Other Race,Not Span/Hispanic,28,Emergency,Home w/ Home Health Services,2017,155,Other gastrointestinal disorders,094,OT OR UP GI THER PRCS,220,"Major stomach, esophageal & duodenal procedures",06,Diseases and Disorders of the Digestive System,4,Extreme,Moderate,Surgical,Medicaid,,,,N,Y,188539.15,121560.24
New York City,Manhattan,7002001,001438,Bellevue Hospital Center,50 to 69,113,M,Other Race,Not Span/Hispanic,9,Emergency,Home or Self Care,2017,143,Abdominal hernia,042,OT OR RX PRCS RESP SYS,220,"Major stomach, esophageal & duodenal procedures",06,Diseases and Disorders of the Digestive System,1,Minor,Minor,Surgical,Medicaid,Medicaid,,,N,Y,56681.49,36545.28
New York City,Manhattan,7002001,001438,Bellevue Hospital Center,50 to 69,100,M,Other Race,Not Span/Hispanic,7,Emergency,Home or Self Care,2017,155,Other gastrointestinal disorders,093,OT NON-OR UP GI THER PR,220,"Major stomach, esophageal & duodenal procedures",06,Diseases and Disorders of the Digestive System,3,Major,Moderate,Surgical,Medicaid,,,,N,Y,38910.67,25087.58
New York City,Manhattan,7002001,001438,Bellevue Hospital Center,50 to 69,113,F,Other Race,Not Span/Hispanic,10,Elective,Home or Self Care,2017,013,Cancer of stomach,074,GASTRECTOMY; PART/TOTAL,220,"Major stomach, esophageal & duodenal procedures",06,Diseases and Disorders of the Digestive System,3,Major,Moderate,Surgical,Self-Pay,,,,N,N,69495.79,44807.27
New York City,Manhattan,7002001,001438,Bellevue Hospital Center,50 to 69,114,F,Black/African American,Not Span/Hispanic,8,Emergency,Home or Self Care,2017,047,Other and unspecified benign neoplasm,099,OT OR GI THER PRCS,220,"Major stomach, esophageal & duodenal procedures",06,Diseases and Disorders of the Digestive System,2,Moderate,Minor,Surgical,Medicaid,Medicaid,,,N,N,49123.97,31672.58
New York City,Manhattan,7002001,001438,Bellevue Hospital Center,18 to 29,100,F,Black/African American,Not Span/Hispanic,29,Emergency,Home or Self Care,2017,012,Cancer of esophagus,074,GASTRECTOMY; PART/TOTAL,220,"Major stomach, esophageal & duodenal procedures",06,Diseases and Disorders of the Digestive System,4,Extreme,Major,Surgical,Medicaid,Medicaid,,,N,Y,209653.05,135173.38
New York City,Manhattan,7002001,001438,Bellevue Hospital Center,50 to 69,114,M,Black/African American,Not Span/Hispanic,3,Elective,Home or Self Care,2017,044,Neoplasms of unspecified nature or uncertain behavior,074,GASTRECTOMY; PART/TOTAL,220,"Major stomach, esophageal & duodenal procedures",06,Diseases and Disorders of the Digestive System,2,Moderate,Minor,Surgical,Self-Pay,,,,N,N,17700.88,11412.61
New York City,Manhattan,7002001,001438,Bellevue Hospital Center,30 to 49,100,M,White,Not Span/Hispanic,34,Emergency,Home or Self Care,2017,235,Open wounds of head; neck; and trunk,074,GASTRECTOMY; PART/TOTAL,220,"Major stomach, esophageal & duodenal procedures",06,Diseases and Disorders of the Digestive System,2,Moderate,Major,Surgical,Medicaid,Medicaid,,,N,Y,174082.55,112239.38
New York City,Manhattan,7002001,001438,Bellevue Hospital Center,50 to 69,112,F,Other Race,Spanish/Hispanic,4,Emergency,Home or Self Care,2017,238,Complications of surgical procedures or medical care,094,OT OR UP GI THER PRCS,220,"Major stomach, esophageal & duodenal procedures",06,Diseases and Disorders of the Digestive System,1,Minor,Minor,Surgical,Medicaid,Medicaid,,,N,Y,24967.55,16097.78
New York City,Manhattan,7002001,001438,Bellevue Hospital Center,30 to 49,104,M,Other Race,Spanish/Hispanic,3,Emergency,Home or Self Care,2017,047,Other and unspecified benign neoplasm,042,OT OR RX PRCS RESP SYS,220,"Major stomach, esophageal & duodenal procedures",06,Diseases and Disorders of the Digestive System,1,Minor,Minor,Surgical,Self-Pay,,,,N,N,14536.22,9372.20
New York City,Manhattan,7002001,001438,Bellevue Hospital Center,50 to 69,112,M,Other Race,Not Span/Hispanic,41,Emergency,Home w/ Home Health Services,2017,013,Cancer of stomach,094,OT OR UP GI THER PRCS,220,"Major stomach, esophageal & duodenal procedures",06,Diseases and Disorders of the Digestive System,4,Extreme,Extreme,Surgical,Medicaid,,,,N,Y,242408.66,156292.50
New York City,Manhattan,7002001,001438,Bellevue Hospital Center,50 to 69,111,M,Other Race,Not Span/Hispanic,3,Elective,Home or Self Care,2017,138,Esophageal disorders,094,OT OR UP GI THER PRCS,220,"Major stomach, esophageal & duodenal procedures",06,Diseases and Disorders of the Digestive System,1,Minor,Minor,Surgical,Self-Pay,,,,N,N,17377.49,11204.10
New York City,Manhattan,7002001,001438,Bellevue Hospital Center,50 to 69,112,M,Black/African American,Not Span/Hispanic,17,Emergency,Home w/ Home Health Services,2017,138,Esophageal disorders,070,UP GASTRO ENDOSC/BIOPSY,220,"Major stomach, esophageal & duodenal procedures",06,Diseases and Disorders of the Digestive System,4,Extreme,Major,Surgical,Blue Cross/Blue Shield,,,,N,Y,122046.44,78689.20
New York City,Manhattan,7002001,001438,Bellevue Hospital Center,30 to 49,OOS,F,White,Not Span/Hispanic,2,Emergency,Home or Self Care,2017,145,Intestinal obstruction without hernia,094,OT OR UP GI THER PRCS,220,"Major stomach, esophageal & duodenal procedures",06,Diseases and Disorders of the Digestive System,1,Minor,Minor,Surgical,Blue Cross/Blue Shield,,,,N,Y,15317.89,9876.18
New York City,Manhattan,7002001,001438,Bellevue Hospital Center,50 to 69,104,M,Other Race,Spanish/Hispanic,21,Emergency,Home or Self Care,2017,138,Esophageal disorders,094,OT OR UP GI THER PRCS,220,"Major stomach, esophageal & duodenal procedures",06,Diseases and Disorders of the Digestive System,3,Major,Minor,Surgical,Medicaid,Medicaid,,,N,Y,104941.26,67660.67
New York City,Manhattan,7002001,001438,Bellevue Hospital Center,30 to 49,112,F,Other Race,Not Span/Hispanic,19,Elective,Home or Self Care,2017,238,Complications of surgical procedures or medical care,074,GASTRECTOMY; PART/TOTAL,220,"Major stomach, esophageal & duodenal procedures",06,Diseases and Disorders of the Digestive System,3,Major,Moderate,Surgical,Medicare,Medicare,Medicaid,,N,N,94106.40,60674.91
New York City,Manhattan,7002001,001438,Bellevue Hospital Center,30 to 49,100,F,Other Race,Not Span/Hispanic,2,Emergency,Home or Self Care,2017,238,Complications of surgical procedures or medical care,093,OT NON-OR UP GI THER PR,220,"Major stomach, esophageal & duodenal procedures",06,Diseases and Disorders of the Digestive System,1,Minor,Minor,Surgical,Medicaid,Medicaid,,,N,N,12757.41,8225.31
