Hospital Service Area,Hospital County,Operating Certificate Number,Permanent Facility Id,Facility Name,Age Group,Zip Code - 3 digits,Gender,Race,Ethnicity,Length of Stay,Type of Admission,Patient Disposition,Discharge Year,CCS Diagnosis Code,CCS Diagnosis Description,CCS Procedure Code,CCS Procedure Description,APR DRG Code,APR DRG Description,APR MDC Code,APR MDC Description,APR Severity of Illness Code,APR Severity of Illness Description,APR Risk of Mortality,APR Medical Surgical Description,Payment Typology 1,Payment Typology 2,Payment Typology 3,Birth Weight,Abortion Edit Indicator,Emergency Department Indicator,Total Charges,Total Costs
Long Island,Suffolk,5151001,000245,Stony Brook University Hospital,30 to 49,117,F,White,Not Span/Hispanic,10,Emergency,Home or Self Care,2019,DIG005,GASTRODUODENAL ULCER,GIS021,GI SYSTEM REPAIR (EXCLUDING ANORECTAL),220,"MAJOR STOMACH, ESOPHAGEAL & DUODENAL PROCEDURES",06,DISEASES AND DISORDERS OF THE DIGESTIVE SYSTEM,2,Moderate,Moderate,Surgical,Medicaid,Medicaid,,,,false,101382.89,33515.39
Long Island,Suffolk,5151001,000245,Stony Brook University Hospital,70 or Older,119,F,White,Not Span/Hispanic,2,Emergency,Home or Self Care,2019,DIG010,ABDOMINAL HERNIA,RES011,DIAPHRAGMATIC HERNIA REPAIR,220,"MAJOR STOMACH, ESOPHAGEAL & DUODENAL PROCEDURES",06,DISEASES AND DISORDERS OF THE DIGESTIVE SYSTEM,1,Minor,Moderate,Surgical,Medicare,Private Health Insurance,,,,true,44746.5,17568.39
New York City,Manhattan,7002054,001458,New York-Presbyterian Hospital - New York Weill Cornell Center,50 to 69,112,F,Black/African American,Not Span/Hispanic,2,Elective,Home or Self Care,2019,DIG024,POSTPROCEDURAL OR POSTOPERATIVE DIGESTIVE SYSTEM COMPLICATION,GIS019,GASTRO-JEJUNAL BYPASS (INCLUDING BARIATRIC),220,"MAJOR STOMACH, ESOPHAGEAL & DUODENAL PROCEDURES",06,DISEASES AND DISORDERS OF THE DIGESTIVE SYSTEM,1,Minor,Minor,Surgical,Blue Cross/Blue Shield,Self-Pay,,,,false,81767.87,19755.65
New York City,Kings,7002053,001304,NYU Langone Hospital-Brooklyn,70 or Older,112,F,White,Spanish/Hispanic,2,Elective,Home or Self Care,2019,DIG010,ABDOMINAL HERNIA,RES011,DIAPHRAGMATIC HERNIA REPAIR,220,"MAJOR STOMACH, ESOPHAGEAL & DUODENAL PROCEDURES",06,DISEASES AND DISORDERS OF THE DIGESTIVE SYSTEM,2,Moderate,Minor,Surgical,Medicare,Blue Cross/Blue Shield,,,,false,150855.01,25703.09
New York City,Manhattan,7002054,001458,New York-Presbyterian Hospital - New York Weill Cornell Center,70 or Older,110,M,Other Race,Not Span/Hispanic,1,Emergency,Home or Self Care,2019,DIG010,ABDOMINAL HERNIA,RES011,DIAPHRAGMATIC HERNIA REPAIR,220,"MAJOR STOMACH, ESOPHAGEAL & DUODENAL PROCEDURES",06,DISEASES AND DISORDERS OF THE DIGESTIVE SYSTEM,1,Minor,Minor,Surgical,Medicare,Private Health Insurance,Self-Pay,,,false,46047.13,13866.45
New York City,Manhattan,7002054,001458,New York-Presbyterian Hospital - New York Weill Cornell Center,70 or Older,112,M,White,Not Span/Hispanic,18,Elective,Skilled Nursing Home,2019,DIG004,ESOPHAGEAL DISORDERS,GIS010,GASTRECTOMY,220,"MAJOR STOMACH, ESOPHAGEAL & DUODENAL PROCEDURES",06,DISEASES AND DISORDERS OF THE DIGESTIVE SYSTEM,3,Major,Major,Surgical,Medicare,Blue Cross/Blue Shield,Self-Pay,,,false,428474.45,182451.22
Long Island,Nassau,2908000,000511,NYU Langone Hospital-Long Island,70 or Older,113,F,White,Not Span/Hispanic,2,Urgent,Home w/ Home Health Services,2019,DIG010,ABDOMINAL HERNIA,RES011,DIAPHRAGMATIC HERNIA REPAIR,220,"MAJOR STOMACH, ESOPHAGEAL & DUODENAL PROCEDURES",06,DISEASES AND DISORDERS OF THE DIGESTIVE SYSTEM,1,Minor,Minor,Surgical,Medicare,Medicare,Medicaid,,,false,135950.48,21105.43
New York City,Manhattan,7002054,001458,New York-Presbyterian Hospital - New York Weill Cornell Center,0 to 17,113,F,Multi-racial,Spanish/Hispanic,7,Emergency,Home w/ Home Health Services,2019,DIG010,ABDOMINAL HERNIA,RES011,DIAPHRAGMATIC HERNIA REPAIR,220,"MAJOR STOMACH, ESOPHAGEAL & DUODENAL PROCEDURES",06,DISEASES AND DISORDERS OF THE DIGESTIVE SYSTEM,2,Moderate,Minor,Surgical,Medicaid,Self-Pay,,,,true,206659.18,83184.27
Capital/Adirond,Albany,0101004,000005,St. Peter's Hospital,70 or Older,,F,Other Race,Not Span/Hispanic,4,Elective,Home or Self Care,2019,NEO073,BENIGN NEOPLASMS,GIS026,"UPPER GI THERAPEUTIC PROCEDURES, NEC (OPEN AND LAPAROSCOPIC)",220,"MAJOR STOMACH, ESOPHAGEAL & DUODENAL PROCEDURES",06,DISEASES AND DISORDERS OF THE DIGESTIVE SYSTEM,2,Moderate,Minor,Surgical,Medicare,Private Health Insurance,,,,false,35727.65,15154.29
Capital/Adirond,Albany,0101004,000005,St. Peter's Hospital,30 to 49,121,F,White,Not Span/Hispanic,4,Elective,Home or Self Care,2019,DIG010,ABDOMINAL HERNIA,RES011,DIAPHRAGMATIC HERNIA REPAIR,220,"MAJOR STOMACH, ESOPHAGEAL & DUODENAL PROCEDURES",06,DISEASES AND DISORDERS OF THE DIGESTIVE SYSTEM,1,Minor,Minor,Surgical,Private Health Insurance,,,,,false,27941.3,12154.56
Finger Lakes,Monroe,2701001,000409,Highland Hospital,30 to 49,145,F,White,Unknown,2,Elective,Home or Self Care,2019,DIG010,ABDOMINAL HERNIA,RES011,DIAPHRAGMATIC HERNIA REPAIR,220,"MAJOR STOMACH, ESOPHAGEAL & DUODENAL PROCEDURES",06,DISEASES AND DISORDERS OF THE DIGESTIVE SYSTEM,1,Minor,Minor,Surgical,Self-Pay,,,,,false,21271.55,6765.9
Hudson Valley,Westchester,5902001,001045,White Plains Hospital Center,50 to 69,105,F,Other Race,Not Span/Hispanic,3,Elective,Home or Self Care,2019,DIG010,ABDOMINAL HERNIA,RES011,DIAPHRAGMATIC HERNIA REPAIR,220,"MAJOR STOMACH, ESOPHAGEAL & DUODENAL PROCEDURES",06,DISEASES AND DISORDERS OF THE DIGESTIVE SYSTEM,1,Minor,Minor,Surgical,Medicare,,,,,false,83681,15536.07
Finger Lakes,Monroe,2701003,000411,Rochester General Hospital,30 to 49,145,M,White,Not Span/Hispanic,9,Elective,Home or Self Care,2019,NEO013,GASTROINTESTINAL CANCERS - STOMACH,GIS010,GASTRECTOMY,220,"MAJOR STOMACH, ESOPHAGEAL & DUODENAL PROCEDURES",06,DISEASES AND DISORDERS OF THE DIGESTIVE SYSTEM,3,Major,Minor,Surgical,Medicaid,,,,,false,49521.42,22268.14
New York City,Manhattan,7002001,001438,Bellevue Hospital Center,70 or Older,112,M,Black/African American,Not Span/Hispanic,3,Emergency,Home or Self Care,2019,DIG004,ESOPHAGEAL DISORDERS,IMG004,FLUOROSCOPY OF NON-CIRCULATORY ORGANS,220,"MAJOR STOMACH, ESOPHAGEAL & DUODENAL PROCEDURES",06,DISEASES AND DISORDERS OF THE DIGESTIVE SYSTEM,2,Moderate,Minor,Surgical,Medicare,Medicare,Medicaid,,,false,17831.09,11850.54
Capital/Adirond,Albany,0101004,000005,St. Peter's Hospital,50 to 69,121,M,White,Not Span/Hispanic,14,Elective,Home or Self Care,2019,NEO012,GASTROINTESTINAL CANCERS - ESOPHAGUS,GIS026,"UPPER GI THERAPEUTIC PROCEDURES, NEC (OPEN AND LAPAROSCOPIC)",220,"MAJOR STOMACH, ESOPHAGEAL & DUODENAL PROCEDURES",06,DISEASES AND DISORDERS OF THE DIGESTIVE SYSTEM,4,Extreme,Extreme,Surgical,Medicare,Medicare,,,,false,121222.4,46802.25
Capital/Adirond,Albany,0101004,000005,St. Peter's Hospital,50 to 69,122,M,White,Not Span/Hispanic,1,Elective,Home or Self Care,2019,DIG008,OTHER SPECIFIED AND UNSPECIFIED DISORDERS OF STOMACH AND DUODENUM,GIS019,GASTRO-JEJUNAL BYPASS (INCLUDING BARIATRIC),220,"MAJOR STOMACH, ESOPHAGEAL & DUODENAL PROCEDURES",06,DISEASES AND DISORDERS OF THE DIGESTIVE SYSTEM,1,Minor,Minor,Surgical,Medicare,Blue Cross/Blue Shield,,,,false,32834.4,13025.98
New York City,Manhattan,7002053,001463,NYU Langone Hospitals,50 to 69,112,M,Other Race,Unknown,1,Elective,Home or Self Care,2019,DIG024,POSTPROCEDURAL OR POSTOPERATIVE DIGESTIVE SYSTEM COMPLICATION,GIS026,"UPPER GI THERAPEUTIC PROCEDURES, NEC (OPEN AND LAPAROSCOPIC)",220,"MAJOR STOMACH, ESOPHAGEAL & DUODENAL PROCEDURES",06,DISEASES AND DISORDERS OF THE DIGESTIVE SYSTEM,1,Minor,Minor,Surgical,Blue Cross/Blue Shield,,,,,false,112072.36,18782.71
Capital/Adirond,Albany,0101004,000005,St. Peter's Hospital,70 or Older,121,F,White,Not Span/Hispanic,4,Elective,Home or Self Care,2019,DIG010,ABDOMINAL HERNIA,RES011,DIAPHRAGMATIC HERNIA REPAIR,220,"MAJOR STOMACH, ESOPHAGEAL & DUODENAL PROCEDURES",06,DISEASES AND DISORDERS OF THE DIGESTIVE SYSTEM,1,Minor,Minor,Surgical,Medicare,Blue Cross/Blue Shield,,,,false,32729.4,13844.05
Capital/Adirond,Albany,0101004,000005,St. Peter's Hospital,70 or Older,122,F,White,Not Span/Hispanic,5,Elective,Home or Self Care,2019,DIG010,ABDOMINAL HERNIA,RES011,DIAPHRAGMATIC HERNIA REPAIR,220,"MAJOR STOMACH, ESOPHAGEAL & DUODENAL PROCEDURES",06,DISEASES AND DISORDERS OF THE DIGESTIVE SYSTEM,1,Minor,Minor,Surgical,Medicare,Medicare,,,,false,37452.05,15887.96
Capital/Adirond,Albany,0101004,000005,St. Peter's Hospital,70 or Older,120,M,White,Not Span/Hispanic,4,Elective,Home or Self Care,2019,DIG010,ABDOMINAL HERNIA,RES011,DIAPHRAGMATIC HERNIA REPAIR,220,"MAJOR STOMACH, ESOPHAGEAL & DUODENAL PROCEDURES",06,DISEASES AND DISORDERS OF THE DIGESTIVE SYSTEM,1,Minor,Minor,Surgical,Medicare,Medicare,,,,false,31167.35,13489.62
Hudson Valley,Westchester,5957001,001139,Westchester Medical Center,30 to 49,109,M,White,Not Span/Hispanic,1,Elective,Home or Self Care,2019,DIG004,ESOPHAGEAL DISORDERS,GIS026,"UPPER GI THERAPEUTIC PROCEDURES, NEC (OPEN AND LAPAROSCOPIC)",220,"MAJOR STOMACH, ESOPHAGEAL & DUODENAL PROCEDURES",06,DISEASES AND DISORDERS OF THE DIGESTIVE SYSTEM,1,Minor,Minor,Surgical,Blue Cross/Blue Shield,,,,,false,43061.53,8458.38
Long Island,Suffolk,5151001,000245,Stony Brook University Hospital,70 or Older,117,M,White,Not Span/Hispanic,14,Elective,Home w/ Home Health Services,2019,NEO013,GASTROINTESTINAL CANCERS - STOMACH,GIS010,GASTRECTOMY,220,"MAJOR STOMACH, ESOPHAGEAL & DUODENAL PROCEDURES",06,DISEASES AND DISORDERS OF THE DIGESTIVE SYSTEM,3,Major,Moderate,Surgical,Medicare,Blue Cross/Blue Shield,,,,false,152408.03,52177.82
New York City,Kings,7001002,001286,Brookdale Hospital Medical Center,50 to 69,112,M,Black/African American,Unknown,3,Emergency,Home or Self Care,2019,DIG010,ABDOMINAL HERNIA,RES011,DIAPHRAGMATIC HERNIA REPAIR,220,"MAJOR STOMACH, ESOPHAGEAL & DUODENAL PROCEDURES",06,DISEASES AND DISORDERS OF THE DIGESTIVE SYSTEM,1,Minor,Minor,Surgical,Medicaid,,,,,true,33813.74,20386.48
Capital/Adirond,Albany,0101004,000005,St. Peter's Hospital,30 to 49,123,F,White,Not Span/Hispanic,4,Elective,Home or Self Care,2019,DIG010,ABDOMINAL HERNIA,RES011,DIAPHRAGMATIC HERNIA REPAIR,220,"MAJOR STOMACH, ESOPHAGEAL & DUODENAL PROCEDURES",06,DISEASES AND DISORDERS OF THE DIGESTIVE SYSTEM,1,Minor,Minor,Surgical,Blue Cross/Blue Shield,,,,,false,30474.45,13469.54
New York City,Manhattan,7002054,001464,New York-Presbyterian Hospital - Columbia Presbyterian Center,50 to 69,107,M,White,Not Span/Hispanic,1,Elective,Home or Self Care,2019,DIG004,ESOPHAGEAL DISORDERS,GIS026,"UPPER GI THERAPEUTIC PROCEDURES, NEC (OPEN AND LAPAROSCOPIC)",220,"MAJOR STOMACH, ESOPHAGEAL & DUODENAL PROCEDURES",06,DISEASES AND DISORDERS OF THE DIGESTIVE SYSTEM,1,Minor,Minor,Surgical,Blue Cross/Blue Shield,Self-Pay,,,,false,79581.71,22211.15
New York City,Manhattan,7002054,001464,New York-Presbyterian Hospital - Columbia Presbyterian Center,70 or Older,OOS,F,White,Not Span/Hispanic,1,Elective,Home or Self Care,2019,DIG010,ABDOMINAL HERNIA,RES011,DIAPHRAGMATIC HERNIA REPAIR,220,"MAJOR STOMACH, ESOPHAGEAL & DUODENAL PROCEDURES",06,DISEASES AND DISORDERS OF THE DIGESTIVE SYSTEM,1,Minor,Minor,Surgical,Blue Cross/Blue Shield,Self-Pay,,,,false,44553.64,14355.33
New York City,Manhattan,7002053,001463,NYU Langone Hospitals,50 to 69,103,F,Other Race,Spanish/Hispanic,5,Elective,Home or Self Care,2019,DIG024,POSTPROCEDURAL OR POSTOPERATIVE DIGESTIVE SYSTEM COMPLICATION,GIS026,"UPPER GI THERAPEUTIC PROCEDURES, NEC (OPEN AND LAPAROSCOPIC)",220,"MAJOR STOMACH, ESOPHAGEAL & DUODENAL PROCEDURES",06,DISEASES AND DISORDERS OF THE DIGESTIVE SYSTEM,3,Major,Minor,Surgical,Private Health Insurance,,,,,false,208731.29,39897.21
New York City,Manhattan,7002053,001463,NYU Langone Hospitals,30 to 49,,M,Black/African American,Not Span/Hispanic,3,Elective,Home w/ Home Health Services,2019,DIG004,ESOPHAGEAL DISORDERS,GIS019,GASTRO-JEJUNAL BYPASS (INCLUDING BARIATRIC),220,"MAJOR STOMACH, ESOPHAGEAL & DUODENAL PROCEDURES",06,DISEASES AND DISORDERS OF THE DIGESTIVE SYSTEM,1,Minor,Minor,Surgical,Blue Cross/Blue Shield,,,,,false,178723.54,31222.47
New York City,Manhattan,7002024,001456,Mount Sinai Hospital,70 or Older,OOS,M,White,Not Span/Hispanic,18,Elective,Home w/ Home Health Services,2019,NEO070,SECONDARY MALIGNANCIES,GIS014,ESOPHAGECTOMY,220,"MAJOR STOMACH, ESOPHAGEAL & DUODENAL PROCEDURES",06,DISEASES AND DISORDERS OF THE DIGESTIVE SYSTEM,3,Major,Major,Surgical,Medicare,Medicare,Self-Pay,,,false,246497.46,79346.22
Long Island,Nassau,2908000,000511,NYU Langone Hospital-Long Island,50 to 69,115,F,White,Not Span/Hispanic,2,Urgent,Home or Self Care,2019,DIG010,ABDOMINAL HERNIA,GIS026,"UPPER GI THERAPEUTIC PROCEDURES, NEC (OPEN AND LAPAROSCOPIC)",220,"MAJOR STOMACH, ESOPHAGEAL & DUODENAL PROCEDURES",06,DISEASES AND DISORDERS OF THE DIGESTIVE SYSTEM,1,Minor,Minor,Surgical,Blue Cross/Blue Shield,,,,,false,146072.49,43018.69
New York City,Manhattan,7002054,001458,New York-Presbyterian Hospital - New York Weill Cornell Center,50 to 69,114,M,Other Race,Not Span/Hispanic,1,Elective,Home or Self Care,2019,DIG010,ABDOMINAL HERNIA,GIS026,"UPPER GI THERAPEUTIC PROCEDURES, NEC (OPEN AND LAPAROSCOPIC)",220,"MAJOR STOMACH, ESOPHAGEAL & DUODENAL PROCEDURES",06,DISEASES AND DISORDERS OF THE DIGESTIVE SYSTEM,1,Minor,Minor,Surgical,Medicare,Private Health Insurance,Self-Pay,,,false,50096.25,18508.98
Western NY,Erie,1401008,000213,Mercy Hospital of Buffalo,70 or Older,140,F,White,Not Span/Hispanic,7,Elective,Home w/ Home Health Services,2019,DIG010,ABDOMINAL HERNIA,RES011,DIAPHRAGMATIC HERNIA REPAIR,220,"MAJOR STOMACH, ESOPHAGEAL & DUODENAL PROCEDURES",06,DISEASES AND DISORDERS OF THE DIGESTIVE SYSTEM,1,Minor,Minor,Surgical,Medicare,Medicare,,,,false,50014.4,26774.47
Western NY,Erie,1401008,000213,Mercy Hospital of Buffalo,50 to 69,140,F,White,Not Span/Hispanic,3,Elective,Home or Self Care,2019,DIG010,ABDOMINAL HERNIA,RES011,DIAPHRAGMATIC HERNIA REPAIR,220,"MAJOR STOMACH, ESOPHAGEAL & DUODENAL PROCEDURES",06,DISEASES AND DISORDERS OF THE DIGESTIVE SYSTEM,1,Minor,Minor,Surgical,Medicare,Medicare,,,,false,27247.63,14888.09
New York City,Manhattan,7002054,001464,New York-Presbyterian Hospital - Columbia Presbyterian Center,50 to 69,OOS,F,White,Not Span/Hispanic,2,Elective,Home or Self Care,2019,DIG010,ABDOMINAL HERNIA,GIS026,"UPPER GI THERAPEUTIC PROCEDURES, NEC (OPEN AND LAPAROSCOPIC)",220,"MAJOR STOMACH, ESOPHAGEAL & DUODENAL PROCEDURES",06,DISEASES AND DISORDERS OF THE DIGESTIVE SYSTEM,3,Major,Minor,Surgical,Medicare,Private Health Insurance,Self-Pay,,,false,51990.51,15238.58
Long Island,Nassau,2953000,000563,St. Francis Hospital & Heart Center,70 or Older,113,F,White,Spanish/Hispanic,1,Elective,Home or Self Care,2019,DIG010,ABDOMINAL HERNIA,RES011,DIAPHRAGMATIC HERNIA REPAIR,220,"MAJOR STOMACH, ESOPHAGEAL & DUODENAL PROCEDURES",06,DISEASES AND DISORDERS OF THE DIGESTIVE SYSTEM,2,Moderate,Minor,Surgical,Medicare,Medicare,Medicaid,,,false,51974.12,7819.36
New York City,Manhattan,7002054,001464,New York-Presbyterian Hospital - Columbia Presbyterian Center,50 to 69,100,F,White,Spanish/Hispanic,2,Urgent,Home or Self Care,2019,DIG004,ESOPHAGEAL DISORDERS,GIS026,"UPPER GI THERAPEUTIC PROCEDURES, NEC (OPEN AND LAPAROSCOPIC)",220,"MAJOR STOMACH, ESOPHAGEAL & DUODENAL PROCEDURES",06,DISEASES AND DISORDERS OF THE DIGESTIVE SYSTEM,1,Minor,Minor,Surgical,Medicaid,Medicaid,Self-Pay,,,false,68918.76,21037.68
Capital/Adirond,Albany,0101004,000005,St. Peter's Hospital,70 or Older,121,F,White,Not Span/Hispanic,6,Elective,Home or Self Care,2019,DIG010,ABDOMINAL HERNIA,GIS026,"UPPER GI THERAPEUTIC PROCEDURES, NEC (OPEN AND LAPAROSCOPIC)",220,"MAJOR STOMACH, ESOPHAGEAL & DUODENAL PROCEDURES",06,DISEASES AND DISORDERS OF THE DIGESTIVE SYSTEM,3,Major,Minor,Surgical,Medicare,Medicare,,,,false,37631.75,17105.36
New York City,Manhattan,7002001,001438,Bellevue Hospital Center,30 to 49,113,M,White,Unknown,6,Emergency,Home or Self Care,2019,DIG005,GASTRODUODENAL ULCER,GIS021,GI SYSTEM REPAIR (EXCLUDING ANORECTAL),220,"MAJOR STOMACH, ESOPHAGEAL & DUODENAL PROCEDURES",06,DISEASES AND DISORDERS OF THE DIGESTIVE SYSTEM,2,Moderate,Moderate,Surgical,Private Health Insurance,,,,,true,35225.23,23410.69
Capital/Adirond,Albany,0101004,000005,St. Peter's Hospital,70 or Older,128,F,White,Not Span/Hispanic,11,Elective,Expired,2019,DIG010,ABDOMINAL HERNIA,RES011,DIAPHRAGMATIC HERNIA REPAIR,220,"MAJOR STOMACH, ESOPHAGEAL & DUODENAL PROCEDURES",06,DISEASES AND DISORDERS OF THE DIGESTIVE SYSTEM,4,Extreme,Extreme,Surgical,Medicare,Medicare,,,,false,106951.25,37453.86
New York City,Manhattan,7002054,001464,New York-Presbyterian Hospital - Columbia Presbyterian Center,30 to 49,104,F,White,Not Span/Hispanic,2,Elective,Home or Self Care,2019,DIG024,POSTPROCEDURAL OR POSTOPERATIVE DIGESTIVE SYSTEM COMPLICATION,GIS019,GASTRO-JEJUNAL BYPASS (INCLUDING BARIATRIC),220,"MAJOR STOMACH, ESOPHAGEAL & DUODENAL PROCEDURES",06,DISEASES AND DISORDERS OF THE DIGESTIVE SYSTEM,1,Minor,Minor,Surgical,Private Health Insurance,Self-Pay,,,,false,59944.66,14844.11
New York City,Manhattan,7002054,001464,New York-Presbyterian Hospital - Columbia Presbyterian Center,70 or Older,111,M,Other Race,Not Span/Hispanic,5,Elective,Home w/ Home Health Services,2019,NEO013,GASTROINTESTINAL CANCERS - STOMACH,GIS010,GASTRECTOMY,220,"MAJOR STOMACH, ESOPHAGEAL & DUODENAL PROCEDURES",06,DISEASES AND DISORDERS OF THE DIGESTIVE SYSTEM,2,Moderate,Minor,Surgical,Medicare,Private Health Insurance,Self-Pay,,,false,91688.31,23584.1
Capital/Adirond,Albany,0101004,000005,St. Peter's Hospital,50 to 69,121,M,White,Not Span/Hispanic,4,Elective,Home or Self Care,2019,DIG010,ABDOMINAL HERNIA,RES011,DIAPHRAGMATIC HERNIA REPAIR,220,"MAJOR STOMACH, ESOPHAGEAL & DUODENAL PROCEDURES",06,DISEASES AND DISORDERS OF THE DIGESTIVE SYSTEM,1,Minor,Minor,Surgical,Private Health Insurance,,,,,false,27613.9,11658.27
New York City,Manhattan,7002001,001438,Bellevue Hospital Center,70 or Older,112,M,Other Race,Not Span/Hispanic,9,Elective,Home or Self Care,2019,NEO013,GASTROINTESTINAL CANCERS - STOMACH,GIS010,GASTRECTOMY,220,"MAJOR STOMACH, ESOPHAGEAL & DUODENAL PROCEDURES",06,DISEASES AND DISORDERS OF THE DIGESTIVE SYSTEM,3,Major,Major,Surgical,Medicaid,Medicaid,,,,false,58341.74,38773.92
New York City,Manhattan,7002054,001464,New York-Presbyterian Hospital - Columbia Presbyterian Center,70 or Older,100,F,Other Race,Not Span/Hispanic,37,Emergency,Skilled Nursing Home,2019,NEO015,GASTROINTESTINAL CANCERS - COLORECTAL,GIS009,COLECTOMY,220,"MAJOR STOMACH, ESOPHAGEAL & DUODENAL PROCEDURES",06,DISEASES AND DISORDERS OF THE DIGESTIVE SYSTEM,4,Extreme,Extreme,Surgical,Medicaid,Self-Pay,,,,true,642256.37,202250.67
Finger Lakes,Ontario,3402000,000671,Geneva General Hospital,70 or Older,145,F,White,Not Span/Hispanic,35,Urgent,Expired,2019,DIG010,ABDOMINAL HERNIA,GIS026,"UPPER GI THERAPEUTIC PROCEDURES, NEC (OPEN AND LAPAROSCOPIC)",220,"MAJOR STOMACH, ESOPHAGEAL & DUODENAL PROCEDURES",06,DISEASES AND DISORDERS OF THE DIGESTIVE SYSTEM,4,Extreme,Extreme,Surgical,Medicare,Medicaid,,,,false,91215.16,45291.81
New York City,Kings,7001002,001286,Brookdale Hospital Medical Center,50 to 69,112,F,Black/African American,Unknown,3,Elective,Home or Self Care,2019,DIG010,ABDOMINAL HERNIA,GIS026,"UPPER GI THERAPEUTIC PROCEDURES, NEC (OPEN AND LAPAROSCOPIC)",220,"MAJOR STOMACH, ESOPHAGEAL & DUODENAL PROCEDURES",06,DISEASES AND DISORDERS OF THE DIGESTIVE SYSTEM,1,Minor,Minor,Surgical,Medicaid,,,,,false,28545.56,18905.68
New York City,Kings,7002053,001304,NYU Langone Hospital-Brooklyn,50 to 69,112,M,White,Spanish/Hispanic,4,Elective,Home or Self Care,2019,NEO013,GASTROINTESTINAL CANCERS - STOMACH,GIS010,GASTRECTOMY,220,"MAJOR STOMACH, ESOPHAGEAL & DUODENAL PROCEDURES",06,DISEASES AND DISORDERS OF THE DIGESTIVE SYSTEM,3,Major,Minor,Surgical,Medicare,Medicaid,,,,false,283531.87,57447
New York City,Manhattan,7002020,001453,Memorial Hospital for Cancer and Allied Diseases,50 to 69,100,M,White,Unknown,26,Elective,Home or Self Care,2019,NEO013,GASTROINTESTINAL CANCERS - STOMACH,GIS010,GASTRECTOMY,220,"MAJOR STOMACH, ESOPHAGEAL & DUODENAL PROCEDURES",06,DISEASES AND DISORDERS OF THE DIGESTIVE SYSTEM,3,Major,Major,Surgical,Medicare,Private Health Insurance,,,,false,254569.97,103395.48
New York City,Manhattan,7002032,001469,Mount Sinai Morningside,70 or Older,100,M,Other Race,Unknown,3,Emergency,Home w/ Home Health Services,2019,INJ013,"OPEN WOUNDS OF TRUNK, INITIAL ENCOUNTER",GIS021,GI SYSTEM REPAIR (EXCLUDING ANORECTAL),220,"MAJOR STOMACH, ESOPHAGEAL & DUODENAL PROCEDURES",06,DISEASES AND DISORDERS OF THE DIGESTIVE SYSTEM,1,Minor,Major,Surgical,Medicaid,Medicaid,Self-Pay,,,false,51560.48,13914.37
Finger Lakes,Monroe,2701003,000411,Rochester General Hospital,50 to 69,145,F,White,Not Span/Hispanic,3,Urgent,Home or Self Care,2019,DIG010,ABDOMINAL HERNIA,RES011,DIAPHRAGMATIC HERNIA REPAIR,220,"MAJOR STOMACH, ESOPHAGEAL & DUODENAL PROCEDURES",06,DISEASES AND DISORDERS OF THE DIGESTIVE SYSTEM,1,Minor,Minor,Surgical,Private Health Insurance,Federal/State/Local/VA,,,,false,25199.9,10107.09
Long Island,Nassau,2951001,000541,North Shore University Hospital,30 to 49,115,M,White,Not Span/Hispanic,1,Emergency,Home or Self Care,2019,DIG010,ABDOMINAL HERNIA,GIS026,"UPPER GI THERAPEUTIC PROCEDURES, NEC (OPEN AND LAPAROSCOPIC)",220,"MAJOR STOMACH, ESOPHAGEAL & DUODENAL PROCEDURES",06,DISEASES AND DISORDERS OF THE DIGESTIVE SYSTEM,1,Minor,Minor,Surgical,Blue Cross/Blue Shield,,,,,false,38038.65,10625.2
Finger Lakes,Monroe,2701005,000413,Strong Memorial Hospital,70 or Older,144,F,White,Not Span/Hispanic,1,Elective,Home or Self Care,2019,DIG010,ABDOMINAL HERNIA,RES011,DIAPHRAGMATIC HERNIA REPAIR,220,"MAJOR STOMACH, ESOPHAGEAL & DUODENAL PROCEDURES",06,DISEASES AND DISORDERS OF THE DIGESTIVE SYSTEM,1,Minor,Minor,Surgical,Medicare,,,,,false,17176,8833.63
Capital/Adirond,Albany,0101004,000005,St. Peter's Hospital,70 or Older,122,M,White,Not Span/Hispanic,7,Elective,Home or Self Care,2019,DIG010,ABDOMINAL HERNIA,GIS026,"UPPER GI THERAPEUTIC PROCEDURES, NEC (OPEN AND LAPAROSCOPIC)",220,"MAJOR STOMACH, ESOPHAGEAL & DUODENAL PROCEDURES",06,DISEASES AND DISORDERS OF THE DIGESTIVE SYSTEM,4,Extreme,Extreme,Surgical,Medicare,Blue Cross/Blue Shield,,,,false,76187.6,27884.7
Capital/Adirond,Albany,0101004,000005,St. Peter's Hospital,70 or Older,129,M,White,Not Span/Hispanic,5,Elective,Home or Self Care,2019,DIG010,ABDOMINAL HERNIA,RES011,DIAPHRAGMATIC HERNIA REPAIR,220,"MAJOR STOMACH, ESOPHAGEAL & DUODENAL PROCEDURES",06,DISEASES AND DISORDERS OF THE DIGESTIVE SYSTEM,1,Minor,Minor,Surgical,Medicare,Private Health Insurance,,,,false,33407.05,15110.52
Capital/Adirond,Albany,0101004,000005,St. Peter's Hospital,50 to 69,120,F,White,Not Span/Hispanic,4,Elective,Home or Self Care,2019,DIG010,ABDOMINAL HERNIA,RES011,DIAPHRAGMATIC HERNIA REPAIR,220,"MAJOR STOMACH, ESOPHAGEAL & DUODENAL PROCEDURES",06,DISEASES AND DISORDERS OF THE DIGESTIVE SYSTEM,1,Minor,Minor,Surgical,Medicare,Medicare,,,,false,26443.15,11594.49
New York City,Kings,7001020,001305,Maimonides Medical Center,70 or Older,112,M,White,Not Span/Hispanic,6,Elective,Home w/ Home Health Services,2019,NEO013,GASTROINTESTINAL CANCERS - STOMACH,GIS010,GASTRECTOMY,220,"MAJOR STOMACH, ESOPHAGEAL & DUODENAL PROCEDURES",06,DISEASES AND DISORDERS OF THE DIGESTIVE SYSTEM,3,Major,Moderate,Surgical,Medicare,Medicaid,Self-Pay,,,false,126556.05,38253.19
New York City,Kings,7001020,001305,Maimonides Medical Center,30 to 49,103,M,White,Not Span/Hispanic,1,Urgent,Home or Self Care,2019,DIG010,ABDOMINAL HERNIA,RES011,DIAPHRAGMATIC HERNIA REPAIR,220,"MAJOR STOMACH, ESOPHAGEAL & DUODENAL PROCEDURES",06,DISEASES AND DISORDERS OF THE DIGESTIVE SYSTEM,1,Minor,Minor,Surgical,Blue Cross/Blue Shield,Self-Pay,,,,false,26761,9638.43