Hospital Service Area,Hospital County,Operating Certificate Number,Permanent Facility Id,Facility Name,Age Group,Zip Code - 3 digits,Gender,Race,Ethnicity,Length of Stay,Type of Admission,Patient Disposition,Discharge Year,CCS Diagnosis Code,CCS Diagnosis Description,CCS Procedure Code,CCS Procedure Description,APR DRG Code,APR DRG Description,APR MDC Code,APR MDC Description,APR Severity of Illness Code,APR Severity of Illness Description,APR Risk of Mortality,APR Medical Surgical Description,Payment Typology 1,Payment Typology 2,Payment Typology 3,Birth Weight,Abortion Edit Indicator,Emergency Department Indicator,Total Charges,Total Costs
New York City,Manhattan,7002053,001463,NYU Langone Hospitals,50 to 69,103,F,White,Not Span/Hispanic,2,Elective,Home or Self Care,2017,238,Complications of surgical procedures or medical care,094,OT OR UP GI THER PRCS,222,"Other stomach, esophageal & duodenal procedures",06,Diseases and Disorders of the Digestive System,2,Moderate,Minor,Surgical,Medicare,,,,N,N,61473.99,15146.34
New York City,Manhattan,7002053,001463,NYU Langone Hospitals,30 to 49,112,F,White,Not Span/Hispanic,4,Elective,Home or Self Care,2017,238,Complications of surgical procedures or medical care,094,OT OR UP GI THER PRCS,222,"Other stomach, esophageal & duodenal procedures",06,Diseases and Disorders of the Digestive System,2,Moderate,Minor,Surgical,Private Health Insurance,,,,N,N,63602.88,20330.24
New York City,Manhattan,7002053,001463,NYU Langone Hospitals,30 to 49,100,F,Other Race,Spanish/Hispanic,1,Elective,Home or Self Care,2017,238,Complications of surgical procedures or medical care,094,OT OR UP GI THER PRCS,222,"Other stomach, esophageal & duodenal procedures",06,Diseases and Disorders of the Digestive System,2,Moderate,Minor,Surgical,Blue Cross/Blue Shield,,,,N,N,60098.41,12681.35
New York City,Manhattan,7002053,001463,NYU Langone Hospitals,18 to 29,107,M,Black/African American,Not Span/Hispanic,3,Emergency,Home or Self Care,2017,144,Regional enteritis and ulcerative colitis,223,ENTERAL/PARENTERAL NUTR,222,"Other stomach, esophageal & duodenal procedures",06,Diseases and Disorders of the Digestive System,3,Major,Moderate,Surgical,Blue Cross/Blue Shield,,,,N,Y,25934.89,9514.36
New York City,Manhattan,7002053,001463,NYU Langone Hospitals,0 to 17,112,F,White,Not Span/Hispanic,3,Elective,Inpatient Rehabilitation Facility,2017,138,Esophageal disorders,094,OT OR UP GI THER PRCS,222,"Other stomach, esophageal & duodenal procedures",06,Diseases and Disorders of the Digestive System,4,Extreme,Major,Surgical,Private Health Insurance,,,,N,N,118364.76,27498.32
New York City,Manhattan,7002053,001463,NYU Langone Hospitals,50 to 69,OOS,M,White,Not Span/Hispanic,1,Elective,Home or Self Care,2017,238,Complications of surgical procedures or medical care,074,GASTRECTOMY; PART/TOTAL,222,"Other stomach, esophageal & duodenal procedures",06,Diseases and Disorders of the Digestive System,2,Moderate,Minor,Surgical,Private Health Insurance,,,,N,N,106284.52,23417.12
New York City,Manhattan,7002053,001463,NYU Langone Hospitals,50 to 69,113,M,White,Not Span/Hispanic,6,Elective,Home or Self Care,2017,013,Cancer of stomach,094,OT OR UP GI THER PRCS,222,"Other stomach, esophageal & duodenal procedures",06,Diseases and Disorders of the Digestive System,2,Moderate,Moderate,Surgical,Medicaid,,,,N,N,136619.85,39399.41
New York City,Manhattan,7002053,001463,NYU Langone Hospitals,70 or Older,OOS,F,White,Not Span/Hispanic,4,Elective,Home or Self Care,2017,138,Esophageal disorders,094,OT OR UP GI THER PRCS,222,"Other stomach, esophageal & duodenal procedures",06,Diseases and Disorders of the Digestive System,1,Minor,Minor,Surgical,Blue Cross/Blue Shield,,,,N,N,89499.32,26908.01
New York City,Manhattan,7002053,001463,NYU Langone Hospitals,30 to 49,112,M,White,Not Span/Hispanic,1,Elective,Home or Self Care,2017,238,Complications of surgical procedures or medical care,074,GASTRECTOMY; PART/TOTAL,222,"Other stomach, esophageal & duodenal procedures",06,Diseases and Disorders of the Digestive System,2,Moderate,Minor,Surgical,Private Health Insurance,,,,N,N,86575.08,19710.51
New York City,Manhattan,7002053,001463,NYU Langone Hospitals,50 to 69,112,M,Black/African American,Not Span/Hispanic,7,Elective,Home w/ Home Health Services,2017,013,Cancer of stomach,094,OT OR UP GI THER PRCS,222,"Other stomach, esophageal & duodenal procedures",06,Diseases and Disorders of the Digestive System,2,Moderate,Moderate,Surgical,Medicare,,,,N,N,133390.23,40742.58
New York City,Manhattan,7002053,001463,NYU Langone Hospitals,30 to 49,112,F,White,Not Span/Hispanic,2,Elective,Home or Self Care,2017,238,Complications of surgical procedures or medical care,074,GASTRECTOMY; PART/TOTAL,222,"Other stomach, esophageal & duodenal procedures",06,Diseases and Disorders of the Digestive System,2,Moderate,Minor,Surgical,Private Health Insurance,,,,N,N,101794.63,22096.28
New York City,Manhattan,7002053,001463,NYU Langone Hospitals,0 to 17,112,M,Other Race,Spanish/Hispanic,1,Emergency,Home or Self Care,2017,214,Digestive congenital anomalies,094,OT OR UP GI THER PRCS,222,"Other stomach, esophageal & duodenal procedures",06,Diseases and Disorders of the Digestive System,1,Minor,Minor,Surgical,Medicaid,,,,N,Y,44082.17,10519.04
New York City,Manhattan,7002053,001463,NYU Langone Hospitals,50 to 69,112,F,White,Not Span/Hispanic,2,Elective,Home w/ Home Health Services,2017,238,Complications of surgical procedures or medical care,094,OT OR UP GI THER PRCS,222,"Other stomach, esophageal & duodenal procedures",06,Diseases and Disorders of the Digestive System,2,Moderate,Minor,Surgical,Private Health Insurance,,,,N,N,105524.88,28512.52
New York City,Manhattan,7002053,001463,NYU Langone Hospitals,70 or Older,113,F,White,Not Span/Hispanic,5,Elective,Home w/ Home Health Services,2017,013,Cancer of stomach,094,OT OR UP GI THER PRCS,222,"Other stomach, esophageal & duodenal procedures",06,Diseases and Disorders of the Digestive System,2,Moderate,Minor,Surgical,Medicare,,,,N,N,114857.80,33120.86
New York City,Manhattan,7002053,001463,NYU Langone Hospitals,50 to 69,111,M,White,Not Span/Hispanic,8,Emergency,Home or Self Care,2017,141,Other disorders of stomach and duodenum,094,OT OR UP GI THER PRCS,222,"Other stomach, esophageal & duodenal procedures",06,Diseases and Disorders of the Digestive System,1,Minor,Minor,Surgical,Private Health Insurance,,,,N,Y,204568.06,57610.47
New York City,Manhattan,7002053,001463,NYU Langone Hospitals,18 to 29,104,F,Other Race,Spanish/Hispanic,1,Elective,Home or Self Care,2017,238,Complications of surgical procedures or medical care,094,OT OR UP GI THER PRCS,222,"Other stomach, esophageal & duodenal procedures",06,Diseases and Disorders of the Digestive System,2,Moderate,Minor,Surgical,Medicaid,,,,N,N,43699.18,12063.90
New York City,Manhattan,7002053,001463,NYU Langone Hospitals,30 to 49,104,F,Black/African American,Not Span/Hispanic,2,Elective,Home or Self Care,2017,238,Complications of surgical procedures or medical care,074,GASTRECTOMY; PART/TOTAL,222,"Other stomach, esophageal & duodenal procedures",06,Diseases and Disorders of the Digestive System,2,Moderate,Minor,Surgical,Blue Cross/Blue Shield,,,,N,N,104887.84,24930.12
New York City,Manhattan,7002053,001463,NYU Langone Hospitals,18 to 29,103,F,White,Spanish/Hispanic,7,Emergency,Home w/ Home Health Services,2017,238,Complications of surgical procedures or medical care,071,GASTROSTOMY; TEMP/PERM,222,"Other stomach, esophageal & duodenal procedures",06,Diseases and Disorders of the Digestive System,2,Moderate,Minor,Surgical,Blue Cross/Blue Shield,,,,N,Y,95469.37,32573.59
New York City,Manhattan,7002053,001463,NYU Langone Hospitals,70 or Older,OOS,M,White,Not Span/Hispanic,1,Elective,Home or Self Care,2017,138,Esophageal disorders,094,OT OR UP GI THER PRCS,222,"Other stomach, esophageal & duodenal procedures",06,Diseases and Disorders of the Digestive System,1,Minor,Minor,Surgical,Medicare,,,,N,N,56275.51,12166.45
New York City,Manhattan,7002053,001463,NYU Langone Hospitals,70 or Older,100,F,Other Race,Not Span/Hispanic,1,Elective,Home or Self Care,2017,143,Abdominal hernia,094,OT OR UP GI THER PRCS,222,"Other stomach, esophageal & duodenal procedures",06,Diseases and Disorders of the Digestive System,1,Minor,Minor,Surgical,Private Health Insurance,,,,N,N,61940.99,15396.15
New York City,Manhattan,7002053,001463,NYU Langone Hospitals,50 to 69,100,M,Other Race,Spanish/Hispanic,1,Elective,Home or Self Care,2017,238,Complications of surgical procedures or medical care,094,OT OR UP GI THER PRCS,222,"Other stomach, esophageal & duodenal procedures",06,Diseases and Disorders of the Digestive System,2,Moderate,Minor,Surgical,Medicare,,,,N,N,38132.82,11260.18
New York City,Manhattan,7002053,001463,NYU Langone Hospitals,50 to 69,OOS,F,White,Not Span/Hispanic,1,Emergency,Home or Self Care,2017,238,Complications of surgical procedures or medical care,094,OT OR UP GI THER PRCS,222,"Other stomach, esophageal & duodenal procedures",06,Diseases and Disorders of the Digestive System,2,Moderate,Moderate,Surgical,Private Health Insurance,,,,N,Y,47013.72,11485.18
New York City,Manhattan,7002053,001463,NYU Langone Hospitals,30 to 49,103,M,Other Race,Not Span/Hispanic,5,Elective,Home or Self Care,2017,141,Other disorders of stomach and duodenum,074,GASTRECTOMY; PART/TOTAL,222,"Other stomach, esophageal & duodenal procedures",06,Diseases and Disorders of the Digestive System,3,Major,Moderate,Surgical,Medicaid,,,,N,N,151116.59,39072.42
New York City,Manhattan,7002053,001463,NYU Langone Hospitals,30 to 49,112,F,Black/African American,Not Span/Hispanic,1,Elective,Home or Self Care,2017,238,Complications of surgical procedures or medical care,094,OT OR UP GI THER PRCS,222,"Other stomach, esophageal & duodenal procedures",06,Diseases and Disorders of the Digestive System,3,Major,Minor,Surgical,Medicare,,,,N,N,39210.63,11258.33
New York City,Manhattan,7002053,001463,NYU Langone Hospitals,0 to 17,112,M,Other Race,Unknown,2,Emergency,Home or Self Care,2017,214,Digestive congenital anomalies,094,OT OR UP GI THER PRCS,222,"Other stomach, esophageal & duodenal procedures",06,Diseases and Disorders of the Digestive System,1,Minor,Minor,Surgical,Medicaid,,,03300,N,Y,33190.56,9129.84
New York City,Manhattan,7002053,001463,NYU Langone Hospitals,0 to 17,112,F,Other Race,Spanish/Hispanic,4,Emergency,Home or Self Care,2017,214,Digestive congenital anomalies,094,OT OR UP GI THER PRCS,222,"Other stomach, esophageal & duodenal procedures",06,Diseases and Disorders of the Digestive System,2,Moderate,Moderate,Surgical,Medicaid,,,,N,Y,53148.98,19859.68
New York City,Manhattan,7002053,001463,NYU Langone Hospitals,50 to 69,OOS,F,Other Race,Spanish/Hispanic,6,Emergency,Home or Self Care,2017,238,Complications of surgical procedures or medical care,094,OT OR UP GI THER PRCS,222,"Other stomach, esophageal & duodenal procedures",06,Diseases and Disorders of the Digestive System,2,Moderate,Minor,Surgical,Private Health Insurance,,,,N,Y,95720.55,28552.91
New York City,Manhattan,7002053,001463,NYU Langone Hospitals,70 or Older,114,M,White,Not Span/Hispanic,6,Elective,Home w/ Home Health Services,2017,013,Cancer of stomach,094,OT OR UP GI THER PRCS,222,"Other stomach, esophageal & duodenal procedures",06,Diseases and Disorders of the Digestive System,2,Moderate,Minor,Surgical,Medicare,,,,N,N,169195.56,58835.33
New York City,Manhattan,7002053,001463,NYU Langone Hospitals,50 to 69,114,F,Black/African American,Not Span/Hispanic,1,Elective,Home or Self Care,2017,238,Complications of surgical procedures or medical care,094,OT OR UP GI THER PRCS,222,"Other stomach, esophageal & duodenal procedures",06,Diseases and Disorders of the Digestive System,2,Moderate,Minor,Surgical,Medicare,,,,N,N,45478.51,12613.79
New York City,Manhattan,7002053,001463,NYU Langone Hospitals,0 to 17,112,M,White,Not Span/Hispanic,2,Emergency,Home or Self Care,2017,214,Digestive congenital anomalies,094,OT OR UP GI THER PRCS,222,"Other stomach, esophageal & duodenal procedures",06,Diseases and Disorders of the Digestive System,1,Minor,Minor,Surgical,Self-Pay,,,03500,N,Y,42111.41,10070.88
New York City,Manhattan,7002053,001463,NYU Langone Hospitals,70 or Older,103,M,White,Not Span/Hispanic,6,Elective,Home w/ Home Health Services,2017,141,Other disorders of stomach and duodenum,074,GASTRECTOMY; PART/TOTAL,222,"Other stomach, esophageal & duodenal procedures",06,Diseases and Disorders of the Digestive System,2,Moderate,Moderate,Surgical,Medicare,,,,N,N,225055.47,55191.96
New York City,Manhattan,7002053,001463,NYU Langone Hospitals,30 to 49,112,M,White,Not Span/Hispanic,1,Elective,Home or Self Care,2017,238,Complications of surgical procedures or medical care,074,GASTRECTOMY; PART/TOTAL,222,"Other stomach, esophageal & duodenal procedures",06,Diseases and Disorders of the Digestive System,2,Moderate,Minor,Surgical,Private Health Insurance,,,,N,N,96372.79,21603.08
New York City,Manhattan,7002053,001463,NYU Langone Hospitals,70 or Older,100,F,Other Race,Not Span/Hispanic,6,Elective,Home w/ Home Health Services,2017,013,Cancer of stomach,074,GASTRECTOMY; PART/TOTAL,222,"Other stomach, esophageal & duodenal procedures",06,Diseases and Disorders of the Digestive System,2,Moderate,Minor,Surgical,Medicare,,,,N,N,116126.06,33375.28
New York City,Manhattan,7002053,001463,NYU Langone Hospitals,30 to 49,112,F,White,Not Span/Hispanic,2,Elective,Home or Self Care,2017,238,Complications of surgical procedures or medical care,094,OT OR UP GI THER PRCS,222,"Other stomach, esophageal & duodenal procedures",06,Diseases and Disorders of the Digestive System,2,Moderate,Minor,Surgical,Medicaid,,,,N,N,101469.14,22002.33
New York City,Manhattan,7002053,001463,NYU Langone Hospitals,30 to 49,109,M,White,Not Span/Hispanic,1,Emergency,Home or Self Care,2017,238,Complications of surgical procedures or medical care,089,EXPLORATORY LAPAROTOMY,222,"Other stomach, esophageal & duodenal procedures",06,Diseases and Disorders of the Digestive System,2,Moderate,Moderate,Surgical,Private Health Insurance,,,,N,Y,45923.32,11139.30
New York City,Manhattan,7002053,001463,NYU Langone Hospitals,70 or Older,112,M,White,Not Span/Hispanic,6,Elective,Home w/ Home Health Services,2017,013,Cancer of stomach,074,GASTRECTOMY; PART/TOTAL,222,"Other stomach, esophageal & duodenal procedures",06,Diseases and Disorders of the Digestive System,1,Minor,Minor,Surgical,Private Health Insurance,,,,N,N,114225.50,35342.56
New York City,Manhattan,7002053,001463,NYU Langone Hospitals,30 to 49,112,F,White,Not Span/Hispanic,2,Emergency,Home or Self Care,2017,238,Complications of surgical procedures or medical care,094,OT OR UP GI THER PRCS,222,"Other stomach, esophageal & duodenal procedures",06,Diseases and Disorders of the Digestive System,2,Moderate,Minor,Surgical,Medicaid,,,,N,Y,52256.92,14496.16
New York City,Manhattan,7002053,001463,NYU Langone Hospitals,70 or Older,OOS,M,White,Not Span/Hispanic,2,Elective,Home or Self Care,2017,238,Complications of surgical procedures or medical care,094,OT OR UP GI THER PRCS,222,"Other stomach, esophageal & duodenal procedures",06,Diseases and Disorders of the Digestive System,2,Moderate,Minor,Surgical,Medicare,,,,N,N,38080.39,11276.92
New York City,Manhattan,7002053,001463,NYU Langone Hospitals,0 to 17,112,M,Other Race,Spanish/Hispanic,3,Emergency,Home or Self Care,2017,214,Digestive congenital anomalies,094,OT OR UP GI THER PRCS,222,"Other stomach, esophageal & duodenal procedures",06,Diseases and Disorders of the Digestive System,1,Minor,Minor,Surgical,Medicaid,,,,N,Y,54450.88,13074.63
New York City,Manhattan,7002053,001463,NYU Langone Hospitals,0 to 17,112,M,Other Race,Not Span/Hispanic,6,Emergency,Home or Self Care,2017,214,Digestive congenital anomalies,094,OT OR UP GI THER PRCS,222,"Other stomach, esophageal & duodenal procedures",06,Diseases and Disorders of the Digestive System,1,Minor,Minor,Surgical,Private Health Insurance,,,03300,N,Y,66618.54,17740.58
New York City,Manhattan,7002053,001463,NYU Langone Hospitals,50 to 69,OOS,F,White,Not Span/Hispanic,1,Elective,Home or Self Care,2017,138,Esophageal disorders,094,OT OR UP GI THER PRCS,222,"Other stomach, esophageal & duodenal procedures",06,Diseases and Disorders of the Digestive System,1,Minor,Minor,Surgical,Medicare,,,,N,N,76417.68,18766.22
New York City,Manhattan,7002053,001463,NYU Langone Hospitals,50 to 69,109,F,Other Race,Spanish/Hispanic,2,Elective,Home or Self Care,2017,238,Complications of surgical procedures or medical care,074,GASTRECTOMY; PART/TOTAL,222,"Other stomach, esophageal & duodenal procedures",06,Diseases and Disorders of the Digestive System,2,Moderate,Minor,Surgical,Medicaid,,,,N,N,106918.27,23141.54
New York City,Manhattan,7002053,001463,NYU Langone Hospitals,70 or Older,112,F,White,Not Span/Hispanic,3,Urgent,Home w/ Home Health Services,2017,238,Complications of surgical procedures or medical care,094,OT OR UP GI THER PRCS,222,"Other stomach, esophageal & duodenal procedures",06,Diseases and Disorders of the Digestive System,2,Moderate,Minor,Surgical,Medicare,,,,N,N,44284.61,11895.93
New York City,Manhattan,7002053,001463,NYU Langone Hospitals,30 to 49,100,F,White,Not Span/Hispanic,12,Elective,Home or Self Care,2017,238,Complications of surgical procedures or medical care,094,OT OR UP GI THER PRCS,222,"Other stomach, esophageal & duodenal procedures",06,Diseases and Disorders of the Digestive System,3,Major,Moderate,Surgical,Private Health Insurance,,,,N,N,125545.89,45835.52
New York City,Manhattan,7002053,001463,NYU Langone Hospitals,50 to 69,113,M,Other Race,Not Span/Hispanic,5,Elective,Home w/ Home Health Services,2017,013,Cancer of stomach,074,GASTRECTOMY; PART/TOTAL,222,"Other stomach, esophageal & duodenal procedures",06,Diseases and Disorders of the Digestive System,3,Major,Moderate,Surgical,Medicare,,,,N,N,127637.88,38116.44
New York City,Manhattan,7002053,001463,NYU Langone Hospitals,50 to 69,OOS,F,White,Not Span/Hispanic,1,Elective,Home or Self Care,2017,138,Esophageal disorders,094,OT OR UP GI THER PRCS,222,"Other stomach, esophageal & duodenal procedures",06,Diseases and Disorders of the Digestive System,1,Minor,Minor,Surgical,Medicare,,,,N,N,72389.33,17894.20
New York City,Manhattan,7002053,001463,NYU Langone Hospitals,30 to 49,115,F,White,Not Span/Hispanic,1,Elective,Home or Self Care,2017,138,Esophageal disorders,094,OT OR UP GI THER PRCS,222,"Other stomach, esophageal & duodenal procedures",06,Diseases and Disorders of the Digestive System,1,Minor,Minor,Surgical,Blue Cross/Blue Shield,,,,N,N,61737.30,13089.41
New York City,Manhattan,7002053,001463,NYU Langone Hospitals,30 to 49,115,F,White,Not Span/Hispanic,3,Emergency,Home or Self Care,2017,238,Complications of surgical procedures or medical care,094,OT OR UP GI THER PRCS,222,"Other stomach, esophageal & duodenal procedures",06,Diseases and Disorders of the Digestive System,2,Moderate,Minor,Surgical,Private Health Insurance,,,,N,Y,85836.57,20710.63
New York City,Manhattan,7002053,001463,NYU Langone Hospitals,30 to 49,109,M,White,Not Span/Hispanic,1,Elective,Home or Self Care,2017,238,Complications of surgical procedures or medical care,094,OT OR UP GI THER PRCS,222,"Other stomach, esophageal & duodenal procedures",06,Diseases and Disorders of the Digestive System,2,Moderate,Minor,Surgical,Medicaid,,,,N,N,80496.05,18786.17
New York City,Manhattan,7002053,001463,NYU Langone Hospitals,70 or Older,100,M,White,Not Span/Hispanic,4,Emergency,Hospice - Medical Facility,2017,153,Gastrointestinal hemorrhage,070,UP GASTRO ENDOSC/BIOPSY,222,"Other stomach, esophageal & duodenal procedures",06,Diseases and Disorders of the Digestive System,4,Extreme,Extreme,Surgical,Medicare,,,,N,Y,265511.25,66271.11
New York City,Manhattan,7002053,001463,NYU Langone Hospitals,50 to 69,OOS,F,Other Race,Not Span/Hispanic,11,Emergency,Home or Self Care,2017,141,Other disorders of stomach and duodenum,070,UP GASTRO ENDOSC/BIOPSY,222,"Other stomach, esophageal & duodenal procedures",06,Diseases and Disorders of the Digestive System,3,Major,Major,Surgical,Self-Pay,,,,N,Y,272945.08,76712.36
New York City,Manhattan,7002053,001463,NYU Langone Hospitals,70 or Older,112,F,White,Not Span/Hispanic,1,Elective,Home w/ Home Health Services,2017,138,Esophageal disorders,160,OT THER PRCS ON MUSCLES,222,"Other stomach, esophageal & duodenal procedures",06,Diseases and Disorders of the Digestive System,2,Moderate,Moderate,Surgical,Medicare,,,,N,N,43010.22,9759.80
New York City,Manhattan,7002053,001463,NYU Langone Hospitals,50 to 69,112,M,White,Not Span/Hispanic,2,Elective,Home or Self Care,2017,238,Complications of surgical procedures or medical care,094,OT OR UP GI THER PRCS,222,"Other stomach, esophageal & duodenal procedures",06,Diseases and Disorders of the Digestive System,2,Moderate,Minor,Surgical,Private Health Insurance,,,,N,N,114381.78,26910.19
New York City,Manhattan,7002053,001463,NYU Langone Hospitals,70 or Older,117,F,White,Not Span/Hispanic,5,Elective,Home w/ Home Health Services,2017,013,Cancer of stomach,074,GASTRECTOMY; PART/TOTAL,222,"Other stomach, esophageal & duodenal procedures",06,Diseases and Disorders of the Digestive System,2,Moderate,Moderate,Surgical,Medicare,,,,N,N,170909.95,55553.79
New York City,Manhattan,7002053,001463,NYU Langone Hospitals,70 or Older,OOS,F,White,Not Span/Hispanic,1,Elective,Home or Self Care,2017,238,Complications of surgical procedures or medical care,094,OT OR UP GI THER PRCS,222,"Other stomach, esophageal & duodenal procedures",06,Diseases and Disorders of the Digestive System,1,Minor,Minor,Surgical,Medicare,,,,N,N,44864.53,12477.99
New York City,Manhattan,7002053,001463,NYU Langone Hospitals,50 to 69,112,M,White,Not Span/Hispanic,13,Elective,Home w/ Home Health Services,2017,138,Esophageal disorders,033,OTHER OR THER PRCS NOSE,222,"Other stomach, esophageal & duodenal procedures",06,Diseases and Disorders of the Digestive System,4,Extreme,Extreme,Surgical,Medicare,,,,N,N,449785.35,140813.31
New York City,Manhattan,7002053,001463,NYU Langone Hospitals,70 or Older,100,F,White,Not Span/Hispanic,6,Elective,Home or Self Care,2017,013,Cancer of stomach,074,GASTRECTOMY; PART/TOTAL,222,"Other stomach, esophageal & duodenal procedures",06,Diseases and Disorders of the Digestive System,2,Moderate,Major,Surgical,Medicare,,,,N,N,171280.22,60541.20
New York City,Manhattan,7002053,001463,NYU Langone Hospitals,0 to 17,112,F,White,Not Span/Hispanic,2,Emergency,Home or Self Care,2017,214,Digestive congenital anomalies,094,OT OR UP GI THER PRCS,222,"Other stomach, esophageal & duodenal procedures",06,Diseases and Disorders of the Digestive System,1,Minor,Minor,Surgical,Medicaid,,,00100,N,Y,49353.27,12793.44
New York City,Manhattan,7002053,001463,NYU Langone Hospitals,30 to 49,112,M,Other Race,Not Span/Hispanic,3,Elective,Home or Self Care,2017,238,Complications of surgical procedures or medical care,094,OT OR UP GI THER PRCS,222,"Other stomach, esophageal & duodenal procedures",06,Diseases and Disorders of the Digestive System,2,Moderate,Minor,Surgical,Medicaid,,,,N,N,114810.05,28664.22
New York City,Manhattan,7002053,001463,NYU Langone Hospitals,30 to 49,112,M,Black/African American,Not Span/Hispanic,2,Elective,Home w/ Home Health Services,2017,238,Complications of surgical procedures or medical care,094,OT OR UP GI THER PRCS,222,"Other stomach, esophageal & duodenal procedures",06,Diseases and Disorders of the Digestive System,2,Moderate,Minor,Surgical,Blue Cross/Blue Shield,,,,N,N,101237.20,22545.53
New York City,Manhattan,7002053,001463,NYU Langone Hospitals,30 to 49,OOS,F,Black/African American,Not Span/Hispanic,2,Elective,Home or Self Care,2017,238,Complications of surgical procedures or medical care,074,GASTRECTOMY; PART/TOTAL,222,"Other stomach, esophageal & duodenal procedures",06,Diseases and Disorders of the Digestive System,2,Moderate,Minor,Surgical,Private Health Insurance,,,,N,N,97816.65,21447.51