Hospital Service Area,Hospital County,Operating Certificate Number,Permanent Facility Id,Facility Name,Age Group,Zip Code - 3 digits,Gender,Race,Ethnicity,Length of Stay,Type of Admission,Patient Disposition,Discharge Year,CCS Diagnosis Code,CCS Diagnosis Description,CCS Procedure Code,CCS Procedure Description,APR DRG Code,APR DRG Description,APR MDC Code,APR MDC Description,APR Severity of Illness Code,APR Severity of Illness Description,APR Risk of Mortality,APR Medical Surgical Description,Payment Typology 1,Payment Typology 2,Payment Typology 3,Birth Weight,Abortion Edit Indicator,Emergency Department Indicator,Total Charges,Total Costs
New York City,Manhattan,7002001,001438,Bellevue Hospital Center,0 to 17,112,M,Black/African American,Not Span/Hispanic,3,Emergency,Home or Self Care,2020,MAL002,DIGESTIVE CONGENITAL ANOMALIES,GIS026,"UPPER GI THERAPEUTIC PROCEDURES, NEC (OPEN AND LAPAROSCOPIC)",222,"OTHER STOMACH, ESOPHAGEAL & DUODENAL PROCEDURES",06,DISEASES AND DISORDERS OF THE DIGESTIVE SYSTEM,2,Moderate,Minor,Surgical,Medicaid,,,,,N,29959.92,17229.47
New York City,Manhattan,7002001,001438,Bellevue Hospital Center,0 to 17,112,M,Other Race,Spanish/Hispanic,11,Emergency,Home w/ Home Health Services,2020,INJ020,"EFFECT OF FOREIGN BODY ENTERING OPENING, INITIAL ENCOUNTER",GIS026,"UPPER GI THERAPEUTIC PROCEDURES, NEC (OPEN AND LAPAROSCOPIC)",222,"OTHER STOMACH, ESOPHAGEAL & DUODENAL PROCEDURES",06,DISEASES AND DISORDERS OF THE DIGESTIVE SYSTEM,3,Major,Minor,Surgical,Medicaid,,,,,Y,81804.14,47044.25
New York City,Manhattan,7002001,001438,Bellevue Hospital Center,50 to 69,100,M,Black/African American,Not Span/Hispanic,15,Emergency,Skilled Nursing Home,2020,DIG021,GASTROINTESTINAL HEMORRHAGE,GIS021,GI SYSTEM REPAIR (EXCLUDING ANORECTAL),222,"OTHER STOMACH, ESOPHAGEAL & DUODENAL PROCEDURES",06,DISEASES AND DISORDERS OF THE DIGESTIVE SYSTEM,4,Extreme,Extreme,Surgical,Medicaid,,,,,Y,169302.16,97362.96
New York City,Manhattan,7002001,001438,Bellevue Hospital Center,50 to 69,,F,Other Race,Spanish/Hispanic,1,Elective,Home or Self Care,2020,DIG024,POSTPROCEDURAL OR POSTOPERATIVE DIGESTIVE SYSTEM COMPLICATION,GIS025,OTHER GI SYSTEM DEVICE PROCEDURES,222,"OTHER STOMACH, ESOPHAGEAL & DUODENAL PROCEDURES",06,DISEASES AND DISORDERS OF THE DIGESTIVE SYSTEM,2,Moderate,Minor,Surgical,Medicaid,,,,,N,23483.57,13505.03
New York City,Manhattan,7002001,001438,Bellevue Hospital Center,0 to 17,112,F,Other Race,Spanish/Hispanic,2,Emergency,Home or Self Care,2020,MAL002,DIGESTIVE CONGENITAL ANOMALIES,GIS026,"UPPER GI THERAPEUTIC PROCEDURES, NEC (OPEN AND LAPAROSCOPIC)",222,"OTHER STOMACH, ESOPHAGEAL & DUODENAL PROCEDURES",06,DISEASES AND DISORDERS OF THE DIGESTIVE SYSTEM,1,Minor,Minor,Surgical,Medicaid,,,,,Y,23318.9,13410.33
New York City,Manhattan,7002001,001438,Bellevue Hospital Center,30 to 49,112,F,Black/African American,Not Span/Hispanic,1,Elective,Home or Self Care,2020,DIG024,POSTPROCEDURAL OR POSTOPERATIVE DIGESTIVE SYSTEM COMPLICATION,GIS025,OTHER GI SYSTEM DEVICE PROCEDURES,222,"OTHER STOMACH, ESOPHAGEAL & DUODENAL PROCEDURES",06,DISEASES AND DISORDERS OF THE DIGESTIVE SYSTEM,2,Moderate,Minor,Surgical,Medicaid,,,,,N,25471.11,14648.03
New York City,Manhattan,7002001,001438,Bellevue Hospital Center,30 to 49,100,F,Black/African American,Unknown,7,Elective,Home or Self Care,2020,DIG024,POSTPROCEDURAL OR POSTOPERATIVE DIGESTIVE SYSTEM COMPLICATION,GIS027,"UPPER GI THERAPEUTIC PROCEDURES, NEC (ENDOSCOPIC)",222,"OTHER STOMACH, ESOPHAGEAL & DUODENAL PROCEDURES",06,DISEASES AND DISORDERS OF THE DIGESTIVE SYSTEM,4,Extreme,Major,Surgical,Medicaid,,,,,Y,73580.22,42314.81
New York City,Manhattan,7002001,001438,Bellevue Hospital Center,30 to 49,113,F,Other Race,Spanish/Hispanic,1,Elective,Home or Self Care,2020,DIG004,ESOPHAGEAL DISORDERS,GIS027,"UPPER GI THERAPEUTIC PROCEDURES, NEC (ENDOSCOPIC)",222,"OTHER STOMACH, ESOPHAGEAL & DUODENAL PROCEDURES",06,DISEASES AND DISORDERS OF THE DIGESTIVE SYSTEM,2,Moderate,Minor,Surgical,Medicaid,,,,,N,14799.8,8511.13
New York City,Manhattan,7002001,001438,Bellevue Hospital Center,50 to 69,114,M,Other Race,Spanish/Hispanic,6,Emergency,Home or Self Care,2020,NEO070,SECONDARY MALIGNANCIES,GIS007,GI SYSTEM DRAINAGE (EXCLUDING PARACENTESIS),222,"OTHER STOMACH, ESOPHAGEAL & DUODENAL PROCEDURES",06,DISEASES AND DISORDERS OF THE DIGESTIVE SYSTEM,3,Major,Major,Surgical,Medicaid,,,,,Y,44758.62,25739.97
New York City,Manhattan,7002001,001438,Bellevue Hospital Center,0 to 17,112,M,Other Race,Spanish/Hispanic,2,Emergency,Home or Self Care,2020,MAL002,DIGESTIVE CONGENITAL ANOMALIES,GIS026,"UPPER GI THERAPEUTIC PROCEDURES, NEC (OPEN AND LAPAROSCOPIC)",222,"OTHER STOMACH, ESOPHAGEAL & DUODENAL PROCEDURES",06,DISEASES AND DISORDERS OF THE DIGESTIVE SYSTEM,1,Minor,Minor,Surgical,Medicaid,,,03000,,Y,23399.28,13456.55
New York City,Manhattan,7002001,001438,Bellevue Hospital Center,50 to 69,112,M,Black/African American,Not Span/Hispanic,17,Urgent,Home or Self Care,2020,DIG006,GASTROINTESTINAL AND BILIARY PERFORATION,GIS027,"UPPER GI THERAPEUTIC PROCEDURES, NEC (ENDOSCOPIC)",222,"OTHER STOMACH, ESOPHAGEAL & DUODENAL PROCEDURES",06,DISEASES AND DISORDERS OF THE DIGESTIVE SYSTEM,4,Extreme,Major,Surgical,Medicare,Private Health Insurance,,,,N,243613.35,140098.14
New York City,Manhattan,7002001,001438,Bellevue Hospital Center,0 to 17,112,F,Other Race,Spanish/Hispanic,3,Emergency,Home or Self Care,2020,MAL002,DIGESTIVE CONGENITAL ANOMALIES,GIS026,"UPPER GI THERAPEUTIC PROCEDURES, NEC (OPEN AND LAPAROSCOPIC)",222,"OTHER STOMACH, ESOPHAGEAL & DUODENAL PROCEDURES",06,DISEASES AND DISORDERS OF THE DIGESTIVE SYSTEM,1,Minor,Minor,Surgical,Medicaid,,,02500,,Y,29011.52,16684.06
