Hospital Service Area,Hospital County,Operating Certificate Number,Permanent Facility Id,Facility Name,Age Group,Zip Code - 3 digits,Gender,Race,Ethnicity,Length of Stay,Type of Admission,Patient Disposition,Discharge Year,CCS Diagnosis Code,CCS Diagnosis Description,CCS Procedure Code,CCS Procedure Description,APR DRG Code,APR DRG Description,APR MDC Code,APR MDC Description,APR Severity of Illness Code,APR Severity of Illness Description,APR Risk of Mortality,APR Medical Surgical Description,Payment Typology 1,Payment Typology 2,Payment Typology 3,Birth Weight,Abortion Edit Indicator,Emergency Department Indicator,Total Charges,Total Costs
New York City,Bronx,7000006,001169,Montefiore Medical Center - Henry & Lucy Moses Div,70 or Older,104,M,Black/African American,Not Span/Hispanic,11,Emergency,Home w/ Home Health Services,2017,145,Intestinal obstruction without hernia,090,EXCISION; LYS PERI ADHS,223,Other small & large bowel procedures,06,Diseases and Disorders of the Digestive System,3,Major,Major,Surgical,Medicare,Blue Cross/Blue Shield,,,N,Y,134265.48,32180.31
New York City,Bronx,7000006,001169,Montefiore Medical Center - Henry & Lucy Moses Div,50 to 69,104,M,Other Race,Not Span/Hispanic,4,Emergency,Home or Self Care,2017,244,Other injuries and conditions due to external causes,096,OT OR LOW GI THER PRCS,223,Other small & large bowel procedures,06,Diseases and Disorders of the Digestive System,1,Minor,Minor,Surgical,Private Health Insurance,,,,N,Y,59487.18,12857.86
New York City,Bronx,7000006,001169,Montefiore Medical Center - Henry & Lucy Moses Div,18 to 29,109,M,White,Not Span/Hispanic,5,Emergency,Home or Self Care,2017,147,Anal and rectal conditions,095,OT NON-OR LW GI THER PR,223,Other small & large bowel procedures,06,Diseases and Disorders of the Digestive System,1,Minor,Minor,Surgical,Medicaid,,,,N,Y,72319.64,14211.60
New York City,Bronx,7000006,001169,Montefiore Medical Center - Henry & Lucy Moses Div,0 to 17,104,M,Black/African American,Not Span/Hispanic,5,Emergency,Home or Self Care,2017,244,Other injuries and conditions due to external causes,096,OT OR LOW GI THER PRCS,223,Other small & large bowel procedures,06,Diseases and Disorders of the Digestive System,3,Major,Minor,Surgical,Medicaid,,,,N,Y,62974.94,15841.33
New York City,Bronx,7000006,001169,Montefiore Medical Center - Henry & Lucy Moses Div,0 to 17,109,M,Other Race,Not Span/Hispanic,4,Emergency,Home or Self Care,2017,145,Intestinal obstruction without hernia,090,EXCISION; LYS PERI ADHS,223,Other small & large bowel procedures,06,Diseases and Disorders of the Digestive System,2,Moderate,Minor,Surgical,Medicaid,,,,N,Y,59128.54,14936.25
New York City,Manhattan,7002002,001439,Mount Sinai Beth Israel,50 to 69,113,M,White,Not Span/Hispanic,8,Elective,Home or Self Care,2017,155,Other gastrointestinal disorders,096,OT OR LOW GI THER PRCS,223,Other small & large bowel procedures,06,Diseases and Disorders of the Digestive System,2,Moderate,Moderate,Surgical,Private Health Insurance,Self-Pay,,,N,N,74917.70,25802.93
New York City,Manhattan,7002024,001456,Mount Sinai Hospital,18 to 29,103,M,White,Not Span/Hispanic,5,Elective,Home or Self Care,2017,155,Other gastrointestinal disorders,096,OT OR LOW GI THER PRCS,223,Other small & large bowel procedures,06,Diseases and Disorders of the Digestive System,1,Minor,Minor,Surgical,Blue Cross/Blue Shield,Self-Pay,,,N,N,43814.89,16804.93
New York City,Manhattan,7002024,001456,Mount Sinai Hospital,70 or Older,,M,Other Race,Not Span/Hispanic,4,Urgent,Home w/ Home Health Services,2017,237,Complication of device; implant or graft,096,OT OR LOW GI THER PRCS,223,Other small & large bowel procedures,06,Diseases and Disorders of the Digestive System,2,Moderate,Moderate,Surgical,Medicare,Private Health Insurance,Self-Pay,,N,N,38447.57,14548.35
New York City,Manhattan,7002032,001469,Mount Sinai St. Luke's,50 to 69,100,F,Other Race,Not Span/Hispanic,33,Emergency,Skilled Nursing Home,2017,114,Peripheral and visceral atherosclerosis,096,OT OR LOW GI THER PRCS,223,Other small & large bowel procedures,06,Diseases and Disorders of the Digestive System,3,Major,Moderate,Surgical,Medicaid,Medicaid,Self-Pay,,N,Y,285059.73,86058.25
New York City,Manhattan,7002032,001469,Mount Sinai St. Luke's,70 or Older,100,F,White,Spanish/Hispanic,19,Emergency,Skilled Nursing Home,2017,146,Diverticulosis and diverticulitis,096,OT OR LOW GI THER PRCS,223,Other small & large bowel procedures,06,Diseases and Disorders of the Digestive System,4,Extreme,Major,Surgical,Medicare,Medicare,Self-Pay,,N,N,321.00,125.37
New York City,Manhattan,7002032,001469,Mount Sinai St. Luke's,70 or Older,100,F,Other Race,Not Span/Hispanic,5,Emergency,Home w/ Home Health Services,2017,142,Appendicitis and other appendiceal conditions,095,OT NON-OR LW GI THER PR,223,Other small & large bowel procedures,06,Diseases and Disorders of the Digestive System,1,Minor,Minor,Surgical,Medicare,Medicare,Medicaid,,N,Y,52358.30,14085.39
Hudson Valley,Orange,3523000,000699,Orange Regional Medical Center,30 to 49,109,M,White,Not Span/Hispanic,3,Emergency,Home or Self Care,2017,147,Anal and rectal conditions,096,OT OR LOW GI THER PRCS,223,Other small & large bowel procedures,06,Diseases and Disorders of the Digestive System,1,Minor,Minor,Surgical,Private Health Insurance,,,,N,Y,28064.88,7660.57
Hudson Valley,Orange,3523000,000699,Orange Regional Medical Center,50 to 69,OOS,F,White,Not Span/Hispanic,4,Emergency,Home or Self Care,2017,146,Diverticulosis and diverticulitis,095,OT NON-OR LW GI THER PR,223,Other small & large bowel procedures,06,Diseases and Disorders of the Digestive System,1,Minor,Minor,Surgical,Blue Cross/Blue Shield,,,,N,Y,28175.45,6578.00
Hudson Valley,Orange,3523000,000699,Orange Regional Medical Center,50 to 69,125,F,White,Not Span/Hispanic,9,Emergency,Home or Self Care,2017,145,Intestinal obstruction without hernia,096,OT OR LOW GI THER PRCS,223,Other small & large bowel procedures,06,Diseases and Disorders of the Digestive System,3,Major,Moderate,Surgical,Medicare,Blue Cross/Blue Shield,,,N,Y,62848.91,17301.19
Hudson Valley,Orange,3523000,000699,Orange Regional Medical Center,70 or Older,109,M,White,Not Span/Hispanic,9,Elective,Home w/ Home Health Services,2017,155,Other gastrointestinal disorders,090,EXCISION; LYS PERI ADHS,223,Other small & large bowel procedures,06,Diseases and Disorders of the Digestive System,2,Moderate,Major,Surgical,Medicare,Blue Cross/Blue Shield,Federal/State/Local/VA,,N,N,65308.57,18968.33
New York City,Bronx,7000006,001169,Montefiore Medical Center - Henry & Lucy Moses Div,30 to 49,107,M,Other Race,Not Span/Hispanic,3,Emergency,Home or Self Care,2017,147,Anal and rectal conditions,096,OT OR LOW GI THER PRCS,223,Other small & large bowel procedures,06,Diseases and Disorders of the Digestive System,1,Minor,Minor,Surgical,Private Health Insurance,Blue Cross/Blue Shield,,,N,Y,48817.00,9876.90
New York City,Bronx,7000006,001169,Montefiore Medical Center - Henry & Lucy Moses Div,0 to 17,104,M,Other Race,Spanish/Hispanic,1,Emergency,Home or Self Care,2017,145,Intestinal obstruction without hernia,096,OT OR LOW GI THER PRCS,223,Other small & large bowel procedures,06,Diseases and Disorders of the Digestive System,1,Minor,Minor,Surgical,Medicaid,,,,N,Y,18144.50,4423.17
New York City,Manhattan,7002024,001456,Mount Sinai Hospital,0 to 17,109,M,Black/African American,Not Span/Hispanic,7,Elective,Home or Self Care,2017,155,Other gastrointestinal disorders,096,OT OR LOW GI THER PRCS,223,Other small & large bowel procedures,06,Diseases and Disorders of the Digestive System,2,Moderate,Minor,Surgical,Blue Cross/Blue Shield,Self-Pay,,,N,N,58126.82,42029.62
New York City,Manhattan,7002024,001456,Mount Sinai Hospital,50 to 69,115,F,Black/African American,Not Span/Hispanic,4,Elective,Home w/ Home Health Services,2017,155,Other gastrointestinal disorders,096,OT OR LOW GI THER PRCS,223,Other small & large bowel procedures,06,Diseases and Disorders of the Digestive System,3,Major,Moderate,Surgical,Blue Cross/Blue Shield,Self-Pay,,,N,N,38256.47,14787.38
New York City,Manhattan,7002024,001456,Mount Sinai Hospital,30 to 49,OOS,F,White,Not Span/Hispanic,5,Elective,Home w/ Home Health Services,2017,155,Other gastrointestinal disorders,096,OT OR LOW GI THER PRCS,223,Other small & large bowel procedures,06,Diseases and Disorders of the Digestive System,3,Major,Moderate,Surgical,Private Health Insurance,Self-Pay,,,N,N,43688.44,16558.43
New York City,Manhattan,7002024,001456,Mount Sinai Hospital,70 or Older,OOS,F,White,Not Span/Hispanic,3,Elective,Home or Self Care,2017,155,Other gastrointestinal disorders,096,OT OR LOW GI THER PRCS,223,Other small & large bowel procedures,06,Diseases and Disorders of the Digestive System,2,Moderate,Moderate,Surgical,Medicare,Blue Cross/Blue Shield,Self-Pay,,N,N,32565.31,12834.98
New York City,Manhattan,7002024,001456,Mount Sinai Hospital,18 to 29,117,F,Other Race,Not Span/Hispanic,7,Elective,Home or Self Care,2017,155,Other gastrointestinal disorders,096,OT OR LOW GI THER PRCS,223,Other small & large bowel procedures,06,Diseases and Disorders of the Digestive System,1,Minor,Minor,Surgical,Private Health Insurance,Self-Pay,,,N,N,54955.27,20647.90
New York City,Manhattan,7002024,001456,Mount Sinai Hospital,18 to 29,104,F,Black/African American,Not Span/Hispanic,3,Emergency,Home or Self Care,2017,144,Regional enteritis and ulcerative colitis,092,OTHER BOWEL DX PRCS,223,Other small & large bowel procedures,06,Diseases and Disorders of the Digestive System,3,Major,Moderate,Surgical,Medicaid,Medicaid,Self-Pay,,N,Y,37347.17,13003.64
New York City,Manhattan,7002032,001466,Mount Sinai West,50 to 69,103,M,White,Not Span/Hispanic,7,Elective,Home w/ Home Health Services,2017,143,Abdominal hernia,096,OT OR LOW GI THER PRCS,223,Other small & large bowel procedures,06,Diseases and Disorders of the Digestive System,1,Minor,Minor,Surgical,Private Health Insurance,Medicaid,Self-Pay,,N,N,63649.72,23632.69
New York City,Manhattan,7002032,001466,Mount Sinai West,50 to 69,OOS,F,White,Not Span/Hispanic,2,Elective,Home or Self Care,2017,155,Other gastrointestinal disorders,096,OT OR LOW GI THER PRCS,223,Other small & large bowel procedures,06,Diseases and Disorders of the Digestive System,2,Moderate,Minor,Surgical,Blue Cross/Blue Shield,Self-Pay,,,N,N,31510.74,13246.32
New York City,Bronx,7000006,001169,Montefiore Medical Center - Henry & Lucy Moses Div,50 to 69,104,M,Other Race,Spanish/Hispanic,1,Emergency,Home w/ Home Health Services,2017,147,Anal and rectal conditions,096,OT OR LOW GI THER PRCS,223,Other small & large bowel procedures,06,Diseases and Disorders of the Digestive System,1,Minor,Minor,Surgical,Medicaid,,,,N,Y,30983.37,5963.21
New York City,Kings,7001003,001288,Brooklyn Hospital Center - Downtown Campus,70 or Older,112,M,Black/African American,Unknown,5,Elective,Home w/ Home Health Services,2017,155,Other gastrointestinal disorders,096,OT OR LOW GI THER PRCS,223,Other small & large bowel procedures,06,Diseases and Disorders of the Digestive System,2,Moderate,Minor,Surgical,Medicare,Medicare,Self-Pay,,N,N,87885.29,18691.04
New York City,Kings,7001003,001288,Brooklyn Hospital Center - Downtown Campus,18 to 29,112,M,Black/African American,Not Span/Hispanic,4,Emergency,Home w/ Home Health Services,2017,147,Anal and rectal conditions,096,OT OR LOW GI THER PRCS,223,Other small & large bowel procedures,06,Diseases and Disorders of the Digestive System,1,Minor,Minor,Surgical,Medicare,Medicare,Medicaid,,N,Y,44592.12,9651.03
New York City,Kings,7001037,001320,University Hospital of Brooklyn,50 to 69,112,M,Black/African American,Not Span/Hispanic,2,Emergency,Home or Self Care,2017,147,Anal and rectal conditions,092,OTHER BOWEL DX PRCS,223,Other small & large bowel procedures,06,Diseases and Disorders of the Digestive System,1,Minor,Minor,Surgical,Self-Pay,Self-Pay,,,N,Y,20563.00,13202.83
New York City,Manhattan,7002024,001456,Mount Sinai Hospital,30 to 49,OOS,M,Other Race,Not Span/Hispanic,5,Elective,Home or Self Care,2017,155,Other gastrointestinal disorders,096,OT OR LOW GI THER PRCS,223,Other small & large bowel procedures,06,Diseases and Disorders of the Digestive System,3,Major,Moderate,Surgical,Private Health Insurance,Self-Pay,,,N,N,53075.39,20147.12
New York City,Manhattan,7002024,001456,Mount Sinai Hospital,0 to 17,115,M,White,Not Span/Hispanic,3,Elective,Home or Self Care,2017,155,Other gastrointestinal disorders,096,OT OR LOW GI THER PRCS,223,Other small & large bowel procedures,06,Diseases and Disorders of the Digestive System,2,Moderate,Minor,Surgical,Private Health Insurance,Self-Pay,,,N,N,29189.90,19836.96
New York City,Manhattan,7002024,001456,Mount Sinai Hospital,0 to 17,113,F,Other Race,Not Span/Hispanic,6,Emergency,Home or Self Care,2017,145,Intestinal obstruction without hernia,096,OT OR LOW GI THER PRCS,223,Other small & large bowel procedures,06,Diseases and Disorders of the Digestive System,3,Major,Minor,Surgical,Medicaid,Medicaid,Self-Pay,,N,Y,77961.24,33310.92
Long Island,Nassau,2950002,000528,Nassau University Medical Center,0 to 17,115,F,Other Race,Spanish/Hispanic,2,Emergency,Home or Self Care,2017,142,Appendicitis and other appendiceal conditions,080,APPENDECTOMY,223,Other small & large bowel procedures,06,Diseases and Disorders of the Digestive System,1,Minor,Minor,Surgical,Medicaid,Medicaid,Self-Pay,,N,N,20844.39,16310.17
New York City,Kings,7001021,001306,New York - Presbyterian Brooklyn Methodist Hospital,70 or Older,112,M,White,Not Span/Hispanic,42,Emergency,Skilled Nursing Home,2017,135,Intestinal infection,094,OT OR UP GI THER PRCS,223,Other small & large bowel procedures,06,Diseases and Disorders of the Digestive System,4,Extreme,Extreme,Surgical,Medicare,Medicare,Medicaid,,N,Y,334520.14,126750.50
New York City,Kings,7001021,001306,New York - Presbyterian Brooklyn Methodist Hospital,50 to 69,112,F,Other Race,Not Span/Hispanic,3,Emergency,Home or Self Care,2017,147,Anal and rectal conditions,092,OTHER BOWEL DX PRCS,223,Other small & large bowel procedures,06,Diseases and Disorders of the Digestive System,1,Minor,Minor,Surgical,Private Health Insurance,Self-Pay,,,N,Y,36197.92,13673.24
New York City,Kings,7002002,001324,Mount Sinai Brooklyn,50 to 69,112,F,White,Not Span/Hispanic,3,Emergency,Home or Self Care,2017,153,Gastrointestinal hemorrhage,096,OT OR LOW GI THER PRCS,223,Other small & large bowel procedures,06,Diseases and Disorders of the Digestive System,1,Minor,Minor,Surgical,Private Health Insurance,Self-Pay,,,N,N,42819.81,10265.19
New York City,Manhattan,7002024,001456,Mount Sinai Hospital,50 to 69,117,M,White,Not Span/Hispanic,16,Elective,Home w/ Home Health Services,2017,155,Other gastrointestinal disorders,096,OT OR LOW GI THER PRCS,223,Other small & large bowel procedures,06,Diseases and Disorders of the Digestive System,3,Major,Moderate,Surgical,Medicare,Medicare,Self-Pay,,N,N,132972.62,46568.13
New York City,Manhattan,7002024,001456,Mount Sinai Hospital,30 to 49,117,M,White,Not Span/Hispanic,3,Elective,Home or Self Care,2017,155,Other gastrointestinal disorders,096,OT OR LOW GI THER PRCS,223,Other small & large bowel procedures,06,Diseases and Disorders of the Digestive System,1,Minor,Minor,Surgical,Blue Cross/Blue Shield,Self-Pay,,,N,N,30949.05,12252.63
New York City,Manhattan,7002024,001456,Mount Sinai Hospital,50 to 69,OOS,F,White,Not Span/Hispanic,5,Elective,Home or Self Care,2017,155,Other gastrointestinal disorders,096,OT OR LOW GI THER PRCS,223,Other small & large bowel procedures,06,Diseases and Disorders of the Digestive System,1,Minor,Minor,Surgical,Private Health Insurance,Self-Pay,,,N,N,49784.28,19800.37
New York City,Manhattan,7002024,001456,Mount Sinai Hospital,18 to 29,104,F,Black/African American,Not Span/Hispanic,3,Emergency,Home or Self Care,2017,144,Regional enteritis and ulcerative colitis,096,OT OR LOW GI THER PRCS,223,Other small & large bowel procedures,06,Diseases and Disorders of the Digestive System,1,Minor,Minor,Surgical,Medicaid,Medicaid,Self-Pay,,N,Y,40621.08,14301.13
New York City,Manhattan,7002024,001456,Mount Sinai Hospital,30 to 49,112,M,White,Not Span/Hispanic,1,Emergency,Home or Self Care,2017,147,Anal and rectal conditions,096,OT OR LOW GI THER PRCS,223,Other small & large bowel procedures,06,Diseases and Disorders of the Digestive System,1,Minor,Minor,Surgical,Medicaid,Medicaid,Self-Pay,,N,Y,20515.34,7152.03
New York City,Manhattan,7002054,001458,New York Presbyterian Hospital - New York Weill Cornell Center,50 to 69,112,M,White,Not Span/Hispanic,4,Elective,Home or Self Care,2017,144,Regional enteritis and ulcerative colitis,096,OT OR LOW GI THER PRCS,223,Other small & large bowel procedures,06,Diseases and Disorders of the Digestive System,1,Minor,Minor,Surgical,Blue Cross/Blue Shield,Self-Pay,,,N,N,71602.36,20876.35
New York City,Manhattan,7002054,001458,New York Presbyterian Hospital - New York Weill Cornell Center,30 to 49,OOS,M,White,Not Span/Hispanic,3,Elective,Home or Self Care,2017,155,Other gastrointestinal disorders,096,OT OR LOW GI THER PRCS,223,Other small & large bowel procedures,06,Diseases and Disorders of the Digestive System,1,Minor,Minor,Surgical,Blue Cross/Blue Shield,Self-Pay,,,N,N,48686.45,14564.74
New York City,Manhattan,7002054,001458,New York Presbyterian Hospital - New York Weill Cornell Center,30 to 49,100,F,Other Race,Not Span/Hispanic,6,Emergency,Home or Self Care,2017,153,Gastrointestinal hemorrhage,096,OT OR LOW GI THER PRCS,223,Other small & large bowel procedures,06,Diseases and Disorders of the Digestive System,3,Major,Moderate,Surgical,Private Health Insurance,Self-Pay,,,N,Y,78460.86,20542.05
New York City,Manhattan,7002054,001464,New York Presbyterian Hospital - Columbia Presbyterian Center,30 to 49,104,M,Multi-racial,Spanish/Hispanic,4,Elective,Home or Self Care,2017,155,Other gastrointestinal disorders,099,OT OR GI THER PRCS,223,Other small & large bowel procedures,06,Diseases and Disorders of the Digestive System,1,Minor,Moderate,Surgical,Medicaid,Medicaid,Self-Pay,,N,N,66239.35,24542.11
New York City,Manhattan,7002054,001464,New York Presbyterian Hospital - Columbia Presbyterian Center,50 to 69,100,F,Other Race,Spanish/Hispanic,3,Elective,Home w/ Home Health Services,2017,155,Other gastrointestinal disorders,096,OT OR LOW GI THER PRCS,223,Other small & large bowel procedures,06,Diseases and Disorders of the Digestive System,1,Minor,Minor,Surgical,Medicaid,Medicaid,Self-Pay,,N,N,29727.28,7744.30
New York City,Manhattan,7002054,001464,New York Presbyterian Hospital - Columbia Presbyterian Center,50 to 69,104,M,White,Not Span/Hispanic,2,Elective,Home or Self Care,2017,155,Other gastrointestinal disorders,096,OT OR LOW GI THER PRCS,223,Other small & large bowel procedures,06,Diseases and Disorders of the Digestive System,1,Minor,Minor,Surgical,Medicare,Medicare,Self-Pay,,N,N,20377.54,5206.44
New York City,Manhattan,7002054,001464,New York Presbyterian Hospital - Columbia Presbyterian Center,50 to 69,117,M,White,Not Span/Hispanic,9,Elective,Home w/ Home Health Services,2017,012,Cancer of esophagus,093,OT NON-OR UP GI THER PR,223,Other small & large bowel procedures,06,Diseases and Disorders of the Digestive System,1,Minor,Minor,Surgical,Private Health Insurance,Self-Pay,,,N,N,164009.44,44252.33
New York City,Manhattan,7002054,001464,New York Presbyterian Hospital - Columbia Presbyterian Center,50 to 69,104,F,White,Not Span/Hispanic,3,Elective,Home or Self Care,2017,155,Other gastrointestinal disorders,099,OT OR GI THER PRCS,223,Other small & large bowel procedures,06,Diseases and Disorders of the Digestive System,1,Minor,Minor,Surgical,Medicare,Medicare,Medicaid,,N,N,44929.78,13180.31
New York City,Manhattan,7002054,001464,New York Presbyterian Hospital - Columbia Presbyterian Center,50 to 69,113,F,Multi-racial,Not Span/Hispanic,4,Elective,Home w/ Home Health Services,2017,155,Other gastrointestinal disorders,096,OT OR LOW GI THER PRCS,223,Other small & large bowel procedures,06,Diseases and Disorders of the Digestive System,1,Minor,Minor,Surgical,Medicaid,Medicaid,Self-Pay,,N,N,36678.92,9030.91
New York City,Manhattan,7002054,001464,New York Presbyterian Hospital - Columbia Presbyterian Center,0 to 17,OOS,M,Black/African American,Not Span/Hispanic,15,Elective,Inpatient Rehabilitation Facility,2017,214,Digestive congenital anomalies,096,OT OR LOW GI THER PRCS,223,Other small & large bowel procedures,06,Diseases and Disorders of the Digestive System,2,Moderate,Minor,Surgical,Blue Cross/Blue Shield,Medicaid,Self-Pay,,N,N,180984.16,49567.89
New York City,Manhattan,7002054,001464,New York Presbyterian Hospital - Columbia Presbyterian Center,0 to 17,125,F,White,Not Span/Hispanic,8,Emergency,Home or Self Care,2017,145,Intestinal obstruction without hernia,096,OT OR LOW GI THER PRCS,223,Other small & large bowel procedures,06,Diseases and Disorders of the Digestive System,3,Major,Major,Surgical,Medicaid,Medicaid,Self-Pay,,N,Y,127477.53,55914.85
New York City,Manhattan,7002054,001464,New York Presbyterian Hospital - Columbia Presbyterian Center,50 to 69,105,F,White,Not Span/Hispanic,11,Emergency,Home or Self Care,2017,145,Intestinal obstruction without hernia,096,OT OR LOW GI THER PRCS,223,Other small & large bowel procedures,06,Diseases and Disorders of the Digestive System,3,Major,Moderate,Surgical,Medicare,Blue Cross/Blue Shield,Self-Pay,,N,Y,130769.64,34511.92
New York City,Manhattan,7002054,001464,New York Presbyterian Hospital - Columbia Presbyterian Center,50 to 69,104,F,Multi-racial,Not Span/Hispanic,18,Emergency,Home w/ Home Health Services,2017,145,Intestinal obstruction without hernia,096,OT OR LOW GI THER PRCS,223,Other small & large bowel procedures,06,Diseases and Disorders of the Digestive System,3,Major,Moderate,Surgical,Medicare,Private Health Insurance,Blue Cross/Blue Shield,,N,Y,331164.63,121707.46
New York City,Manhattan,7002054,001464,New York Presbyterian Hospital - Columbia Presbyterian Center,18 to 29,100,M,White,Spanish/Hispanic,3,Emergency,Home or Self Care,2017,142,Appendicitis and other appendiceal conditions,080,APPENDECTOMY,223,Other small & large bowel procedures,06,Diseases and Disorders of the Digestive System,1,Minor,Minor,Surgical,Medicaid,Self-Pay,,,N,Y,33433.61,8241.50
New York City,Manhattan,7002054,001464,New York Presbyterian Hospital - Columbia Presbyterian Center,0 to 17,104,M,Multi-racial,Multi-ethnic,2,Emergency,Home or Self Care,2017,147,Anal and rectal conditions,096,OT OR LOW GI THER PRCS,223,Other small & large bowel procedures,06,Diseases and Disorders of the Digestive System,1,Minor,Minor,Surgical,Medicaid,Medicaid,Self-Pay,,N,Y,19315.01,4826.97
New York City,Manhattan,7002054,003975,New York Presbyterian Hospital - Allen Hospital,50 to 69,100,M,Other Race,Spanish/Hispanic,9,Emergency,Home or Self Care,2017,143,Abdominal hernia,085,INGUINAL/FEMORAL HERNIA,223,Other small & large bowel procedures,06,Diseases and Disorders of the Digestive System,1,Minor,Minor,Surgical,Medicaid,Medicaid,Self-Pay,,N,Y,114851.53,31512.36
New York City,Queens,7003010,001637,New York - Presbyterian/Queens,50 to 69,113,F,Other Race,Not Span/Hispanic,2,Elective,Home or Self Care,2017,155,Other gastrointestinal disorders,096,OT OR LOW GI THER PRCS,223,Other small & large bowel procedures,06,Diseases and Disorders of the Digestive System,1,Minor,Minor,Surgical,Medicaid,Self-Pay,,,N,N,19563.91,7005.78
New York City,Queens,7003010,001637,New York - Presbyterian/Queens,70 or Older,113,F,White,Not Span/Hispanic,2,Elective,Home w/ Home Health Services,2017,155,Other gastrointestinal disorders,096,OT OR LOW GI THER PRCS,223,Other small & large bowel procedures,06,Diseases and Disorders of the Digestive System,2,Moderate,Moderate,Surgical,Medicare,Private Health Insurance,Self-Pay,,N,N,25205.45,9026.44