Hospital Service Area,Hospital County,Operating Certificate Number,Permanent Facility Id,Facility Name,Age Group,Zip Code - 3 digits,Gender,Race,Ethnicity,Length of Stay,Type of Admission,Patient Disposition,Discharge Year,CCS Diagnosis Code,CCS Diagnosis Description,CCS Procedure Code,CCS Procedure Description,APR DRG Code,APR DRG Description,APR MDC Code,APR MDC Description,APR Severity of Illness Code,APR Severity of Illness Description,APR Risk of Mortality,APR Medical Surgical Description,Payment Typology 1,Payment Typology 2,Payment Typology 3,Birth Weight,Abortion Edit Indicator,Emergency Department Indicator,Total Charges,Total Costs
Long Island,Nassau,2908000,000511,NYU Winthrop Hospital,30 to 49,115,F,White,Not Span/Hispanic,4,Elective,Home or Self Care,2017,146,Diverticulosis and diverticulitis,092,OTHER BOWEL DX PRCS,223,Other small & large bowel procedures,06,Diseases and Disorders of the Digestive System,2,Moderate,Minor,Surgical,Private Health Insurance,,,,N,N,58792.19,16352.39
Long Island,Nassau,2908000,000511,NYU Winthrop Hospital,0 to 17,115,F,Black/African American,Not Span/Hispanic,5,Emergency,Home or Self Care,2017,145,Intestinal obstruction without hernia,096,OT OR LOW GI THER PRCS,223,Other small & large bowel procedures,06,Diseases and Disorders of the Digestive System,1,Minor,Minor,Surgical,Medicaid,Medicaid,,,N,Y,53610.81,14543.75
Long Island,Nassau,2908000,000511,NYU Winthrop Hospital,70 or Older,110,F,White,Not Span/Hispanic,13,Emergency,Expired,2017,139,Gastroduodenal ulcer (except hemorrhage),094,OT OR UP GI THER PRCS,223,Other small & large bowel procedures,06,Diseases and Disorders of the Digestive System,4,Extreme,Extreme,Surgical,Medicare,Medicare,,,N,Y,327670.40,55295.21
Long Island,Nassau,2908000,000511,NYU Winthrop Hospital,0 to 17,117,M,White,Not Span/Hispanic,1,Emergency,Home or Self Care,2017,145,Intestinal obstruction without hernia,096,OT OR LOW GI THER PRCS,223,Other small & large bowel procedures,06,Diseases and Disorders of the Digestive System,1,Minor,Minor,Surgical,Private Health Insurance,,,,N,Y,36584.14,9558.33
Long Island,Nassau,2908000,000511,NYU Winthrop Hospital,30 to 49,117,M,White,Not Span/Hispanic,2,Elective,Home w/ Home Health Services,2017,155,Other gastrointestinal disorders,096,OT OR LOW GI THER PRCS,223,Other small & large bowel procedures,06,Diseases and Disorders of the Digestive System,1,Minor,Minor,Surgical,Blue Cross/Blue Shield,,,,N,N,45100.90,13274.65
Long Island,Nassau,2908000,000511,NYU Winthrop Hospital,70 or Older,115,M,White,Not Span/Hispanic,22,Elective,Skilled Nursing Home,2017,155,Other gastrointestinal disorders,222,BLOOD TRANSFUSION,223,Other small & large bowel procedures,06,Diseases and Disorders of the Digestive System,3,Major,Major,Surgical,Medicare,Medicare,,,N,N,304616.51,82431.63
Long Island,Nassau,2908000,000511,NYU Winthrop Hospital,70 or Older,115,F,White,Not Span/Hispanic,2,Elective,Home or Self Care,2017,148,Peritonitis and intestinal abscess,090,EXCISION; LYS PERI ADHS,223,Other small & large bowel procedures,06,Diseases and Disorders of the Digestive System,2,Moderate,Minor,Surgical,Medicare,Medicare,,,N,N,32551.42,10107.44
Long Island,Nassau,2908000,000511,NYU Winthrop Hospital,70 or Older,117,F,White,Unknown,2,Emergency,Skilled Nursing Home,2017,147,Anal and rectal conditions,095,OT NON-OR LW GI THER PR,223,Other small & large bowel procedures,06,Diseases and Disorders of the Digestive System,2,Moderate,Moderate,Surgical,Medicare,Medicare,Medicaid,,N,Y,53436.78,9932.43
Long Island,Nassau,2908000,000511,NYU Winthrop Hospital,50 to 69,115,M,White,Not Span/Hispanic,7,Emergency,Inpatient Rehabilitation Facility,2017,153,Gastrointestinal hemorrhage,096,OT OR LOW GI THER PRCS,223,Other small & large bowel procedures,06,Diseases and Disorders of the Digestive System,2,Moderate,Major,Surgical,Medicaid,Medicaid,,,N,Y,116549.62,24276.31
Long Island,Nassau,2908000,000511,NYU Winthrop Hospital,70 or Older,117,F,White,Not Span/Hispanic,5,Emergency,Home w/ Home Health Services,2017,153,Gastrointestinal hemorrhage,096,OT OR LOW GI THER PRCS,223,Other small & large bowel procedures,06,Diseases and Disorders of the Digestive System,2,Moderate,Moderate,Surgical,Medicare,Medicare,Blue Cross/Blue Shield,,N,Y,71253.94,14830.86
Long Island,Nassau,2908000,000511,NYU Winthrop Hospital,50 to 69,113,F,White,Not Span/Hispanic,3,Emergency,Home or Self Care,2017,153,Gastrointestinal hemorrhage,096,OT OR LOW GI THER PRCS,223,Other small & large bowel procedures,06,Diseases and Disorders of the Digestive System,2,Moderate,Moderate,Surgical,Medicare,Medicare,Private Health Insurance,,N,Y,41871.22,8532.04
Long Island,Nassau,2908000,000511,NYU Winthrop Hospital,50 to 69,117,F,White,Spanish/Hispanic,2,Elective,Home or Self Care,2017,155,Other gastrointestinal disorders,090,EXCISION; LYS PERI ADHS,223,Other small & large bowel procedures,06,Diseases and Disorders of the Digestive System,2,Moderate,Moderate,Surgical,Private Health Insurance,,,,N,N,36740.14,11720.18
Long Island,Nassau,2908000,000511,NYU Winthrop Hospital,50 to 69,110,M,White,Not Span/Hispanic,7,Emergency,Home or Self Care,2017,237,Complication of device; implant or graft,222,BLOOD TRANSFUSION,223,Other small & large bowel procedures,06,Diseases and Disorders of the Digestive System,1,Minor,Moderate,Surgical,Blue Cross/Blue Shield,,,,N,Y,82665.35,18810.42
Long Island,Nassau,2908000,000511,NYU Winthrop Hospital,70 or Older,115,F,White,Not Span/Hispanic,13,Emergency,Home or Self Care,2017,047,Other and unspecified benign neoplasm,096,OT OR LOW GI THER PRCS,223,Other small & large bowel procedures,06,Diseases and Disorders of the Digestive System,3,Major,Major,Surgical,Medicare,Medicare,Medicaid,,N,Y,238047.74,59530.11
Long Island,Nassau,2908000,000511,NYU Winthrop Hospital,0 to 17,117,F,White,Not Span/Hispanic,1,Emergency,Home or Self Care,2017,145,Intestinal obstruction without hernia,096,OT OR LOW GI THER PRCS,223,Other small & large bowel procedures,06,Diseases and Disorders of the Digestive System,1,Minor,Minor,Surgical,Private Health Insurance,,,,N,Y,33150.21,9141.29
Long Island,Nassau,2908000,000511,NYU Winthrop Hospital,70 or Older,114,M,White,Not Span/Hispanic,6,Emergency,Home w/ Home Health Services,2017,244,Other injuries and conditions due to external causes,090,EXCISION; LYS PERI ADHS,223,Other small & large bowel procedures,06,Diseases and Disorders of the Digestive System,3,Major,Major,Surgical,Medicare,Medicare,Private Health Insurance,,N,Y,106029.51,28199.55
Long Island,Nassau,2908000,000511,NYU Winthrop Hospital,18 to 29,115,M,White,Not Span/Hispanic,3,Elective,Home or Self Care,2017,044,Neoplasms of unspecified nature or uncertain behavior,096,OT OR LOW GI THER PRCS,223,Other small & large bowel procedures,06,Diseases and Disorders of the Digestive System,2,Moderate,Minor,Surgical,Private Health Insurance,,,,N,N,36154.95,10546.44
Long Island,Nassau,2908000,000511,NYU Winthrop Hospital,0 to 17,115,M,Other Race,Spanish/Hispanic,9,Emergency,Home or Self Care,2017,145,Intestinal obstruction without hernia,096,OT OR LOW GI THER PRCS,223,Other small & large bowel procedures,06,Diseases and Disorders of the Digestive System,2,Moderate,Minor,Surgical,Medicaid,Medicaid,,,N,Y,98419.44,23133.50
Long Island,Nassau,2908000,000511,NYU Winthrop Hospital,50 to 69,117,M,White,Not Span/Hispanic,5,Emergency,Home w/ Home Health Services,2017,143,Abdominal hernia,096,OT OR LOW GI THER PRCS,223,Other small & large bowel procedures,06,Diseases and Disorders of the Digestive System,2,Moderate,Moderate,Surgical,Medicare,Private Health Insurance,,,N,Y,121805.28,33202.79
Long Island,Nassau,2908000,000511,NYU Winthrop Hospital,0 to 17,115,M,White,Spanish/Hispanic,5,Emergency,Home or Self Care,2017,214,Digestive congenital anomalies,096,OT OR LOW GI THER PRCS,223,Other small & large bowel procedures,06,Diseases and Disorders of the Digestive System,1,Minor,Minor,Surgical,Medicaid,Medicaid,,,N,Y,101647.63,21928.48
Long Island,Nassau,2908000,000511,NYU Winthrop Hospital,50 to 69,OOS,M,White,Not Span/Hispanic,4,Elective,Home or Self Care,2017,155,Other gastrointestinal disorders,096,OT OR LOW GI THER PRCS,223,Other small & large bowel procedures,06,Diseases and Disorders of the Digestive System,1,Minor,Minor,Surgical,Medicare,Medicare,Private Health Insurance,,N,N,54621.58,15888.02
Long Island,Nassau,2908000,000511,NYU Winthrop Hospital,50 to 69,117,M,White,Not Span/Hispanic,6,Emergency,Home or Self Care,2017,141,Other disorders of stomach and duodenum,093,OT NON-OR UP GI THER PR,223,Other small & large bowel procedures,06,Diseases and Disorders of the Digestive System,2,Moderate,Minor,Surgical,Blue Cross/Blue Shield,,,,N,Y,92293.15,18315.97
Long Island,Nassau,2908000,000511,NYU Winthrop Hospital,30 to 49,117,F,White,Not Span/Hispanic,1,Elective,Home or Self Care,2017,047,Other and unspecified benign neoplasm,096,OT OR LOW GI THER PRCS,223,Other small & large bowel procedures,06,Diseases and Disorders of the Digestive System,1,Minor,Minor,Surgical,Blue Cross/Blue Shield,,,,N,N,3338.00,1015.24
Long Island,Nassau,2908000,000511,NYU Winthrop Hospital,50 to 69,115,F,White,Not Span/Hispanic,5,Elective,Skilled Nursing Home,2017,155,Other gastrointestinal disorders,090,EXCISION; LYS PERI ADHS,223,Other small & large bowel procedures,06,Diseases and Disorders of the Digestive System,3,Major,Moderate,Surgical,Medicare,Medicare,Medicaid,,N,N,84773.71,22030.74
Long Island,Nassau,2908000,000511,NYU Winthrop Hospital,50 to 69,117,M,White,Not Span/Hispanic,1,Elective,Home or Self Care,2017,155,Other gastrointestinal disorders,096,OT OR LOW GI THER PRCS,223,Other small & large bowel procedures,06,Diseases and Disorders of the Digestive System,1,Minor,Minor,Surgical,Private Health Insurance,,,,N,N,25875.56,8102.70
Long Island,Nassau,2908000,000511,NYU Winthrop Hospital,70 or Older,115,F,White,Not Span/Hispanic,2,Elective,Home w/ Home Health Services,2017,155,Other gastrointestinal disorders,096,OT OR LOW GI THER PRCS,223,Other small & large bowel procedures,06,Diseases and Disorders of the Digestive System,1,Minor,Minor,Surgical,Medicare,Medicare,Self-Pay,,N,N,29553.36,8733.15
Long Island,Nassau,2908000,000511,NYU Winthrop Hospital,30 to 49,118,F,White,Spanish/Hispanic,27,Emergency,Home w/ Home Health Services,2017,238,Complications of surgical procedures or medical care,096,OT OR LOW GI THER PRCS,223,Other small & large bowel procedures,06,Diseases and Disorders of the Digestive System,4,Extreme,Extreme,Surgical,Federal/State/Local/VA,,,,N,Y,633992.03,126415.73
Long Island,Nassau,2908000,000511,NYU Winthrop Hospital,70 or Older,115,M,White,Not Span/Hispanic,9,Urgent,Expired,2017,145,Intestinal obstruction without hernia,096,OT OR LOW GI THER PRCS,223,Other small & large bowel procedures,06,Diseases and Disorders of the Digestive System,4,Extreme,Extreme,Surgical,Medicare,Medicare,Private Health Insurance,,N,N,283620.01,53778.69
Long Island,Nassau,2908000,000511,NYU Winthrop Hospital,50 to 69,115,F,White,Not Span/Hispanic,2,Elective,Home or Self Care,2017,155,Other gastrointestinal disorders,096,OT OR LOW GI THER PRCS,223,Other small & large bowel procedures,06,Diseases and Disorders of the Digestive System,1,Minor,Minor,Surgical,Blue Cross/Blue Shield,,,,N,N,26096.81,8017.26
Long Island,Nassau,2908000,000511,NYU Winthrop Hospital,50 to 69,115,M,White,Not Span/Hispanic,7,Elective,Home or Self Care,2017,155,Other gastrointestinal disorders,096,OT OR LOW GI THER PRCS,223,Other small & large bowel procedures,06,Diseases and Disorders of the Digestive System,2,Moderate,Moderate,Surgical,Blue Cross/Blue Shield,Medicare,,,N,N,146749.41,41537.07
Long Island,Nassau,2908000,000511,NYU Winthrop Hospital,50 to 69,115,F,Black/African American,Not Span/Hispanic,8,Emergency,Home or Self Care,2017,244,Other injuries and conditions due to external causes,090,EXCISION; LYS PERI ADHS,223,Other small & large bowel procedures,06,Diseases and Disorders of the Digestive System,2,Moderate,Minor,Surgical,Medicare,Medicare,Blue Cross/Blue Shield,,N,Y,111147.01,29906.50
Long Island,Nassau,2908000,000511,NYU Winthrop Hospital,30 to 49,117,F,White,Not Span/Hispanic,4,Emergency,Home w/ Home Health Services,2017,144,Regional enteritis and ulcerative colitis,096,OT OR LOW GI THER PRCS,223,Other small & large bowel procedures,06,Diseases and Disorders of the Digestive System,1,Minor,Moderate,Surgical,Federal/State/Local/VA,Private Health Insurance,,,N,Y,76011.01,20274.26
Long Island,Nassau,2908000,000511,NYU Winthrop Hospital,50 to 69,117,F,Other Race,Not Span/Hispanic,8,Emergency,Home or Self Care,2017,145,Intestinal obstruction without hernia,090,EXCISION; LYS PERI ADHS,223,Other small & large bowel procedures,06,Diseases and Disorders of the Digestive System,2,Moderate,Minor,Surgical,Medicaid,Medicaid,,,N,Y,96799.54,26766.77
Long Island,Nassau,2908000,000511,NYU Winthrop Hospital,30 to 49,117,F,Other Race,Spanish/Hispanic,3,Emergency,Home or Self Care,2017,047,Other and unspecified benign neoplasm,096,OT OR LOW GI THER PRCS,223,Other small & large bowel procedures,06,Diseases and Disorders of the Digestive System,2,Moderate,Minor,Surgical,Private Health Insurance,,,,N,Y,50307.06,13239.94
Long Island,Nassau,2908000,000511,NYU Winthrop Hospital,70 or Older,117,M,White,Not Span/Hispanic,7,Emergency,Home w/ Home Health Services,2017,141,Other disorders of stomach and duodenum,098,OT NON-OR GI THER PRCS,223,Other small & large bowel procedures,06,Diseases and Disorders of the Digestive System,3,Major,Major,Surgical,Medicare,Medicare,,,N,Y,109613.26,27901.59
Long Island,Nassau,2908000,000511,NYU Winthrop Hospital,30 to 49,117,M,Black/African American,Not Span/Hispanic,2,Elective,Home w/ Home Health Services,2017,155,Other gastrointestinal disorders,096,OT OR LOW GI THER PRCS,223,Other small & large bowel procedures,06,Diseases and Disorders of the Digestive System,1,Minor,Minor,Surgical,Private Health Insurance,,,,N,N,55872.37,17934.43
Long Island,Nassau,2908000,000511,NYU Winthrop Hospital,50 to 69,117,F,White,Not Span/Hispanic,30,Elective,Home w/ Home Health Services,2017,155,Other gastrointestinal disorders,096,OT OR LOW GI THER PRCS,223,Other small & large bowel procedures,06,Diseases and Disorders of the Digestive System,3,Major,Moderate,Surgical,Private Health Insurance,,,,N,N,522105.37,143950.28
Long Island,Nassau,2908000,000511,NYU Winthrop Hospital,0 to 17,115,M,White,Not Span/Hispanic,1,Emergency,Home or Self Care,2017,145,Intestinal obstruction without hernia,096,OT OR LOW GI THER PRCS,223,Other small & large bowel procedures,06,Diseases and Disorders of the Digestive System,1,Minor,Minor,Surgical,Private Health Insurance,,,,N,Y,24587.44,5571.31
Long Island,Nassau,2908000,000511,NYU Winthrop Hospital,50 to 69,115,F,White,Not Span/Hispanic,3,Emergency,Home w/ Home Health Services,2017,145,Intestinal obstruction without hernia,096,OT OR LOW GI THER PRCS,223,Other small & large bowel procedures,06,Diseases and Disorders of the Digestive System,1,Minor,Minor,Surgical,Private Health Insurance,,,,N,Y,78113.08,20374.58
Long Island,Nassau,2908000,000511,NYU Winthrop Hospital,50 to 69,115,M,White,Not Span/Hispanic,2,Elective,Home w/ Home Health Services,2017,155,Other gastrointestinal disorders,096,OT OR LOW GI THER PRCS,223,Other small & large bowel procedures,06,Diseases and Disorders of the Digestive System,2,Moderate,Minor,Surgical,Medicare,Medicare,,,N,N,75358.64,23238.34
Long Island,Nassau,2908000,000511,NYU Winthrop Hospital,50 to 69,115,M,White,Spanish/Hispanic,3,Elective,Home w/ Home Health Services,2017,155,Other gastrointestinal disorders,096,OT OR LOW GI THER PRCS,223,Other small & large bowel procedures,06,Diseases and Disorders of the Digestive System,1,Minor,Minor,Surgical,Medicare,Medicare,Self-Pay,,N,N,57087.60,16992.10
Long Island,Nassau,2908000,000511,NYU Winthrop Hospital,70 or Older,110,F,White,Not Span/Hispanic,14,Emergency,Skilled Nursing Home,2017,139,Gastroduodenal ulcer (except hemorrhage),094,OT OR UP GI THER PRCS,223,Other small & large bowel procedures,06,Diseases and Disorders of the Digestive System,3,Major,Major,Surgical,Medicare,Medicare,,,N,Y,235310.20,63723.31
Long Island,Nassau,2908000,000511,NYU Winthrop Hospital,50 to 69,117,F,White,Not Span/Hispanic,3,Emergency,Home or Self Care,2017,143,Abdominal hernia,085,INGUINAL/FEMORAL HERNIA,223,Other small & large bowel procedures,06,Diseases and Disorders of the Digestive System,2,Moderate,Moderate,Surgical,Federal/State/Local/VA,,,,N,Y,61645.11,15755.27
Long Island,Nassau,2908000,000511,NYU Winthrop Hospital,70 or Older,110,M,Other Race,Spanish/Hispanic,7,Emergency,Home w/ Home Health Services,2017,139,Gastroduodenal ulcer (except hemorrhage),094,OT OR UP GI THER PRCS,223,Other small & large bowel procedures,06,Diseases and Disorders of the Digestive System,1,Minor,Minor,Surgical,Medicaid,,,,N,Y,162522.02,42423.68
Long Island,Nassau,2908000,000511,NYU Winthrop Hospital,50 to 69,110,F,White,Not Span/Hispanic,4,Elective,Home w/ Home Health Services,2017,155,Other gastrointestinal disorders,096,OT OR LOW GI THER PRCS,223,Other small & large bowel procedures,06,Diseases and Disorders of the Digestive System,1,Minor,Minor,Surgical,Medicaid,,,,N,N,235702.47,71519.25
Long Island,Nassau,2908000,000511,NYU Winthrop Hospital,50 to 69,113,M,White,Not Span/Hispanic,3,Urgent,Home or Self Care,2017,155,Other gastrointestinal disorders,096,OT OR LOW GI THER PRCS,223,Other small & large bowel procedures,06,Diseases and Disorders of the Digestive System,1,Minor,Minor,Surgical,Blue Cross/Blue Shield,,,,N,N,86690.39,26806.05
Long Island,Nassau,2908000,000511,NYU Winthrop Hospital,70 or Older,115,F,White,Not Span/Hispanic,3,Elective,Home w/ Home Health Services,2017,155,Other gastrointestinal disorders,096,OT OR LOW GI THER PRCS,223,Other small & large bowel procedures,06,Diseases and Disorders of the Digestive System,2,Moderate,Moderate,Surgical,Medicare,Medicare,Self-Pay,,N,N,54073.38,16697.20
Long Island,Nassau,2908000,000511,NYU Winthrop Hospital,50 to 69,115,F,Black/African American,Not Span/Hispanic,3,Elective,Home w/ Home Health Services,2017,155,Other gastrointestinal disorders,096,OT OR LOW GI THER PRCS,223,Other small & large bowel procedures,06,Diseases and Disorders of the Digestive System,2,Moderate,Moderate,Surgical,Medicare,Medicare,Private Health Insurance,,N,N,100402.05,31138.71
Long Island,Nassau,2908000,000511,NYU Winthrop Hospital,0 to 17,115,F,White,Not Span/Hispanic,1,Emergency,Home or Self Care,2017,145,Intestinal obstruction without hernia,096,OT OR LOW GI THER PRCS,223,Other small & large bowel procedures,06,Diseases and Disorders of the Digestive System,1,Minor,Minor,Surgical,Blue Cross/Blue Shield,,,,N,Y,23019.04,5201.28
Long Island,Nassau,2908000,000511,NYU Winthrop Hospital,50 to 69,115,F,White,Not Span/Hispanic,3,Emergency,Home w/ Home Health Services,2017,139,Gastroduodenal ulcer (except hemorrhage),094,OT OR UP GI THER PRCS,223,Other small & large bowel procedures,06,Diseases and Disorders of the Digestive System,1,Minor,Minor,Surgical,Blue Cross/Blue Shield,,,,N,Y,74053.05,18986.86
Long Island,Nassau,2908000,000511,NYU Winthrop Hospital,30 to 49,117,F,White,Not Span/Hispanic,2,Emergency,Home or Self Care,2017,147,Anal and rectal conditions,054,OT VASC CATH; NOT HEART,223,Other small & large bowel procedures,06,Diseases and Disorders of the Digestive System,2,Moderate,Moderate,Surgical,Blue Cross/Blue Shield,Private Health Insurance,,,N,Y,51631.64,13096.14
Long Island,Nassau,2908000,000511,NYU Winthrop Hospital,50 to 69,115,F,White,Not Span/Hispanic,3,Elective,Home w/ Home Health Services,2017,155,Other gastrointestinal disorders,096,OT OR LOW GI THER PRCS,223,Other small & large bowel procedures,06,Diseases and Disorders of the Digestive System,2,Moderate,Minor,Surgical,Blue Cross/Blue Shield,,,,N,N,52305.27,16039.23
Long Island,Nassau,2908000,000511,NYU Winthrop Hospital,70 or Older,115,M,White,Not Span/Hispanic,9,Emergency,Skilled Nursing Home,2017,139,Gastroduodenal ulcer (except hemorrhage),094,OT OR UP GI THER PRCS,223,Other small & large bowel procedures,06,Diseases and Disorders of the Digestive System,3,Major,Major,Surgical,Medicare,Medicare,Blue Cross/Blue Shield,,N,Y,126680.62,31773.38
Long Island,Nassau,2908000,000511,NYU Winthrop Hospital,70 or Older,115,M,Black/African American,Not Span/Hispanic,6,Emergency,Home w/ Home Health Services,2017,155,Other gastrointestinal disorders,222,BLOOD TRANSFUSION,223,Other small & large bowel procedures,06,Diseases and Disorders of the Digestive System,1,Minor,Moderate,Surgical,Medicare,Medicare,Blue Cross/Blue Shield,,N,Y,92629.24,19763.24
Long Island,Nassau,2908000,000511,NYU Winthrop Hospital,30 to 49,117,F,Black/African American,Not Span/Hispanic,10,Emergency,Home w/ Home Health Services,2017,238,Complications of surgical procedures or medical care,096,OT OR LOW GI THER PRCS,223,Other small & large bowel procedures,06,Diseases and Disorders of the Digestive System,4,Extreme,Major,Surgical,Medicaid,Medicaid,,,N,Y,246495.37,69358.24
Long Island,Nassau,2908000,000511,NYU Winthrop Hospital,0 to 17,117,M,White,Spanish/Hispanic,1,Emergency,Home or Self Care,2017,145,Intestinal obstruction without hernia,096,OT OR LOW GI THER PRCS,223,Other small & large bowel procedures,06,Diseases and Disorders of the Digestive System,1,Minor,Minor,Surgical,Medicaid,Medicaid,,,N,Y,17285.03,4250.87
Long Island,Nassau,2908000,000511,NYU Winthrop Hospital,70 or Older,115,M,White,Not Span/Hispanic,3,Elective,Home w/ Home Health Services,2017,155,Other gastrointestinal disorders,096,OT OR LOW GI THER PRCS,223,Other small & large bowel procedures,06,Diseases and Disorders of the Digestive System,1,Minor,Minor,Surgical,Medicare,Medicare,,,N,N,79606.49,24234.75
Long Island,Nassau,2908000,000511,NYU Winthrop Hospital,50 to 69,115,F,White,Not Span/Hispanic,3,Elective,Home or Self Care,2017,155,Other gastrointestinal disorders,096,OT OR LOW GI THER PRCS,223,Other small & large bowel procedures,06,Diseases and Disorders of the Digestive System,1,Minor,Minor,Surgical,Private Health Insurance,,,,N,N,52266.84,16567.62
Long Island,Nassau,2908000,000511,NYU Winthrop Hospital,50 to 69,117,M,White,Not Span/Hispanic,8,Emergency,Home w/ Home Health Services,2017,144,Regional enteritis and ulcerative colitis,117,OT NON-OR THER PRCS; M,223,Other small & large bowel procedures,06,Diseases and Disorders of the Digestive System,1,Minor,Minor,Surgical,Medicaid,,,,N,Y,102137.33,25634.73
Long Island,Nassau,2908000,000511,NYU Winthrop Hospital,30 to 49,112,M,Black/African American,Not Span/Hispanic,6,Emergency,Home or Self Care,2017,234,Crushing injury or internal injury,160,OT THER PRCS ON MUSCLES,223,Other small & large bowel procedures,06,Diseases and Disorders of the Digestive System,4,Extreme,Extreme,Surgical,Private Health Insurance,,,,N,Y,149561.11,42257.39
Long Island,Nassau,2908000,000511,NYU Winthrop Hospital,70 or Older,117,M,White,Not Span/Hispanic,5,Emergency,Home w/ Home Health Services,2017,141,Other disorders of stomach and duodenum,096,OT OR LOW GI THER PRCS,223,Other small & large bowel procedures,06,Diseases and Disorders of the Digestive System,2,Moderate,Moderate,Surgical,Medicare,Medicare,Blue Cross/Blue Shield,,N,Y,144327.00,33302.35
Long Island,Nassau,2908000,000511,NYU Winthrop Hospital,50 to 69,117,F,White,Not Span/Hispanic,6,Emergency,Home or Self Care,2017,142,Appendicitis and other appendiceal conditions,080,APPENDECTOMY,223,Other small & large bowel procedures,06,Diseases and Disorders of the Digestive System,1,Minor,Minor,Surgical,Medicare,Medicare,Blue Cross/Blue Shield,,N,Y,106512.82,26011.57