Hospital Service Area,Hospital County,Operating Certificate Number,Permanent Facility Id,Facility Name,Age Group,Zip Code - 3 digits,Gender,Race,Ethnicity,Length of Stay,Type of Admission,Patient Disposition,Discharge Year,CCS Diagnosis Code,CCS Diagnosis Description,CCS Procedure Code,CCS Procedure Description,APR DRG Code,APR DRG Description,APR MDC Code,APR MDC Description,APR Severity of Illness Code,APR Severity of Illness Description,APR Risk of Mortality,APR Medical Surgical Description,Payment Typology 1,Payment Typology 2,Payment Typology 3,Birth Weight,Abortion Edit Indicator,Emergency Department Indicator,Total Charges,Total Costs
New York City,Kings,7002053,001304,NYU Langone Hospital-Brooklyn,50 to 69,112,F,Black/African American,Not Span/Hispanic,4,Emergency,Home or Self Care,2019,DIG012,INTESTINAL OBSTRUCTION AND ILEUS,GIS028,"LOWER GI THERAPEUTIC PROCEDURES, NEC (OPEN AND LAPAROSCOPIC)",223,OTHER SMALL & LARGE BOWEL PROCEDURES,06,DISEASES AND DISORDERS OF THE DIGESTIVE SYSTEM,2,Moderate,Minor,Surgical,Medicaid,,,,,true,89215.02,21592.93
New York City,Kings,7002053,001304,NYU Langone Hospital-Brooklyn,50 to 69,112,M,Other Race,Unknown,14,Emergency,Home or Self Care,2019,DIG005,GASTRODUODENAL ULCER,GIS021,GI SYSTEM REPAIR (EXCLUDING ANORECTAL),223,OTHER SMALL & LARGE BOWEL PROCEDURES,06,DISEASES AND DISORDERS OF THE DIGESTIVE SYSTEM,4,Extreme,Extreme,Surgical,Medicaid,,,,,true,255520.77,83514.36
New York City,Kings,7002053,001304,NYU Langone Hospital-Brooklyn,18 to 29,112,F,Other Race,Not Span/Hispanic,4,Emergency,Home or Self Care,2019,DIG024,POSTPROCEDURAL OR POSTOPERATIVE DIGESTIVE SYSTEM COMPLICATION,GIS021,GI SYSTEM REPAIR (EXCLUDING ANORECTAL),223,OTHER SMALL & LARGE BOWEL PROCEDURES,06,DISEASES AND DISORDERS OF THE DIGESTIVE SYSTEM,3,Major,Moderate,Surgical,Private Health Insurance,,,,,true,95869.38,25358.48
New York City,Kings,7002053,001304,NYU Langone Hospital-Brooklyn,50 to 69,112,F,White,Not Span/Hispanic,8,Elective,Home w/ Home Health Services,2019,FAC010,OTHER AFTERCARE ENCOUNTER,GIS028,"LOWER GI THERAPEUTIC PROCEDURES, NEC (OPEN AND LAPAROSCOPIC)",223,OTHER SMALL & LARGE BOWEL PROCEDURES,06,DISEASES AND DISORDERS OF THE DIGESTIVE SYSTEM,2,Moderate,Minor,Surgical,Medicare,,,,,false,158321.29,44631.95
New York City,Kings,7002053,001304,NYU Langone Hospital-Brooklyn,50 to 69,112,M,White,Not Span/Hispanic,3,Elective,Home w/ Home Health Services,2019,FAC010,OTHER AFTERCARE ENCOUNTER,GIS028,"LOWER GI THERAPEUTIC PROCEDURES, NEC (OPEN AND LAPAROSCOPIC)",223,OTHER SMALL & LARGE BOWEL PROCEDURES,06,DISEASES AND DISORDERS OF THE DIGESTIVE SYSTEM,1,Minor,Minor,Surgical,Blue Cross/Blue Shield,,,,,false,149185.07,28105.52
New York City,Kings,7002053,001304,NYU Langone Hospital-Brooklyn,30 to 49,112,M,Other Race,Spanish/Hispanic,4,Emergency,Home or Self Care,2019,DIG005,GASTRODUODENAL ULCER,GIS021,GI SYSTEM REPAIR (EXCLUDING ANORECTAL),223,OTHER SMALL & LARGE BOWEL PROCEDURES,06,DISEASES AND DISORDERS OF THE DIGESTIVE SYSTEM,3,Major,Moderate,Surgical,Medicaid,,,,,true,96741.66,22111
New York City,Kings,7002053,001304,NYU Langone Hospital-Brooklyn,30 to 49,112,F,White,Not Span/Hispanic,8,Emergency,Home or Self Care,2019,DIG024,POSTPROCEDURAL OR POSTOPERATIVE DIGESTIVE SYSTEM COMPLICATION,GIS021,GI SYSTEM REPAIR (EXCLUDING ANORECTAL),223,OTHER SMALL & LARGE BOWEL PROCEDURES,06,DISEASES AND DISORDERS OF THE DIGESTIVE SYSTEM,4,Extreme,Extreme,Surgical,Private Health Insurance,,,,,true,192920.25,54370.74
New York City,Kings,7002053,001304,NYU Langone Hospital-Brooklyn,70 or Older,112,F,White,Not Span/Hispanic,4,Elective,Home w/ Home Health Services,2019,FAC010,OTHER AFTERCARE ENCOUNTER,GIS022,GI SYSTEM LYSIS OF ADHESIONS,223,OTHER SMALL & LARGE BOWEL PROCEDURES,06,DISEASES AND DISORDERS OF THE DIGESTIVE SYSTEM,2,Moderate,Minor,Surgical,Private Health Insurance,Medicare,,,,false,158172.61,29263.16
New York City,Kings,7002053,001304,NYU Langone Hospital-Brooklyn,30 to 49,112,M,Other Race,Not Span/Hispanic,1,Emergency,Home or Self Care,2019,DIG009,APPENDICITIS AND OTHER APPENDICEAL CONDITIONS,GIS005,EXPLORATION OF PERITONEAL CAVITY,223,OTHER SMALL & LARGE BOWEL PROCEDURES,06,DISEASES AND DISORDERS OF THE DIGESTIVE SYSTEM,1,Minor,Minor,Surgical,Blue Cross/Blue Shield,,,,,true,85912.52,14670.75
New York City,Kings,7002053,001304,NYU Langone Hospital-Brooklyn,70 or Older,112,M,White,Not Span/Hispanic,6,Emergency,Home or Self Care,2019,DIG012,INTESTINAL OBSTRUCTION AND ILEUS,GIS022,GI SYSTEM LYSIS OF ADHESIONS,223,OTHER SMALL & LARGE BOWEL PROCEDURES,06,DISEASES AND DISORDERS OF THE DIGESTIVE SYSTEM,3,Major,Minor,Surgical,Private Health Insurance,Medicare,,,,true,132446.59,32780.81
New York City,Kings,7002053,001304,NYU Langone Hospital-Brooklyn,30 to 49,112,M,Other Race,Spanish/Hispanic,5,Elective,Home or Self Care,2019,DIG024,POSTPROCEDURAL OR POSTOPERATIVE DIGESTIVE SYSTEM COMPLICATION,GIS025,OTHER GI SYSTEM DEVICE PROCEDURES,223,OTHER SMALL & LARGE BOWEL PROCEDURES,06,DISEASES AND DISORDERS OF THE DIGESTIVE SYSTEM,3,Major,Moderate,Surgical,Medicaid,,,,,false,209769.6,47416.52
New York City,Kings,7002053,001304,NYU Langone Hospital-Brooklyn,70 or Older,112,F,White,Not Span/Hispanic,5,Emergency,Home w/ Home Health Services,2019,DIG016,PERITONITIS AND INTRA-ABDOMINAL ABSCESS,GIS007,GI SYSTEM DRAINAGE (EXCLUDING PARACENTESIS),223,OTHER SMALL & LARGE BOWEL PROCEDURES,06,DISEASES AND DISORDERS OF THE DIGESTIVE SYSTEM,1,Minor,Moderate,Surgical,Medicare,Private Health Insurance,,,,true,51870.72,18645.88
New York City,Kings,7002053,001304,NYU Langone Hospital-Brooklyn,30 to 49,112,M,Black/African American,Not Span/Hispanic,1,Emergency,Home w/ Home Health Services,2019,DIG016,PERITONITIS AND INTRA-ABDOMINAL ABSCESS,GIS007,GI SYSTEM DRAINAGE (EXCLUDING PARACENTESIS),223,OTHER SMALL & LARGE BOWEL PROCEDURES,06,DISEASES AND DISORDERS OF THE DIGESTIVE SYSTEM,1,Minor,Minor,Surgical,Medicaid,,,,,true,39975.82,7866.19
New York City,Kings,7002053,001304,NYU Langone Hospital-Brooklyn,30 to 49,112,M,White,Unknown,4,Emergency,Home or Self Care,2019,DIG005,GASTRODUODENAL ULCER,GIS021,GI SYSTEM REPAIR (EXCLUDING ANORECTAL),223,OTHER SMALL & LARGE BOWEL PROCEDURES,06,DISEASES AND DISORDERS OF THE DIGESTIVE SYSTEM,3,Major,Moderate,Surgical,Medicaid,,,,,true,111137.43,23178.98
New York City,Kings,7002053,001304,NYU Langone Hospital-Brooklyn,70 or Older,112,M,Other Race,Not Span/Hispanic,14,Emergency,Skilled Nursing Home,2019,DIG009,APPENDICITIS AND OTHER APPENDICEAL CONDITIONS,GIS008,APPENDECTOMY,223,OTHER SMALL & LARGE BOWEL PROCEDURES,06,DISEASES AND DISORDERS OF THE DIGESTIVE SYSTEM,4,Extreme,Major,Surgical,Medicare,Medicare,,,,true,219163,57651.84
New York City,Kings,7002053,001304,NYU Langone Hospital-Brooklyn,50 to 69,112,M,White,Not Span/Hispanic,7,Elective,Home w/ Home Health Services,2019,FAC010,OTHER AFTERCARE ENCOUNTER,GIS015,OMENTECTOMY OR PERITONEUM RESECTION,223,OTHER SMALL & LARGE BOWEL PROCEDURES,06,DISEASES AND DISORDERS OF THE DIGESTIVE SYSTEM,2,Moderate,Minor,Surgical,Blue Cross/Blue Shield,,,,,false,183119.45,37144.8
New York City,Kings,7002053,001304,NYU Langone Hospital-Brooklyn,50 to 69,103,M,White,Not Span/Hispanic,4,Emergency,Home or Self Care,2019,DIG005,GASTRODUODENAL ULCER,GIS021,GI SYSTEM REPAIR (EXCLUDING ANORECTAL),223,OTHER SMALL & LARGE BOWEL PROCEDURES,06,DISEASES AND DISORDERS OF THE DIGESTIVE SYSTEM,3,Major,Moderate,Surgical,Private Health Insurance,,,,,true,101076.37,22022.12
New York City,Kings,7002053,001304,NYU Langone Hospital-Brooklyn,70 or Older,112,F,White,Not Span/Hispanic,8,Emergency,Inpatient Rehabilitation Facility,2019,DIG012,INTESTINAL OBSTRUCTION AND ILEUS,GIS026,"UPPER GI THERAPEUTIC PROCEDURES, NEC (OPEN AND LAPAROSCOPIC)",223,OTHER SMALL & LARGE BOWEL PROCEDURES,06,DISEASES AND DISORDERS OF THE DIGESTIVE SYSTEM,3,Major,Major,Surgical,Medicare,Medicare,Medicaid,,,true,176967.71,51527.97
New York City,Kings,7002053,001304,NYU Langone Hospital-Brooklyn,70 or Older,112,M,Other Race,Spanish/Hispanic,17,Emergency,Skilled Nursing Home,2019,DIG005,GASTRODUODENAL ULCER,GIS021,GI SYSTEM REPAIR (EXCLUDING ANORECTAL),223,OTHER SMALL & LARGE BOWEL PROCEDURES,06,DISEASES AND DISORDERS OF THE DIGESTIVE SYSTEM,4,Extreme,Extreme,Surgical,Medicare,,,,,true,450015.51,126346.99
